{"text_format":"1","workbook":"xlsx","n_sheets":15,"sheets":["League Table","XC Results","Club 5K","Parkrun Results","Half Marathon Results","10 Miler Results","10K races","Marathons","Ultra Races","Thunder Run","Herts 10K Runners","Controls Page","Upcoming events","5 Mile Results","Sheet1"],"not_rendered":{"charts":0,"images":1,"macros":1,"external_links":0,"defined_names":14,"comments":0,"pivot_tables":0},"unopened":[],"bounds":{"document_bytes":16777216,"sheet_cells":100000,"rows_first":2000,"rows_last":500,"rows_between":2000,"halvings":0,"cell_chars":16384,"cell_head_chars":4096},"cells_cut":0,"cells_raw":0,"read":"whole","date_system":"1900"}

{"sheet":"League Table","index":0,"n_rows":154,"n_cols":19,"rows_kept":154,"cut":false,"hidden":false,"merged":[[0,8,0,11]]}
[null,null,null,null,null,null,null,null,"Club League 2013"]
[]
[null,"Name","Memberno","Parkrun #","# Events","Gender","Group","Club Rank","Gents Rank","Ladies Rank","Total Points","XC","Parkrun","Club5K","HalfMarathon","Marathon or Ultra","10 Miles","10K","Thunder Run"]
[null,"Andrew Cripps",{"$f":"IFERROR(VLOOKUP(League[[#This Row],[Name]],members,2,FALSE),\"\")","v":212},332519,{"$f":"COUNT(League[[#This Row],[XC]:[Thunder Run]])","v":7},"M",{"$f":"VLOOKUP(League[[#This Row],[Memberno]],Allmembers[],7,FALSE)","v":"MV40"},{"$f":"RANK(League[[#This Row],[Total Points]],League[Total Points])","v":1},{"$f":"IF(League[[#This Row],[Gender]]=\"M\",RANK(League[Total Points],mrank),\"\")","v":1},{"$f":"IF(League[[#This Row],[Gender]]=\"F\",RANK(League[Total Points],wrank),\"\")","v":""},{"$f":"SUM(League[[#This Row],[XC]:[Thunder Run]])","v":519},{"$f":"IFERROR(VLOOKUP(League[[#This Row],[Memberno]],XC[[Mem]:[Total Points]],5,0),\"\")","v":212},{"$f":"IFERROR(VLOOKUP(League[[#This Row],[Parkrun '#]],Parkrun[],7,FALSE),\"\")","v":38},{"$f":"IFERROR(VLOOKUP(League[[#This Row],[Memberno]],Club5k[],5,FALSE),\"\")","v":25},{"$f":"IFERROR(VLOOKUP(League[[#This Row],[Memberno]],Halfmarathon[Mem]:Halfmarathon[Points],4,0),\"\")","v":86},{"$f":"IFERROR(VLOOKUP(League[[#This Row],[Memberno]],Marathon[],4,FALSE),\"\")","v":30},{"$f":"IFERROR(VLOOKUP(League[[#This Row],[Memberno]],Table18[],5,FALSE),\"\")","v":44},{"$f":"IFERROR(VLOOKUP(League[[#This Row],[Memberno]],tenK[[Member '#]:[Total Points]],2,FALSE),\"\")","v":84},{"$f":"IFERROR(VLOOKUP(League[[#This Row],[Memberno]],Thunderrun[],3,FALSE),\"\")","v":""}]
[null,"Andy Jordan",{"$f":"IFERROR(VLOOKUP(League[[#This Row],[Name]],members,2,FALSE),\"\")","v":239},237510,{"$f":"COUNT(League[[#This Row],[XC]:[Thunder Run]])","v":7},"M",{"$f":"VLOOKUP(League[[#This Row],[Memberno]],Allmembers[],7,FALSE)","v":"MV50"},{"$f":"RANK(League[[#This Row],[Total Points]],League[Total Points])","v":2},{"$f":"IF(League[[#This Row],[Gender]]=\"M\",RANK(League[Total Points],mrank),\"\")","v":2},{"$f":"IF(League[[#This Row],[Gender]]=\"F\",RANK(League[Total Points],wrank),\"\")","v":""},{"$f":"SUM(League[[#This Row],[XC]:[Thunder Run]])","v":504},{"$f":"IFERROR(VLOOKUP(League[[#This Row],[Memberno]],XC[[Mem]:[Total Points]],5,0),\"\")","v":172},{"$f":"IFERROR(VLOOKUP(League[[#This Row],[Parkrun '#]],Parkrun[],7,FALSE),\"\")","v":43},{"$f":"IFERROR(VLOOKUP(League[[#This Row],[Memberno]],Club5k[],5,FALSE),\"\")","v":20},{"$f":"IFERROR(VLOOKUP(League[[#This Row],[Memberno]],Halfmarathon[Mem]:Halfmarathon[Points],4,0),\"\")","v":96},{"$f":"IFERROR(VLOOKUP(League[[#This Row],[Memberno]],Marathon[],4,FALSE),\"\")","v":30},{"$f":"IFERROR(VLOOKUP(League[[#This Row],[Memberno]],Table18[],5,FALSE),\"\")","v":49},{"$f":"IFERROR(VLOOKUP(League[[#This Row],[Memberno]],tenK[[Member '#]:[Total Points]],2,FALSE),\"\")","v":94},{"$f":"IFERROR(VLOOKUP(League[[#This Row],[Memberno]],Thunderrun[],3,FALSE),\"\")","v":""}]
[null,"David Green",{"$f":"IFERROR(VLOOKUP(League[[#This Row],[Name]],members,2,FALSE),\"\")","v":73},309770,{"$f":"COUNT(League[[#This Row],[XC]:[Thunder Run]])","v":6},"M",{"$f":"VLOOKUP(League[[#This Row],[Memberno]],Allmembers[],7,FALSE)","v":"MV50"},{"$f":"RANK(League[[#This Row],[Total Points]],League[Total Points])","v":3},{"$f":"IF(League[[#This Row],[Gender]]=\"M\",RANK(League[Total Points],mrank),\"\")","v":3},{"$f":"IF(League[[#This Row],[Gender]]=\"F\",RANK(League[Total Points],wrank),\"\")","v":""},{"$f":"SUM(League[[#This Row],[XC]:[Thunder Run]])","v":501},{"$f":"IFERROR(VLOOKUP(League[[#This Row],[Memberno]],XC[[Mem]:[Total Points]],5,0),\"\")","v":194},{"$f":"IFERROR(VLOOKUP(League[[#This Row],[Parkrun '#]],Parkrun[],7,FALSE),\"\")","v":49},{"$f":"IFERROR(VLOOKUP(League[[#This Row],[Memberno]],Club5k[],5,FALSE),\"\")","v":30},{"$f":"IFERROR(VLOOKUP(League[[#This Row],[Memberno]],Halfmarathon[Mem]:Halfmarathon[Points],4,0),\"\")","v":99},{"$f":"IFERROR(VLOOKUP(League[[#This Row],[Memberno]],Marathon[],4,FALSE),\"\")","v":30},{"$f":"IFERROR(VLOOKUP(League[[#This Row],[Memberno]],Table18[],5,FALSE),\"\")","v":""},{"$f":"IFERROR(VLOOKUP(League[[#This Row],[Memberno]],tenK[[Member '#]:[Total Points]],2,FALSE),\"\")","v":99},{"$f":"IFERROR(VLOOKUP(League[[#This Row],[Memberno]],Thunderrun[],3,FALSE),\"\")","v":""}]
[null,"Jennifer Finlay",{"$f":"IFERROR(VLOOKUP(League[[#This Row],[Name]],members,2,FALSE),\"\")","v":97},141774,{"$f":"COUNT(League[[#This Row],[XC]:[Thunder Run]])","v":7},"F",{"$f":"VLOOKUP(League[[#This Row],[Memberno]],Allmembers[],7,FALSE)","v":"FV35"},{"$f":"RANK(League[[#This Row],[Total Points]],League[Total Points])","v":4},{"$f":"IF(League[[#This Row],[Gender]]=\"M\",RANK(League[Total Points],mrank),\"\")","v":""},{"$f":"IF(League[[#This Row],[Gender]]=\"F\",RANK(League[Total Points],wrank),\"\")","v":1},{"$f":"SUM(League[[#This Row],[XC]:[Thunder Run]])","v":475},{"$f":"IFERROR(VLOOKUP(League[[#This Row],[Memberno]],XC[[Mem]:[Total Points]],5,0),\"\")","v":241},{"$f":"IFERROR(VLOOKUP(League[[#This Row],[Parkrun '#]],Parkrun[],7,FALSE),\"\")","v":49},{"$f":"IFERROR(VLOOKUP(League[[#This Row],[Memberno]],Club5k[],5,FALSE),\"\")","v":10},{"$f":"IFERROR(VLOOKUP(League[[#This Row],[Memberno]],Halfmarathon[Mem]:Halfmarathon[Points],4,0),\"\")","v":48},{"$f":"IFERROR(VLOOKUP(League[[#This Row],[Memberno]],Marathon[],4,FALSE),\"\")","v":30},{"$f":"IFERROR(VLOOKUP(League[[#This Row],[Memberno]],Table18[],5,FALSE),\"\")","v":48},{"$f":"IFERROR(VLOOKUP(League[[#This Row],[Memberno]],tenK[[Member '#]:[Total Points]],2,FALSE),\"\")","v":49},{"$f":"IFERROR(VLOOKUP(League[[#This Row],[Memberno]],Thunderrun[],3,FALSE),\"\")","v":""}]
[null,"Hannah Turner",{"$f":"IFERROR(VLOOKUP(League[[#This Row],[Name]],members,2,FALSE),\"\")","v":54},350062,{"$f":"COUNT(League[[#This Row],[XC]:[Thunder Run]])","v":8},"F",{"$f":"VLOOKUP(League[[#This Row],[Memberno]],Allmembers[],7,FALSE)","v":"FV35"},{"$f":"RANK(League[[#This Row],[Total Points]],League[Total Points])","v":5},{"$f":"IF(League[[#This Row],[Gender]]=\"M\",RANK(League[Total Points],mrank),\"\")","v":""},{"$f":"IF(League[[#This Row],[Gender]]=\"F\",RANK(League[Total Points],wrank),\"\")","v":2},{"$f":"SUM(League[[#This Row],[XC]:[Thunder Run]])","v":464},{"$f":"IFERROR(VLOOKUP(League[[#This Row],[Memberno]],XC[[Mem]:[Total Points]],5,0),\"\")","v":249},{"$f":"IFERROR(VLOOKUP(League[[#This Row],[Parkrun '#]],Parkrun[],7,FALSE),\"\")","v":50},{"$f":"IFERROR(VLOOKUP(League[[#This Row],[Memberno]],Club5k[],5,FALSE),\"\")","v":5},{"$f":"IFERROR(VLOOKUP(League[[#This Row],[Memberno]],Halfmarathon[Mem]:Halfmarathon[Points],4,0),\"\")","v":50},{"$f":"IFERROR(VLOOKUP(League[[#This Row],[Memberno]],Marathon[],4,FALSE),\"\")","v":30},{"$f":"IFERROR(VLOOKUP(League[[#This Row],[Memberno]],Table18[],5,FALSE),\"\")","v":50},{"$f":"IFERROR(VLOOKUP(League[[#This Row],[Memberno]],tenK[[Member '#]:[Total Points]],2,FALSE),\"\")","v":0},{"$f":"IFERROR(VLOOKUP(League[[#This Row],[Memberno]],Thunderrun[],3,FALSE),\"\")","v":30}]
[null,"Louise Crosby",{"$f":"IFERROR(VLOOKUP(League[[#This Row],[Name]],members,2,FALSE),\"\")","v":119},287650,{"$f":"COUNT(League[[#This Row],[XC]:[Thunder Run]])","v":8},"F",{"$f":"VLOOKUP(League[[#This Row],[Memberno]],Allmembers[],7,FALSE)","v":"FV45"},{"$f":"RANK(League[[#This Row],[Total Points]],League[Total Points])","v":6},{"$f":"IF(League[[#This Row],[Gender]]=\"M\",RANK(League[Total Points],mrank),\"\")","v":""},{"$f":"IF(League[[#This Row],[Gender]]=\"F\",RANK(League[Total Points],wrank),\"\")","v":3},{"$f":"SUM(League[[#This Row],[XC]:[Thunder Run]])","v":463},{"$f":"IFERROR(VLOOKUP(League[[#This Row],[Memberno]],XC[[Mem]:[Total Points]],5,0),\"\")","v":181},{"$f":"IFERROR(VLOOKUP(League[[#This Row],[Parkrun '#]],Parkrun[],7,FALSE),\"\")","v":46},{"$f":"IFERROR(VLOOKUP(League[[#This Row],[Memberno]],Club5k[],5,FALSE),\"\")","v":35},{"$f":"IFERROR(VLOOKUP(League[[#This Row],[Memberno]],Halfmarathon[Mem]:Halfmarathon[Points],4,0),\"\")","v":50},{"$f":"IFERROR(VLOOKUP(League[[#This Row],[Memberno]],Marathon[],4,FALSE),\"\")","v":30},{"$f":"IFERROR(VLOOKUP(League[[#This Row],[Memberno]],Table18[],5,FALSE),\"\")","v":45},{"$f":"IFERROR(VLOOKUP(League[[#This Row],[Memberno]],tenK[[Member '#]:[Total Points]],2,FALSE),\"\")","v":46},{"$f":"IFERROR(VLOOKUP(League[[#This Row],[Memberno]],Thunderrun[],3,FALSE),\"\")","v":30}]
[null,"Sarah Chilvers",{"$f":"IFERROR(VLOOKUP(League[[#This Row],[Name]],members,2,FALSE),\"\")","v":257},418961,{"$f":"COUNT(League[[#This Row],[XC]:[Thunder Run]])","v":6},"F",{"$f":"VLOOKUP(League[[#This Row],[Memberno]],Allmembers[],7,FALSE)","v":"FV55"},{"$f":"RANK(League[[#This Row],[Total Points]],League[Total Points])","v":7},{"$f":"IF(League[[#This Row],[Gender]]=\"M\",RANK(League[Total Points],mrank),\"\")","v":""},{"$f":"IF(League[[#This Row],[Gender]]=\"F\",RANK(League[Total Points],wrank),\"\")","v":4},{"$f":"SUM(League[[#This Row],[XC]:[Thunder Run]])","v":450},{"$f":"IFERROR(VLOOKUP(League[[#This Row],[Memberno]],XC[[Mem]:[Total Points]],5,0),\"\")","v":229},{"$f":"IFERROR(VLOOKUP(League[[#This Row],[Parkrun '#]],Parkrun[],7,FALSE),\"\")","v":43},{"$f":"IFERROR(VLOOKUP(League[[#This Row],[Memberno]],Club5k[],5,FALSE),\"\")","v":15},{"$f":"IFERROR(VLOOKUP(League[[#This Row],[Memberno]],Halfmarathon[Mem]:Halfmarathon[Points],4,0),\"\")","v":92},{"$f":"IFERROR(VLOOKUP(League[[#This Row],[Memberno]],Marathon[],4,FALSE),\"\")","v":30},{"$f":"IFERROR(VLOOKUP(League[[#This Row],[Memberno]],Table18[],5,FALSE),\"\")","v":41},{"$f":"IFERROR(VLOOKUP(League[[#This Row],[Memberno]],tenK[[Member '#]:[Total Points]],2,FALSE),\"\")","v":""},{"$f":"IFERROR(VLOOKUP(League[[#This Row],[Memberno]],Thunderrun[],3,FALSE),\"\")","v":""}]
[null,"Georgie Hamilton",12,224770,{"$f":"COUNT(League[[#This Row],[XC]:[Thunder Run]])","v":7},"F",{"$f":"VLOOKUP(League[[#This Row],[Memberno]],Allmembers[],7,FALSE)","v":"FV65"},{"$f":"RANK(League[[#This Row],[Total Points]],League[Total Points])","v":8},{"$f":"IF(League[[#This Row],[Gender]]=\"M\",RANK(League[Total Points],mrank),\"\")","v":""},{"$f":"IF(League[[#This Row],[Gender]]=\"F\",RANK(League[Total Points],wrank),\"\")","v":5},{"$f":"SUM(League[[#This Row],[XC]:[Thunder Run]])","v":449},{"$f":"IFERROR(VLOOKUP(League[[#This Row],[Memberno]],XC[[Mem]:[Total Points]],5,0),\"\")","v":163},{"$f":"IFERROR(VLOOKUP(League[[#This Row],[Parkrun '#]],Parkrun[],7,FALSE),\"\")","v":39},{"$f":"IFERROR(VLOOKUP(League[[#This Row],[Memberno]],Club5k[],5,FALSE),\"\")","v":55},{"$f":"IFERROR(VLOOKUP(League[[#This Row],[Memberno]],Halfmarathon[Mem]:Halfmarathon[Points],4,0),\"\")","v":45},{"$f":"IFERROR(VLOOKUP(League[[#This Row],[Memberno]],Marathon[],4,FALSE),\"\")","v":30},{"$f":"IFERROR(VLOOKUP(League[[#This Row],[Memberno]],Table18[],5,FALSE),\"\")","v":38},{"$f":"IFERROR(VLOOKUP(League[[#This Row],[Memberno]],tenK[[Member '#]:[Total Points]],2,FALSE),\"\")","v":79},{"$f":"IFERROR(VLOOKUP(League[[#This Row],[Memberno]],Thunderrun[],3,FALSE),\"\")","v":""}]
[null,"Simon Speirs",{"$f":"IFERROR(VLOOKUP(League[[#This Row],[Name]],members,2,FALSE),\"\")","v":53},214862,{"$f":"COUNT(League[[#This Row],[XC]:[Thunder Run]])","v":7},"M",{"$f":"VLOOKUP(League[[#This Row],[Memberno]],Allmembers[],7,FALSE)","v":"MV40"},{"$f":"RANK(League[[#This Row],[Total Points]],League[Total Points])","v":9},{"$f":"IF(League[[#This Row],[Gender]]=\"M\",RANK(League[Total Points],mrank),\"\")","v":4},{"$f":"IF(League[[#This Row],[Gender]]=\"F\",RANK(League[Total Points],wrank),\"\")","v":""},{"$f":"SUM(League[[#This Row],[XC]:[Thunder Run]])","v":444},{"$f":"IFERROR(VLOOKUP(League[[#This Row],[Memberno]],XC[[Mem]:[Total Points]],5,0),\"\")","v":249},{"$f":"IFERROR(VLOOKUP(League[[#This Row],[Parkrun '#]],Parkrun[],7,FALSE),\"\")","v":50},{"$f":"IFERROR(VLOOKUP(League[[#This Row],[Memberno]],Club5k[],5,FALSE),\"\")","v":15},{"$f":"IFERROR(VLOOKUP(League[[#This Row],[Memberno]],Halfmarathon[Mem]:Halfmarathon[Points],4,0),\"\")","v":50},{"$f":"IFERROR(VLOOKUP(League[[#This Row],[Memberno]],Marathon[],4,FALSE),\"\")","v":0},{"$f":"IFERROR(VLOOKUP(League[[#This Row],[Memberno]],Table18[],5,FALSE),\"\")","v":""},{"$f":"IFERROR(VLOOKUP(League[[#This Row],[Memberno]],tenK[[Member '#]:[Total Points]],2,FALSE),\"\")","v":50},{"$f":"IFERROR(VLOOKUP(League[[#This Row],[Memberno]],Thunderrun[],3,FALSE),\"\")","v":30}]
[null,"Lee Scott",{"$f":"IFERROR(VLOOKUP(League[[#This Row],[Name]],members,2,FALSE),\"\")","v":57},295914,{"$f":"COUNT(League[[#This Row],[XC]:[Thunder Run]])","v":7},"M",{"$f":"VLOOKUP(League[[#This Row],[Memberno]],Allmembers[],7,FALSE)","v":"MV40"},{"$f":"RANK(League[[#This Row],[Total Points]],League[Total Points])","v":10},{"$f":"IF(League[[#This Row],[Gender]]=\"M\",RANK(League[Total Points],mrank),\"\")","v":5},{"$f":"IF(League[[#This Row],[Gender]]=\"F\",RANK(League[Total Points],wrank),\"\")","v":""},{"$f":"SUM(League[[#This Row],[XC]:[Thunder Run]])","v":435},{"$f":"IFERROR(VLOOKUP(League[[#This Row],[Memberno]],XC[[Mem]:[Total Points]],5,0),\"\")","v":133},{"$f":"IFERROR(VLOOKUP(League[[#This Row],[Parkrun '#]],Parkrun[],7,FALSE),\"\")","v":46},{"$f":"IFERROR(VLOOKUP(League[[#This Row],[Memberno]],Club5k[],5,FALSE),\"\")","v":40},{"$f":"IFERROR(VLOOKUP(League[[#This Row],[Memberno]],Halfmarathon[Mem]:Halfmarathon[Points],4,0),\"\")","v":43},{"$f":"IFERROR(VLOOKUP(League[[#This Row],[Memberno]],Marathon[],4,FALSE),\"\")","v":30},{"$f":"IFERROR(VLOOKUP(League[[#This Row],[Memberno]],Table18[],5,FALSE),\"\")","v":48},{"$f":"IFERROR(VLOOKUP(League[[#This Row],[Memberno]],tenK[[Member '#]:[Total Points]],2,FALSE),\"\")","v":95},{"$f":"IFERROR(VLOOKUP(League[[#This Row],[Memberno]],Thunderrun[],3,FALSE),\"\")","v":""}]
[null,"Joanne Richards",{"$f":"IFERROR(VLOOKUP(League[[#This Row],[Name]],members,2,FALSE),\"\")","v":149},341924,{"$f":"COUNT(League[[#This Row],[XC]:[Thunder Run]])","v":7},"F",{"$f":"VLOOKUP(League[[#This Row],[Memberno]],Allmembers[],7,FALSE)","v":"FV35"},{"$f":"RANK(League[[#This Row],[Total Points]],League[Total Points])","v":11},{"$f":"IF(League[[#This Row],[Gender]]=\"M\",RANK(League[Total Points],mrank),\"\")","v":""},{"$f":"IF(League[[#This Row],[Gender]]=\"F\",RANK(League[Total Points],wrank),\"\")","v":6},{"$f":"SUM(League[[#This Row],[XC]:[Thunder Run]])","v":429},{"$f":"IFERROR(VLOOKUP(League[[#This Row],[Memberno]],XC[[Mem]:[Total Points]],5,0),\"\")","v":176},{"$f":"IFERROR(VLOOKUP(League[[#This Row],[Parkrun '#]],Parkrun[],7,FALSE),\"\")","v":42},{"$f":"IFERROR(VLOOKUP(League[[#This Row],[Memberno]],Club5k[],5,FALSE),\"\")","v":5},{"$f":"IFERROR(VLOOKUP(League[[#This Row],[Memberno]],Halfmarathon[Mem]:Halfmarathon[Points],4,0),\"\")","v":47},{"$f":"IFERROR(VLOOKUP(League[[#This Row],[Memberno]],Marathon[],4,FALSE),\"\")","v":""},{"$f":"IFERROR(VLOOKUP(League[[#This Row],[Memberno]],Table18[],5,FALSE),\"\")","v":42},{"$f":"IFERROR(VLOOKUP(League[[#This Row],[Memberno]],tenK[[Member '#]:[Total Points]],2,FALSE),\"\")","v":87},{"$f":"IFERROR(VLOOKUP(League[[#This Row],[Memberno]],Thunderrun[],3,FALSE),\"\")","v":30}]
[null,"Phil Jacobs",{"$f":"IFERROR(VLOOKUP(League[[#This Row],[Name]],members,2,FALSE),\"\")","v":100},349302,{"$f":"COUNT(League[[#This Row],[XC]:[Thunder Run]])","v":7},"M",{"$f":"VLOOKUP(League[[#This Row],[Memberno]],Allmembers[],7,FALSE)","v":"MV40"},{"$f":"RANK(League[[#This Row],[Total Points]],League[Total Points])","v":12},{"$f":"IF(League[[#This Row],[Gender]]=\"M\",RANK(League[Total Points],mrank),\"\")","v":6},{"$f":"IF(League[[#This Row],[Gender]]=\"F\",RANK(League[Total Points],wrank),\"\")","v":""},{"$f":"SUM(League[[#This Row],[XC]:[Thunder Run]])","v":428},{"$f":"IFERROR(VLOOKUP(League[[#This Row],[Memberno]],XC[[Mem]:[Total Points]],5,0),\"\")","v":213},{"$f":"IFERROR(VLOOKUP(League[[#This Row],[Parkrun '#]],Parkrun[],7,FALSE),\"\")","v":41},{"$f":"IFERROR(VLOOKUP(League[[#This Row],[Memberno]],Club5k[],5,FALSE),\"\")","v":10},{"$f":"IFERROR(VLOOKUP(League[[#This Row],[Memberno]],Halfmarathon[Mem]:Halfmarathon[Points],4,0),\"\")","v":41},{"$f":"IFERROR(VLOOKUP(League[[#This Row],[Memberno]],Marathon[],4,FALSE),\"\")","v":30},{"$f":"IFERROR(VLOOKUP(League[[#This Row],[Memberno]],Table18[],5,FALSE),\"\")","v":50},{"$f":"IFERROR(VLOOKUP(League[[#This Row],[Memberno]],tenK[[Member '#]:[Total Points]],2,FALSE),\"\")","v":43},{"$f":"IFERROR(VLOOKUP(League[[#This Row],[Memberno]],Thunderrun[],3,FALSE),\"\")","v":""}]
[null,"Steve Bowran",{"$f":"IFERROR(VLOOKUP(League[[#This Row],[Name]],members,2,FALSE),\"\")","v":223},406813,{"$f":"COUNT(League[[#This Row],[XC]:[Thunder Run]])","v":6},"M",{"$f":"VLOOKUP(League[[#This Row],[Memberno]],Allmembers[],7,FALSE)","v":"MV40"},{"$f":"RANK(League[[#This Row],[Total Points]],League[Total Points])","v":13},{"$f":"IF(League[[#This Row],[Gender]]=\"M\",RANK(League[Total Points],mrank),\"\")","v":7},{"$f":"IF(League[[#This Row],[Gender]]=\"F\",RANK(League[Total Points],wrank),\"\")","v":""},{"$f":"SUM(League[[#This Row],[XC]:[Thunder Run]])","v":373},{"$f":"IFERROR(VLOOKUP(League[[#This Row],[Memberno]],XC[[Mem]:[Total Points]],5,0),\"\")","v":226},{"$f":"IFERROR(VLOOKUP(League[[#This Row],[Parkrun '#]],Parkrun[],7,FALSE),\"\")","v":39},{"$f":"IFERROR(VLOOKUP(League[[#This Row],[Memberno]],Club5k[],5,FALSE),\"\")","v":20},{"$f":"IFERROR(VLOOKUP(League[[#This Row],[Memberno]],Halfmarathon[Mem]:Halfmarathon[Points],4,0),\"\")","v":40},{"$f":"IFERROR(VLOOKUP(League[[#This Row],[Memberno]],Marathon[],4,FALSE),\"\")","v":30},{"$f":"IFERROR(VLOOKUP(League[[#This Row],[Memberno]],Table18[],5,FALSE),\"\")","v":""},{"$f":"IFERROR(VLOOKUP(League[[#This Row],[Memberno]],tenK[[Member '#]:[Total Points]],2,FALSE),\"\")","v":18},{"$f":"IFERROR(VLOOKUP(League[[#This Row],[Memberno]],Thunderrun[],3,FALSE),\"\")","v":""}]
[null,"Jamie Davies",{"$f":"IFERROR(VLOOKUP(League[[#This Row],[Name]],members,2,FALSE),\"\")","v":240},357345,{"$f":"COUNT(League[[#This Row],[XC]:[Thunder Run]])","v":6},"M",{"$f":"VLOOKUP(League[[#This Row],[Memberno]],Allmembers[],7,FALSE)","v":"MS"},{"$f":"RANK(League[[#This Row],[Total Points]],League[Total Points])","v":14},{"$f":"IF(League[[#This Row],[Gender]]=\"M\",RANK(League[Total Points],mrank),\"\")","v":8},{"$f":"IF(League[[#This Row],[Gender]]=\"F\",RANK(League[Total Points],wrank),\"\")","v":""},{"$f":"SUM(League[[#This Row],[XC]:[Thunder Run]])","v":370},{"$f":"IFERROR(VLOOKUP(League[[#This Row],[Memberno]],XC[[Mem]:[Total Points]],5,0),\"\")","v":156},{"$f":"IFERROR(VLOOKUP(League[[#This Row],[Parkrun '#]],Parkrun[],7,FALSE),\"\")","v":21},{"$f":"IFERROR(VLOOKUP(League[[#This Row],[Memberno]],Club5k[],5,FALSE),\"\")","v":45},{"$f":"IFERROR(VLOOKUP(League[[#This Row],[Memberno]],Halfmarathon[Mem]:Halfmarathon[Points],4,0),\"\")","v":65},{"$f":"IFERROR(VLOOKUP(League[[#This Row],[Memberno]],Marathon[],4,FALSE),\"\")","v":""},{"$f":"IFERROR(VLOOKUP(League[[#This Row],[Memberno]],Table18[],5,FALSE),\"\")","v":34},{"$f":"IFERROR(VLOOKUP(League[[#This Row],[Memberno]],tenK[[Member '#]:[Total Points]],2,FALSE),\"\")","v":49},{"$f":"IFERROR(VLOOKUP(League[[#This Row],[Memberno]],Thunderrun[],3,FALSE),\"\")","v":""}]
[null,"Graham Harper",{"$f":"IFERROR(VLOOKUP(League[[#This Row],[Name]],members,2,FALSE),\"\")","v":39},287478,{"$f":"COUNT(League[[#This Row],[XC]:[Thunder Run]])","v":7},"M",{"$f":"VLOOKUP(League[[#This Row],[Memberno]],Allmembers[],7,FALSE)","v":"MV50"},{"$f":"RANK(League[[#This Row],[Total Points]],League[Total Points])","v":15},{"$f":"IF(League[[#This Row],[Gender]]=\"M\",RANK(League[Total Points],mrank),\"\")","v":9},{"$f":"IF(League[[#This Row],[Gender]]=\"F\",RANK(League[Total Points],wrank),\"\")","v":""},{"$f":"SUM(League[[#This Row],[XC]:[Thunder Run]])","v":368},{"$f":"IFERROR(VLOOKUP(League[[#This Row],[Memberno]],XC[[Mem]:[Total Points]],5,0),\"\")","v":127},{"$f":"IFERROR(VLOOKUP(League[[#This Row],[Parkrun '#]],Parkrun[],7,FALSE),\"\")","v":23},{"$f":"IFERROR(VLOOKUP(League[[#This Row],[Memberno]],Club5k[],5,FALSE),\"\")","v":50},{"$f":"IFERROR(VLOOKUP(League[[#This Row],[Memberno]],Halfmarathon[Mem]:Halfmarathon[Points],4,0),\"\")","v":68},{"$f":"IFERROR(VLOOKUP(League[[#This Row],[Memberno]],Marathon[],4,FALSE),\"\")","v":30},{"$f":"IFERROR(VLOOKUP(League[[#This Row],[Memberno]],Table18[],5,FALSE),\"\")","v":37},{"$f":"IFERROR(VLOOKUP(League[[#This Row],[Memberno]],tenK[[Member '#]:[Total Points]],2,FALSE),\"\")","v":33},{"$f":"IFERROR(VLOOKUP(League[[#This Row],[Memberno]],Thunderrun[],3,FALSE),\"\")","v":""}]
[null,"Richard Johnstone",{"$f":"IFERROR(VLOOKUP(League[[#This Row],[Name]],members,2,FALSE),\"\")","v":122},284465,{"$f":"COUNT(League[[#This Row],[XC]:[Thunder Run]])","v":6},"M",{"$f":"VLOOKUP(League[[#This Row],[Memberno]],Allmembers[],7,FALSE)","v":"MV40"},{"$f":"RANK(League[[#This Row],[Total Points]],League[Total Points])","v":16},{"$f":"IF(League[[#This Row],[Gender]]=\"M\",RANK(League[Total Points],mrank),\"\")","v":10},{"$f":"IF(League[[#This Row],[Gender]]=\"F\",RANK(League[Total Points],wrank),\"\")","v":""},{"$f":"SUM(League[[#This Row],[XC]:[Thunder Run]])","v":347},{"$f":"IFERROR(VLOOKUP(League[[#This Row],[Memberno]],XC[[Mem]:[Total Points]],5,0),\"\")","v":195},{"$f":"IFERROR(VLOOKUP(League[[#This Row],[Parkrun '#]],Parkrun[],7,FALSE),\"\")","v":35},{"$f":"IFERROR(VLOOKUP(League[[#This Row],[Memberno]],Club5k[],5,FALSE),\"\")","v":5},{"$f":"IFERROR(VLOOKUP(League[[#This Row],[Memberno]],Halfmarathon[Mem]:Halfmarathon[Points],4,0),\"\")","v":36},{"$f":"IFERROR(VLOOKUP(League[[#This Row],[Memberno]],Marathon[],4,FALSE),\"\")","v":""},{"$f":"IFERROR(VLOOKUP(League[[#This Row],[Memberno]],Table18[],5,FALSE),\"\")","v":41},{"$f":"IFERROR(VLOOKUP(League[[#This Row],[Memberno]],tenK[[Member '#]:[Total Points]],2,FALSE),\"\")","v":35},{"$f":"IFERROR(VLOOKUP(League[[#This Row],[Memberno]],Thunderrun[],3,FALSE),\"\")","v":""}]
[null,"Elliott Lamb",{"$f":"IFERROR(VLOOKUP(League[[#This Row],[Name]],members,2,FALSE),\"\")","v":110}," ",{"$f":"COUNT(League[[#This Row],[XC]:[Thunder Run]])","v":4},"M",{"$f":"VLOOKUP(League[[#This Row],[Memberno]],Allmembers[],7,FALSE)","v":"MV50"},{"$f":"RANK(League[[#This Row],[Total Points]],League[Total Points])","v":17},{"$f":"IF(League[[#This Row],[Gender]]=\"M\",RANK(League[Total Points],mrank),\"\")","v":11},{"$f":"IF(League[[#This Row],[Gender]]=\"F\",RANK(League[Total Points],wrank),\"\")","v":""},{"$f":"SUM(League[[#This Row],[XC]:[Thunder Run]])","v":345},{"$f":"IFERROR(VLOOKUP(League[[#This Row],[Memberno]],XC[[Mem]:[Total Points]],5,0),\"\")","v":202},{"$f":"IFERROR(VLOOKUP(League[[#This Row],[Parkrun '#]],Parkrun[],7,FALSE),\"\")","v":""},{"$f":"IFERROR(VLOOKUP(League[[#This Row],[Memberno]],Club5k[],5,FALSE),\"\")","v":20},{"$f":"IFERROR(VLOOKUP(League[[#This Row],[Memberno]],Halfmarathon[Mem]:Halfmarathon[Points],4,0),\"\")","v":44},{"$f":"IFERROR(VLOOKUP(League[[#This Row],[Memberno]],Marathon[],4,FALSE),\"\")","v":""},{"$f":"IFERROR(VLOOKUP(League[[#This Row],[Memberno]],Table18[],5,FALSE),\"\")","v":""},{"$f":"IFERROR(VLOOKUP(League[[#This Row],[Memberno]],tenK[[Member '#]:[Total Points]],2,FALSE),\"\")","v":79},{"$f":"IFERROR(VLOOKUP(League[[#This Row],[Memberno]],Thunderrun[],3,FALSE),\"\")","v":""}]
[null,"Sarah Dumbrill",{"$f":"IFERROR(VLOOKUP(League[[#This Row],[Name]],members,2,FALSE),\"\")","v":77},610402,{"$f":"COUNT(League[[#This Row],[XC]:[Thunder Run]])","v":5},"F",{"$f":"VLOOKUP(League[[#This Row],[Memberno]],Allmembers[],7,FALSE)","v":"FV35"},{"$f":"RANK(League[[#This Row],[Total Points]],League[Total Points])","v":18},{"$f":"IF(League[[#This Row],[Gender]]=\"M\",RANK(League[Total Points],mrank),\"\")","v":""},{"$f":"IF(League[[#This Row],[Gender]]=\"F\",RANK(League[Total Points],wrank),\"\")","v":7},{"$f":"SUM(League[[#This Row],[XC]:[Thunder Run]])","v":333},{"$f":"IFERROR(VLOOKUP(League[[#This Row],[Memberno]],XC[[Mem]:[Total Points]],5,0),\"\")","v":95},{"$f":"IFERROR(VLOOKUP(League[[#This Row],[Parkrun '#]],Parkrun[],7,FALSE),\"\")","v":47},{"$f":"IFERROR(VLOOKUP(League[[#This Row],[Memberno]],Club5k[],5,FALSE),\"\")","v":50},{"$f":"IFERROR(VLOOKUP(League[[#This Row],[Memberno]],Halfmarathon[Mem]:Halfmarathon[Points],4,0),\"\")","v":""},{"$f":"IFERROR(VLOOKUP(League[[#This Row],[Memberno]],Marathon[],4,FALSE),\"\")","v":""},{"$f":"IFERROR(VLOOKUP(League[[#This Row],[Memberno]],Table18[],5,FALSE),\"\")","v":46},{"$f":"IFERROR(VLOOKUP(League[[#This Row],[Memberno]],tenK[[Member '#]:[Total Points]],2,FALSE),\"\")","v":95},{"$f":"IFERROR(VLOOKUP(League[[#This Row],[Memberno]],Thunderrun[],3,FALSE),\"\")","v":""}]
[null,"Emily Hooper",{"$f":"IFERROR(VLOOKUP(League[[#This Row],[Name]],members,2,FALSE),\"\")","v":138},318081,{"$f":"COUNT(League[[#This Row],[XC]:[Thunder Run]])","v":7},"F",{"$f":"VLOOKUP(League[[#This Row],[Memberno]],Allmembers[],7,FALSE)","v":"FV35"},{"$f":"RANK(League[[#This Row],[Total Points]],League[Total Points])","v":19},{"$f":"IF(League[[#This Row],[Gender]]=\"M\",RANK(League[Total Points],mrank),\"\")","v":""},{"$f":"IF(League[[#This Row],[Gender]]=\"F\",RANK(League[Total Points],wrank),\"\")","v":8},{"$f":"SUM(League[[#This Row],[XC]:[Thunder Run]])","v":312},{"$f":"IFERROR(VLOOKUP(League[[#This Row],[Memberno]],XC[[Mem]:[Total Points]],5,0),\"\")","v":45},{"$f":"IFERROR(VLOOKUP(League[[#This Row],[Parkrun '#]],Parkrun[],7,FALSE),\"\")","v":45},{"$f":"IFERROR(VLOOKUP(League[[#This Row],[Memberno]],Club5k[],5,FALSE),\"\")","v":5},{"$f":"IFERROR(VLOOKUP(League[[#This Row],[Memberno]],Halfmarathon[Mem]:Halfmarathon[Points],4,0),\"\")","v":48},{"$f":"IFERROR(VLOOKUP(League[[#This Row],[Memberno]],Marathon[],4,FALSE),\"\")","v":""},{"$f":"IFERROR(VLOOKUP(League[[#This Row],[Memberno]],Table18[],5,FALSE),\"\")","v":44},{"$f":"IFERROR(VLOOKUP(League[[#This Row],[Memberno]],tenK[[Member '#]:[Total Points]],2,FALSE),\"\")","v":95},{"$f":"IFERROR(VLOOKUP(League[[#This Row],[Memberno]],Thunderrun[],3,FALSE),\"\")","v":30}]
[null,"Julian Jones",{"$f":"IFERROR(VLOOKUP(League[[#This Row],[Name]],members,2,FALSE),\"\")","v":243},295116,{"$f":"COUNT(League[[#This Row],[XC]:[Thunder Run]])","v":6},"M",{"$f":"VLOOKUP(League[[#This Row],[Memberno]],Allmembers[],7,FALSE)","v":"MV40"},{"$f":"RANK(League[[#This Row],[Total Points]],League[Total Points])","v":19},{"$f":"IF(League[[#This Row],[Gender]]=\"M\",RANK(League[Total Points],mrank),\"\")","v":12},{"$f":"IF(League[[#This Row],[Gender]]=\"F\",RANK(League[Total Points],wrank),\"\")","v":""},{"$f":"SUM(League[[#This Row],[XC]:[Thunder Run]])","v":312},{"$f":"IFERROR(VLOOKUP(League[[#This Row],[Memberno]],XC[[Mem]:[Total Points]],5,0),\"\")","v":123},{"$f":"IFERROR(VLOOKUP(League[[#This Row],[Parkrun '#]],Parkrun[],7,FALSE),\"\")","v":40},{"$f":"IFERROR(VLOOKUP(League[[#This Row],[Memberno]],Club5k[],5,FALSE),\"\")","v":25},{"$f":"IFERROR(VLOOKUP(League[[#This Row],[Memberno]],Halfmarathon[Mem]:Halfmarathon[Points],4,0),\"\")","v":44},{"$f":"IFERROR(VLOOKUP(League[[#This Row],[Memberno]],Marathon[],4,FALSE),\"\")","v":""},{"$f":"IFERROR(VLOOKUP(League[[#This Row],[Memberno]],Table18[],5,FALSE),\"\")","v":38},{"$f":"IFERROR(VLOOKUP(League[[#This Row],[Memberno]],tenK[[Member '#]:[Total Points]],2,FALSE),\"\")","v":42},{"$f":"IFERROR(VLOOKUP(League[[#This Row],[Memberno]],Thunderrun[],3,FALSE),\"\")","v":""}]
[null,"Patrick McGuinness",269,561973,{"$f":"COUNT(League[[#This Row],[XC]:[Thunder Run]])","v":7},"M",{"$f":"VLOOKUP(League[[#This Row],[Memberno]],Allmembers[],7,FALSE)","v":"MV40"},{"$f":"RANK(League[[#This Row],[Total Points]],League[Total Points])","v":19},{"$f":"IF(League[[#This Row],[Gender]]=\"M\",RANK(League[Total Points],mrank),\"\")","v":12},{"$f":"IF(League[[#This Row],[Gender]]=\"F\",RANK(League[Total Points],wrank),\"\")","v":""},{"$f":"SUM(League[[#This Row],[XC]:[Thunder Run]])","v":312},{"$f":"IFERROR(VLOOKUP(League[[#This Row],[Memberno]],XC[[Mem]:[Total Points]],5,0),\"\")","v":39},{"$f":"IFERROR(VLOOKUP(League[[#This Row],[Parkrun '#]],Parkrun[],7,FALSE),\"\")","v":42},{"$f":"IFERROR(VLOOKUP(League[[#This Row],[Memberno]],Club5k[],5,FALSE),\"\")","v":20},{"$f":"IFERROR(VLOOKUP(League[[#This Row],[Memberno]],Halfmarathon[Mem]:Halfmarathon[Points],4,0),\"\")","v":94},{"$f":"IFERROR(VLOOKUP(League[[#This Row],[Memberno]],Marathon[],4,FALSE),\"\")","v":30},{"$f":"IFERROR(VLOOKUP(League[[#This Row],[Memberno]],Table18[],5,FALSE),\"\")","v":47},{"$f":"IFERROR(VLOOKUP(League[[#This Row],[Memberno]],tenK[[Member '#]:[Total Points]],2,FALSE),\"\")","v":40},{"$f":"IFERROR(VLOOKUP(League[[#This Row],[Memberno]],Thunderrun[],3,FALSE),\"\")","v":""}]
[null,"Brian Yates",{"$f":"IFERROR(VLOOKUP(League[[#This Row],[Name]],members,2,FALSE),\"\")","v":120},327723,{"$f":"COUNT(League[[#This Row],[XC]:[Thunder Run]])","v":5},"M",{"$f":"VLOOKUP(League[[#This Row],[Memberno]],Allmembers[],7,FALSE)","v":"MV60"},{"$f":"RANK(League[[#This Row],[Total Points]],League[Total Points])","v":22},{"$f":"IF(League[[#This Row],[Gender]]=\"M\",RANK(League[Total Points],mrank),\"\")","v":14},{"$f":"IF(League[[#This Row],[Gender]]=\"F\",RANK(League[Total Points],wrank),\"\")","v":""},{"$f":"SUM(League[[#This Row],[XC]:[Thunder Run]])","v":306},{"$f":"IFERROR(VLOOKUP(League[[#This Row],[Memberno]],XC[[Mem]:[Total Points]],5,0),\"\")","v":196},{"$f":"IFERROR(VLOOKUP(League[[#This Row],[Parkrun '#]],Parkrun[],7,FALSE),\"\")","v":17},{"$f":"IFERROR(VLOOKUP(League[[#This Row],[Memberno]],Club5k[],5,FALSE),\"\")","v":30},{"$f":"IFERROR(VLOOKUP(League[[#This Row],[Memberno]],Halfmarathon[Mem]:Halfmarathon[Points],4,0),\"\")","v":""},{"$f":"IFERROR(VLOOKUP(League[[#This Row],[Memberno]],Marathon[],4,FALSE),\"\")","v":30},{"$f":"IFERROR(VLOOKUP(League[[#This Row],[Memberno]],Table18[],5,FALSE),\"\")","v":33},{"$f":"IFERROR(VLOOKUP(League[[#This Row],[Memberno]],tenK[[Member '#]:[Total Points]],2,FALSE),\"\")","v":""},{"$f":"IFERROR(VLOOKUP(League[[#This Row],[Memberno]],Thunderrun[],3,FALSE),\"\")","v":""}]
[null,"James Bentall",{"$f":"IFERROR(VLOOKUP(League[[#This Row],[Name]],members,2,FALSE),\"\")","v":141},506127,{"$f":"COUNT(League[[#This Row],[XC]:[Thunder Run]])","v":5},"M",{"$f":"VLOOKUP(League[[#This Row],[Memberno]],Allmembers[],7,FALSE)","v":"MV40"},{"$f":"RANK(League[[#This Row],[Total Points]],League[Total Points])","v":23},{"$f":"IF(League[[#This Row],[Gender]]=\"M\",RANK(League[Total Points],mrank),\"\")","v":15},{"$f":"IF(League[[#This Row],[Gender]]=\"F\",RANK(League[Total Points],wrank),\"\")","v":""},{"$f":"SUM(League[[#This Row],[XC]:[Thunder Run]])","v":298},{"$f":"IFERROR(VLOOKUP(League[[#This Row],[Memberno]],XC[[Mem]:[Total Points]],5,0),\"\")","v":113},{"$f":"IFERROR(VLOOKUP(League[[#This Row],[Parkrun '#]],Parkrun[],7,FALSE),\"\")","v":24},{"$f":"IFERROR(VLOOKUP(League[[#This Row],[Memberno]],Club5k[],5,FALSE),\"\")","v":15},{"$f":"IFERROR(VLOOKUP(League[[#This Row],[Memberno]],Halfmarathon[Mem]:Halfmarathon[Points],4,0),\"\")","v":80},{"$f":"IFERROR(VLOOKUP(League[[#This Row],[Memberno]],Marathon[],4,FALSE),\"\")","v":""},{"$f":"IFERROR(VLOOKUP(League[[#This Row],[Memberno]],Table18[],5,FALSE),\"\")","v":""},{"$f":"IFERROR(VLOOKUP(League[[#This Row],[Memberno]],tenK[[Member '#]:[Total Points]],2,FALSE),\"\")","v":66},{"$f":"IFERROR(VLOOKUP(League[[#This Row],[Memberno]],Thunderrun[],3,FALSE),\"\")","v":""}]
[null,"Darren McGrath",{"$f":"IFERROR(VLOOKUP(League[[#This Row],[Name]],members,2,FALSE),\"\")","v":28},226876,{"$f":"COUNT(League[[#This Row],[XC]:[Thunder Run]])","v":4},"M",{"$f":"VLOOKUP(League[[#This Row],[Memberno]],Allmembers[],7,FALSE)","v":"MV40"},{"$f":"RANK(League[[#This Row],[Total Points]],League[Total Points])","v":24},{"$f":"IF(League[[#This Row],[Gender]]=\"M\",RANK(League[Total Points],mrank),\"\")","v":16},{"$f":"IF(League[[#This Row],[Gender]]=\"F\",RANK(League[Total Points],wrank),\"\")","v":""},{"$f":"SUM(League[[#This Row],[XC]:[Thunder Run]])","v":297},{"$f":"IFERROR(VLOOKUP(League[[#This Row],[Memberno]],XC[[Mem]:[Total Points]],5,0),\"\")","v":177},{"$f":"IFERROR(VLOOKUP(League[[#This Row],[Parkrun '#]],Parkrun[],7,FALSE),\"\")","v":""},{"$f":"IFERROR(VLOOKUP(League[[#This Row],[Memberno]],Club5k[],5,FALSE),\"\")","v":""},{"$f":"IFERROR(VLOOKUP(League[[#This Row],[Memberno]],Halfmarathon[Mem]:Halfmarathon[Points],4,0),\"\")","v":45},{"$f":"IFERROR(VLOOKUP(League[[#This Row],[Memberno]],Marathon[],4,FALSE),\"\")","v":30},{"$f":"IFERROR(VLOOKUP(League[[#This Row],[Memberno]],Table18[],5,FALSE),\"\")","v":45},{"$f":"IFERROR(VLOOKUP(League[[#This Row],[Memberno]],tenK[[Member '#]:[Total Points]],2,FALSE),\"\")","v":""},{"$f":"IFERROR(VLOOKUP(League[[#This Row],[Memberno]],Thunderrun[],3,FALSE),\"\")","v":""}]
[null,"Paul Goodwin",{"$f":"IFERROR(VLOOKUP(League[[#This Row],[Name]],members,2,FALSE),\"\")","v":222},489298,{"$f":"COUNT(League[[#This Row],[XC]:[Thunder Run]])","v":5},"M",{"$f":"VLOOKUP(League[[#This Row],[Memberno]],Allmembers[],7,FALSE)","v":"MS"},{"$f":"RANK(League[[#This Row],[Total Points]],League[Total Points])","v":25},{"$f":"IF(League[[#This Row],[Gender]]=\"M\",RANK(League[Total Points],mrank),\"\")","v":17},{"$f":"IF(League[[#This Row],[Gender]]=\"F\",RANK(League[Total Points],wrank),\"\")","v":""},{"$f":"SUM(League[[#This Row],[XC]:[Thunder Run]])","v":269},{"$f":"IFERROR(VLOOKUP(League[[#This Row],[Memberno]],XC[[Mem]:[Total Points]],5,0),\"\")","v":98},{"$f":"IFERROR(VLOOKUP(League[[#This Row],[Parkrun '#]],Parkrun[],7,FALSE),\"\")","v":47},{"$f":"IFERROR(VLOOKUP(League[[#This Row],[Memberno]],Club5k[],5,FALSE),\"\")","v":""},{"$f":"IFERROR(VLOOKUP(League[[#This Row],[Memberno]],Halfmarathon[Mem]:Halfmarathon[Points],4,0),\"\")","v":48},{"$f":"IFERROR(VLOOKUP(League[[#This Row],[Memberno]],Marathon[],4,FALSE),\"\")","v":30},{"$f":"IFERROR(VLOOKUP(League[[#This Row],[Memberno]],Table18[],5,FALSE),\"\")","v":""},{"$f":"IFERROR(VLOOKUP(League[[#This Row],[Memberno]],tenK[[Member '#]:[Total Points]],2,FALSE),\"\")","v":46},{"$f":"IFERROR(VLOOKUP(League[[#This Row],[Memberno]],Thunderrun[],3,FALSE),\"\")","v":""}]
[null,"Ed Rhodes",231,640951,{"$f":"COUNT(League[[#This Row],[XC]:[Thunder Run]])","v":6},"M",{"$f":"VLOOKUP(League[[#This Row],[Memberno]],Allmembers[],7,FALSE)","v":"MV40"},{"$f":"RANK(League[[#This Row],[Total Points]],League[Total Points])","v":26},{"$f":"IF(League[[#This Row],[Gender]]=\"M\",RANK(League[Total Points],mrank),\"\")","v":18},{"$f":"IF(League[[#This Row],[Gender]]=\"F\",RANK(League[Total Points],wrank),\"\")","v":""},{"$f":"SUM(League[[#This Row],[XC]:[Thunder Run]])","v":268},{"$f":"IFERROR(VLOOKUP(League[[#This Row],[Memberno]],XC[[Mem]:[Total Points]],5,0),\"\")","v":79},{"$f":"IFERROR(VLOOKUP(League[[#This Row],[Parkrun '#]],Parkrun[],7,FALSE),\"\")","v":34},{"$f":"IFERROR(VLOOKUP(League[[#This Row],[Memberno]],Club5k[],5,FALSE),\"\")","v":45},{"$f":"IFERROR(VLOOKUP(League[[#This Row],[Memberno]],Halfmarathon[Mem]:Halfmarathon[Points],4,0),\"\")","v":""},{"$f":"IFERROR(VLOOKUP(League[[#This Row],[Memberno]],Marathon[],4,FALSE),\"\")","v":30},{"$f":"IFERROR(VLOOKUP(League[[#This Row],[Memberno]],Table18[],5,FALSE),\"\")","v":43},{"$f":"IFERROR(VLOOKUP(League[[#This Row],[Memberno]],tenK[[Member '#]:[Total Points]],2,FALSE),\"\")","v":37},{"$f":"IFERROR(VLOOKUP(League[[#This Row],[Memberno]],Thunderrun[],3,FALSE),\"\")","v":""}]
[null,"Andy Wilkins",{"$f":"IFERROR(VLOOKUP(League[[#This Row],[Name]],members,2,FALSE),\"\")","v":107},350198,{"$f":"COUNT(League[[#This Row],[XC]:[Thunder Run]])","v":6},"M",{"$f":"VLOOKUP(League[[#This Row],[Memberno]],Allmembers[],7,FALSE)","v":"MV40"},{"$f":"RANK(League[[#This Row],[Total Points]],League[Total Points])","v":27},{"$f":"IF(League[[#This Row],[Gender]]=\"M\",RANK(League[Total Points],mrank),\"\")","v":19},{"$f":"IF(League[[#This Row],[Gender]]=\"F\",RANK(League[Total Points],wrank),\"\")","v":""},{"$f":"SUM(League[[#This Row],[XC]:[Thunder Run]])","v":264},{"$f":"IFERROR(VLOOKUP(League[[#This Row],[Memberno]],XC[[Mem]:[Total Points]],5,0),\"\")","v":""},{"$f":"IFERROR(VLOOKUP(League[[#This Row],[Parkrun '#]],Parkrun[],7,FALSE),\"\")","v":37},{"$f":"IFERROR(VLOOKUP(League[[#This Row],[Memberno]],Club5k[],5,FALSE),\"\")","v":25},{"$f":"IFERROR(VLOOKUP(League[[#This Row],[Memberno]],Halfmarathon[Mem]:Halfmarathon[Points],4,0),\"\")","v":42},{"$f":"IFERROR(VLOOKUP(League[[#This Row],[Memberno]],Marathon[],4,FALSE),\"\")","v":30},{"$f":"IFERROR(VLOOKUP(League[[#This Row],[Memberno]],Table18[],5,FALSE),\"\")","v":46},{"$f":"IFERROR(VLOOKUP(League[[#This Row],[Memberno]],tenK[[Member '#]:[Total Points]],2,FALSE),\"\")","v":84},{"$f":"IFERROR(VLOOKUP(League[[#This Row],[Memberno]],Thunderrun[],3,FALSE),\"\")","v":""}]
[null,"Philippa O'Donovan",{"$f":"IFERROR(VLOOKUP(League[[#This Row],[Name]],members,2,FALSE),\"\")","v":232},345899,{"$f":"COUNT(League[[#This Row],[XC]:[Thunder Run]])","v":4},"F",{"$f":"VLOOKUP(League[[#This Row],[Memberno]],Allmembers[],7,FALSE)","v":"FS"},{"$f":"RANK(League[[#This Row],[Total Points]],League[Total Points])","v":27},{"$f":"IF(League[[#This Row],[Gender]]=\"M\",RANK(League[Total Points],mrank),\"\")","v":""},{"$f":"IF(League[[#This Row],[Gender]]=\"F\",RANK(League[Total Points],wrank),\"\")","v":9},{"$f":"SUM(League[[#This Row],[XC]:[Thunder Run]])","v":264},{"$f":"IFERROR(VLOOKUP(League[[#This Row],[Memberno]],XC[[Mem]:[Total Points]],5,0),\"\")","v":175},{"$f":"IFERROR(VLOOKUP(League[[#This Row],[Parkrun '#]],Parkrun[],7,FALSE),\"\")","v":44},{"$f":"IFERROR(VLOOKUP(League[[#This Row],[Memberno]],Club5k[],5,FALSE),\"\")","v":15},{"$f":"IFERROR(VLOOKUP(League[[#This Row],[Memberno]],Halfmarathon[Mem]:Halfmarathon[Points],4,0),\"\")","v":""},{"$f":"IFERROR(VLOOKUP(League[[#This Row],[Memberno]],Marathon[],4,FALSE),\"\")","v":""},{"$f":"IFERROR(VLOOKUP(League[[#This Row],[Memberno]],Table18[],5,FALSE),\"\")","v":""},{"$f":"IFERROR(VLOOKUP(League[[#This Row],[Memberno]],tenK[[Member '#]:[Total Points]],2,FALSE),\"\")","v":""},{"$f":"IFERROR(VLOOKUP(League[[#This Row],[Memberno]],Thunderrun[],3,FALSE),\"\")","v":30}]
[null,"Gordon Alexander",{"$f":"IFERROR(VLOOKUP(League[[#This Row],[Name]],members,2,FALSE),\"\")","v":262},462397,{"$f":"COUNT(League[[#This Row],[XC]:[Thunder Run]])","v":4},"M",{"$f":"VLOOKUP(League[[#This Row],[Memberno]],Allmembers[],7,FALSE)","v":"MV40"},{"$f":"RANK(League[[#This Row],[Total Points]],League[Total Points])","v":29},{"$f":"IF(League[[#This Row],[Gender]]=\"M\",RANK(League[Total Points],mrank),\"\")","v":20},{"$f":"IF(League[[#This Row],[Gender]]=\"F\",RANK(League[Total Points],wrank),\"\")","v":""},{"$f":"SUM(League[[#This Row],[XC]:[Thunder Run]])","v":251},{"$f":"IFERROR(VLOOKUP(League[[#This Row],[Memberno]],XC[[Mem]:[Total Points]],5,0),\"\")","v":169},{"$f":"IFERROR(VLOOKUP(League[[#This Row],[Parkrun '#]],Parkrun[],7,FALSE),\"\")","v":36},{"$f":"IFERROR(VLOOKUP(League[[#This Row],[Memberno]],Club5k[],5,FALSE),\"\")","v":5},{"$f":"IFERROR(VLOOKUP(League[[#This Row],[Memberno]],Halfmarathon[Mem]:Halfmarathon[Points],4,0),\"\")","v":""},{"$f":"IFERROR(VLOOKUP(League[[#This Row],[Memberno]],Marathon[],4,FALSE),\"\")","v":""},{"$f":"IFERROR(VLOOKUP(League[[#This Row],[Memberno]],Table18[],5,FALSE),\"\")","v":""},{"$f":"IFERROR(VLOOKUP(League[[#This Row],[Memberno]],tenK[[Member '#]:[Total Points]],2,FALSE),\"\")","v":41},{"$f":"IFERROR(VLOOKUP(League[[#This Row],[Memberno]],Thunderrun[],3,FALSE),\"\")","v":""}]
[null,"Simon Townsend",{"$f":"IFERROR(VLOOKUP(League[[#This Row],[Name]],members,2,FALSE),\"\")","v":208},353174,{"$f":"COUNT(League[[#This Row],[XC]:[Thunder Run]])","v":7},"M",{"$f":"VLOOKUP(League[[#This Row],[Memberno]],Allmembers[],7,FALSE)","v":"MV40"},{"$f":"RANK(League[[#This Row],[Total Points]],League[Total Points])","v":30},{"$f":"IF(League[[#This Row],[Gender]]=\"M\",RANK(League[Total Points],mrank),\"\")","v":21},{"$f":"IF(League[[#This Row],[Gender]]=\"F\",RANK(League[Total Points],wrank),\"\")","v":""},{"$f":"SUM(League[[#This Row],[XC]:[Thunder Run]])","v":246},{"$f":"IFERROR(VLOOKUP(League[[#This Row],[Memberno]],XC[[Mem]:[Total Points]],5,0),\"\")","v":72},{"$f":"IFERROR(VLOOKUP(League[[#This Row],[Parkrun '#]],Parkrun[],7,FALSE),\"\")","v":26},{"$f":"IFERROR(VLOOKUP(League[[#This Row],[Memberno]],Club5k[],5,FALSE),\"\")","v":20},{"$f":"IFERROR(VLOOKUP(League[[#This Row],[Memberno]],Halfmarathon[Mem]:Halfmarathon[Points],4,0),\"\")","v":31},{"$f":"IFERROR(VLOOKUP(League[[#This Row],[Memberno]],Marathon[],4,FALSE),\"\")","v":30},{"$f":"IFERROR(VLOOKUP(League[[#This Row],[Memberno]],Table18[],5,FALSE),\"\")","v":""},{"$f":"IFERROR(VLOOKUP(League[[#This Row],[Memberno]],tenK[[Member '#]:[Total Points]],2,FALSE),\"\")","v":37},{"$f":"IFERROR(VLOOKUP(League[[#This Row],[Memberno]],Thunderrun[],3,FALSE),\"\")","v":30}]
[null,"Paul Savage",{"$f":"IFERROR(VLOOKUP(League[[#This Row],[Name]],members,2,FALSE),\"\")","v":192},637644,{"$f":"COUNT(League[[#This Row],[XC]:[Thunder Run]])","v":3},"M",{"$f":"VLOOKUP(League[[#This Row],[Memberno]],Allmembers[],7,FALSE)","v":"MV40"},{"$f":"RANK(League[[#This Row],[Total Points]],League[Total Points])","v":31},{"$f":"IF(League[[#This Row],[Gender]]=\"M\",RANK(League[Total Points],mrank),\"\")","v":22},{"$f":"IF(League[[#This Row],[Gender]]=\"F\",RANK(League[Total Points],wrank),\"\")","v":""},{"$f":"SUM(League[[#This Row],[XC]:[Thunder Run]])","v":219},{"$f":"IFERROR(VLOOKUP(League[[#This Row],[Memberno]],XC[[Mem]:[Total Points]],5,0),\"\")","v":184},{"$f":"IFERROR(VLOOKUP(League[[#This Row],[Parkrun '#]],Parkrun[],7,FALSE),\"\")","v":30},{"$f":"IFERROR(VLOOKUP(League[[#This Row],[Memberno]],Club5k[],5,FALSE),\"\")","v":5},{"$f":"IFERROR(VLOOKUP(League[[#This Row],[Memberno]],Halfmarathon[Mem]:Halfmarathon[Points],4,0),\"\")","v":""},{"$f":"IFERROR(VLOOKUP(League[[#This Row],[Memberno]],Marathon[],4,FALSE),\"\")","v":""},{"$f":"IFERROR(VLOOKUP(League[[#This Row],[Memberno]],Table18[],5,FALSE),\"\")","v":""},{"$f":"IFERROR(VLOOKUP(League[[#This Row],[Memberno]],tenK[[Member '#]:[Total Points]],2,FALSE),\"\")","v":""},{"$f":"IFERROR(VLOOKUP(League[[#This Row],[Memberno]],Thunderrun[],3,FALSE),\"\")","v":""}]
[null,"Dawn Burr",{"$f":"IFERROR(VLOOKUP(League[[#This Row],[Name]],members,2,FALSE),\"\")","v":140}," ",{"$f":"COUNT(League[[#This Row],[XC]:[Thunder Run]])","v":4},"F",{"$f":"VLOOKUP(League[[#This Row],[Memberno]],Allmembers[],7,FALSE)","v":"FV35"},{"$f":"RANK(League[[#This Row],[Total Points]],League[Total Points])","v":32},{"$f":"IF(League[[#This Row],[Gender]]=\"M\",RANK(League[Total Points],mrank),\"\")","v":""},{"$f":"IF(League[[#This Row],[Gender]]=\"F\",RANK(League[Total Points],wrank),\"\")","v":10},{"$f":"SUM(League[[#This Row],[XC]:[Thunder Run]])","v":218},{"$f":"IFERROR(VLOOKUP(League[[#This Row],[Memberno]],XC[[Mem]:[Total Points]],5,0),\"\")","v":46},{"$f":"IFERROR(VLOOKUP(League[[#This Row],[Parkrun '#]],Parkrun[],7,FALSE),\"\")","v":""},{"$f":"IFERROR(VLOOKUP(League[[#This Row],[Memberno]],Club5k[],5,FALSE),\"\")","v":""},{"$f":"IFERROR(VLOOKUP(League[[#This Row],[Memberno]],Halfmarathon[Mem]:Halfmarathon[Points],4,0),\"\")","v":96},{"$f":"IFERROR(VLOOKUP(League[[#This Row],[Memberno]],Marathon[],4,FALSE),\"\")","v":30},{"$f":"IFERROR(VLOOKUP(League[[#This Row],[Memberno]],Table18[],5,FALSE),\"\")","v":""},{"$f":"IFERROR(VLOOKUP(League[[#This Row],[Memberno]],tenK[[Member '#]:[Total Points]],2,FALSE),\"\")","v":46},{"$f":"IFERROR(VLOOKUP(League[[#This Row],[Memberno]],Thunderrun[],3,FALSE),\"\")","v":""}]
[null,"Ronjon Chakraverty",72,285599,{"$f":"COUNT(League[[#This Row],[XC]:[Thunder Run]])","v":5},"M",{"$f":"VLOOKUP(League[[#This Row],[Memberno]],Allmembers[],7,FALSE)","v":"MV40"},{"$f":"RANK(League[[#This Row],[Total Points]],League[Total Points])","v":33},{"$f":"IF(League[[#This Row],[Gender]]=\"M\",RANK(League[Total Points],mrank),\"\")","v":23},{"$f":"IF(League[[#This Row],[Gender]]=\"F\",RANK(League[Total Points],wrank),\"\")","v":""},{"$f":"SUM(League[[#This Row],[XC]:[Thunder Run]])","v":214},{"$f":"IFERROR(VLOOKUP(League[[#This Row],[Memberno]],XC[[Mem]:[Total Points]],5,0),\"\")","v":69},{"$f":"IFERROR(VLOOKUP(League[[#This Row],[Parkrun '#]],Parkrun[],7,FALSE),\"\")","v":32},{"$f":"IFERROR(VLOOKUP(League[[#This Row],[Memberno]],Club5k[],5,FALSE),\"\")","v":""},{"$f":"IFERROR(VLOOKUP(League[[#This Row],[Memberno]],Halfmarathon[Mem]:Halfmarathon[Points],4,0),\"\")","v":37},{"$f":"IFERROR(VLOOKUP(League[[#This Row],[Memberno]],Marathon[],4,FALSE),\"\")","v":""},{"$f":"IFERROR(VLOOKUP(League[[#This Row],[Memberno]],Table18[],5,FALSE),\"\")","v":42},{"$f":"IFERROR(VLOOKUP(League[[#This Row],[Memberno]],tenK[[Member '#]:[Total Points]],2,FALSE),\"\")","v":34},{"$f":"IFERROR(VLOOKUP(League[[#This Row],[Memberno]],Thunderrun[],3,FALSE),\"\")","v":""}]
[null,"Ammon Piepgrass",311,652961,{"$f":"COUNT(League[[#This Row],[XC]:[Thunder Run]])","v":2},"M",{"$f":"VLOOKUP(League[[#This Row],[Memberno]],Allmembers[],7,FALSE)","v":"MS"},{"$f":"RANK(League[[#This Row],[Total Points]],League[Total Points])","v":34},{"$f":"IF(League[[#This Row],[Gender]]=\"M\",RANK(League[Total Points],mrank),\"\")","v":24},{"$f":"IF(League[[#This Row],[Gender]]=\"F\",RANK(League[Total Points],wrank),\"\")","v":""},{"$f":"SUM(League[[#This Row],[XC]:[Thunder Run]])","v":190},{"$f":"IFERROR(VLOOKUP(League[[#This Row],[Memberno]],XC[[Mem]:[Total Points]],5,0),\"\")","v":142},{"$f":"IFERROR(VLOOKUP(League[[#This Row],[Parkrun '#]],Parkrun[],7,FALSE),\"\")","v":48},{"$f":"IFERROR(VLOOKUP(League[[#This Row],[Memberno]],Club5k[],5,FALSE),\"\")","v":""},{"$f":"IFERROR(VLOOKUP(League[[#This Row],[Memberno]],Halfmarathon[Mem]:Halfmarathon[Points],4,0),\"\")","v":""},{"$f":"IFERROR(VLOOKUP(League[[#This Row],[Memberno]],Marathon[],4,FALSE),\"\")","v":""},{"$f":"IFERROR(VLOOKUP(League[[#This Row],[Memberno]],Table18[],5,FALSE),\"\")","v":""},{"$f":"IFERROR(VLOOKUP(League[[#This Row],[Memberno]],tenK[[Member '#]:[Total Points]],2,FALSE),\"\")","v":""},{"$f":"IFERROR(VLOOKUP(League[[#This Row],[Memberno]],Thunderrun[],3,FALSE),\"\")","v":""}]
[null,"Adrian James",{"$f":"IFERROR(VLOOKUP(League[[#This Row],[Name]],members,2,FALSE),\"\")","v":236}," ",{"$f":"COUNT(League[[#This Row],[XC]:[Thunder Run]])","v":2},"M",{"$f":"VLOOKUP(League[[#This Row],[Memberno]],Allmembers[],7,FALSE)","v":"MV40"},{"$f":"RANK(League[[#This Row],[Total Points]],League[Total Points])","v":35},{"$f":"IF(League[[#This Row],[Gender]]=\"M\",RANK(League[Total Points],mrank),\"\")","v":25},{"$f":"IF(League[[#This Row],[Gender]]=\"F\",RANK(League[Total Points],wrank),\"\")","v":""},{"$f":"SUM(League[[#This Row],[XC]:[Thunder Run]])","v":183},{"$f":"IFERROR(VLOOKUP(League[[#This Row],[Memberno]],XC[[Mem]:[Total Points]],5,0),\"\")","v":139},{"$f":"IFERROR(VLOOKUP(League[[#This Row],[Parkrun '#]],Parkrun[],7,FALSE),\"\")","v":""},{"$f":"IFERROR(VLOOKUP(League[[#This Row],[Memberno]],Club5k[],5,FALSE),\"\")","v":""},{"$f":"IFERROR(VLOOKUP(League[[#This Row],[Memberno]],Halfmarathon[Mem]:Halfmarathon[Points],4,0),\"\")","v":""},{"$f":"IFERROR(VLOOKUP(League[[#This Row],[Memberno]],Marathon[],4,FALSE),\"\")","v":""},{"$f":"IFERROR(VLOOKUP(League[[#This Row],[Memberno]],Table18[],5,FALSE),\"\")","v":""},{"$f":"IFERROR(VLOOKUP(League[[#This Row],[Memberno]],tenK[[Member '#]:[Total Points]],2,FALSE),\"\")","v":44},{"$f":"IFERROR(VLOOKUP(League[[#This Row],[Memberno]],Thunderrun[],3,FALSE),\"\")","v":""}]
[null,"Camilla Davidson",{"$f":"IFERROR(VLOOKUP(League[[#This Row],[Name]],members,2,FALSE),\"\")","v":74}," ",{"$f":"COUNT(League[[#This Row],[XC]:[Thunder Run]])","v":4},"F",{"$f":"VLOOKUP(League[[#This Row],[Memberno]],Allmembers[],7,FALSE)","v":"FS"},{"$f":"RANK(League[[#This Row],[Total Points]],League[Total Points])","v":36},{"$f":"IF(League[[#This Row],[Gender]]=\"M\",RANK(League[Total Points],mrank),\"\")","v":""},{"$f":"IF(League[[#This Row],[Gender]]=\"F\",RANK(League[Total Points],wrank),\"\")","v":11},{"$f":"SUM(League[[#This Row],[XC]:[Thunder Run]])","v":179},{"$f":"IFERROR(VLOOKUP(League[[#This Row],[Memberno]],XC[[Mem]:[Total Points]],5,0),\"\")","v":50},{"$f":"IFERROR(VLOOKUP(League[[#This Row],[Parkrun '#]],Parkrun[],7,FALSE),\"\")","v":""},{"$f":"IFERROR(VLOOKUP(League[[#This Row],[Memberno]],Club5k[],5,FALSE),\"\")","v":""},{"$f":"IFERROR(VLOOKUP(League[[#This Row],[Memberno]],Halfmarathon[Mem]:Halfmarathon[Points],4,0),\"\")","v":""},{"$f":"IFERROR(VLOOKUP(League[[#This Row],[Memberno]],Marathon[],4,FALSE),\"\")","v":30},{"$f":"IFERROR(VLOOKUP(League[[#This Row],[Memberno]],Table18[],5,FALSE),\"\")","v":49},{"$f":"IFERROR(VLOOKUP(League[[#This Row],[Memberno]],tenK[[Member '#]:[Total Points]],2,FALSE),\"\")","v":50},{"$f":"IFERROR(VLOOKUP(League[[#This Row],[Memberno]],Thunderrun[],3,FALSE),\"\")","v":""}]
[null,"Michael Hessey",{"$f":"IFERROR(VLOOKUP(League[[#This Row],[Name]],members,2,FALSE),\"\")","v":32},353523,{"$f":"COUNT(League[[#This Row],[XC]:[Thunder Run]])","v":6},"M",{"$f":"VLOOKUP(League[[#This Row],[Memberno]],Allmembers[],7,FALSE)","v":"MV40"},{"$f":"RANK(League[[#This Row],[Total Points]],League[Total Points])","v":37},{"$f":"IF(League[[#This Row],[Gender]]=\"M\",RANK(League[Total Points],mrank),\"\")","v":26},{"$f":"IF(League[[#This Row],[Gender]]=\"F\",RANK(League[Total Points],wrank),\"\")","v":""},{"$f":"SUM(League[[#This Row],[XC]:[Thunder Run]])","v":170},{"$f":"IFERROR(VLOOKUP(League[[#This Row],[Memberno]],XC[[Mem]:[Total Points]],5,0),\"\")","v":32},{"$f":"IFERROR(VLOOKUP(League[[#This Row],[Parkrun '#]],Parkrun[],7,FALSE),\"\")","v":27},{"$f":"IFERROR(VLOOKUP(League[[#This Row],[Memberno]],Club5k[],5,FALSE),\"\")","v":10},{"$f":"IFERROR(VLOOKUP(League[[#This Row],[Memberno]],Halfmarathon[Mem]:Halfmarathon[Points],4,0),\"\")","v":32},{"$f":"IFERROR(VLOOKUP(League[[#This Row],[Memberno]],Marathon[],4,FALSE),\"\")","v":30},{"$f":"IFERROR(VLOOKUP(League[[#This Row],[Memberno]],Table18[],5,FALSE),\"\")","v":39},{"$f":"IFERROR(VLOOKUP(League[[#This Row],[Memberno]],tenK[[Member '#]:[Total Points]],2,FALSE),\"\")","v":""},{"$f":"IFERROR(VLOOKUP(League[[#This Row],[Memberno]],Thunderrun[],3,FALSE),\"\")","v":""}]
[null,"Paul Geary",{"$f":"IFERROR(VLOOKUP(League[[#This Row],[Name]],members,2,FALSE),\"\")","v":187}," ",{"$f":"COUNT(League[[#This Row],[XC]:[Thunder Run]])","v":4},"M",{"$f":"VLOOKUP(League[[#This Row],[Memberno]],Allmembers[],7,FALSE)","v":"MV40"},{"$f":"RANK(League[[#This Row],[Total Points]],League[Total Points])","v":37},{"$f":"IF(League[[#This Row],[Gender]]=\"M\",RANK(League[Total Points],mrank),\"\")","v":26},{"$f":"IF(League[[#This Row],[Gender]]=\"F\",RANK(League[Total Points],wrank),\"\")","v":""},{"$f":"SUM(League[[#This Row],[XC]:[Thunder Run]])","v":170},{"$f":"IFERROR(VLOOKUP(League[[#This Row],[Memberno]],XC[[Mem]:[Total Points]],5,0),\"\")","v":""},{"$f":"IFERROR(VLOOKUP(League[[#This Row],[Parkrun '#]],Parkrun[],7,FALSE),\"\")","v":""},{"$f":"IFERROR(VLOOKUP(League[[#This Row],[Memberno]],Club5k[],5,FALSE),\"\")","v":5},{"$f":"IFERROR(VLOOKUP(League[[#This Row],[Memberno]],Halfmarathon[Mem]:Halfmarathon[Points],4,0),\"\")","v":72},{"$f":"IFERROR(VLOOKUP(League[[#This Row],[Memberno]],Marathon[],4,FALSE),\"\")","v":30},{"$f":"IFERROR(VLOOKUP(League[[#This Row],[Memberno]],Table18[],5,FALSE),\"\")","v":""},{"$f":"IFERROR(VLOOKUP(League[[#This Row],[Memberno]],tenK[[Member '#]:[Total Points]],2,FALSE),\"\")","v":63},{"$f":"IFERROR(VLOOKUP(League[[#This Row],[Memberno]],Thunderrun[],3,FALSE),\"\")","v":""}]
[null,"Jillian Russell",{"$f":"IFERROR(VLOOKUP(League[[#This Row],[Name]],members,2,FALSE),\"\")","v":44},738705,{"$f":"COUNT(League[[#This Row],[XC]:[Thunder Run]])","v":4},"F",{"$f":"VLOOKUP(League[[#This Row],[Memberno]],Allmembers[],7,FALSE)","v":"FV45"},{"$f":"RANK(League[[#This Row],[Total Points]],League[Total Points])","v":39},{"$f":"IF(League[[#This Row],[Gender]]=\"M\",RANK(League[Total Points],mrank),\"\")","v":""},{"$f":"IF(League[[#This Row],[Gender]]=\"F\",RANK(League[Total Points],wrank),\"\")","v":12},{"$f":"SUM(League[[#This Row],[XC]:[Thunder Run]])","v":167},{"$f":"IFERROR(VLOOKUP(League[[#This Row],[Memberno]],XC[[Mem]:[Total Points]],5,0),\"\")","v":44},{"$f":"IFERROR(VLOOKUP(League[[#This Row],[Parkrun '#]],Parkrun[],7,FALSE),\"\")","v":41},{"$f":"IFERROR(VLOOKUP(League[[#This Row],[Memberno]],Club5k[],5,FALSE),\"\")","v":""},{"$f":"IFERROR(VLOOKUP(League[[#This Row],[Memberno]],Halfmarathon[Mem]:Halfmarathon[Points],4,0),\"\")","v":""},{"$f":"IFERROR(VLOOKUP(League[[#This Row],[Memberno]],Marathon[],4,FALSE),\"\")","v":""},{"$f":"IFERROR(VLOOKUP(League[[#This Row],[Memberno]],Table18[],5,FALSE),\"\")","v":40},{"$f":"IFERROR(VLOOKUP(League[[#This Row],[Memberno]],tenK[[Member '#]:[Total Points]],2,FALSE),\"\")","v":42},{"$f":"IFERROR(VLOOKUP(League[[#This Row],[Memberno]],Thunderrun[],3,FALSE),\"\")","v":""}]
[null,"John Mercer",{"$f":"IFERROR(VLOOKUP(League[[#This Row],[Name]],members,2,FALSE),\"\")","v":252}," ",{"$f":"COUNT(League[[#This Row],[XC]:[Thunder Run]])","v":4},"M",{"$f":"VLOOKUP(League[[#This Row],[Memberno]],Allmembers[],7,FALSE)","v":"MV50"},{"$f":"RANK(League[[#This Row],[Total Points]],League[Total Points])","v":40},{"$f":"IF(League[[#This Row],[Gender]]=\"M\",RANK(League[Total Points],mrank),\"\")","v":28},{"$f":"IF(League[[#This Row],[Gender]]=\"F\",RANK(League[Total Points],wrank),\"\")","v":""},{"$f":"SUM(League[[#This Row],[XC]:[Thunder Run]])","v":161},{"$f":"IFERROR(VLOOKUP(League[[#This Row],[Memberno]],XC[[Mem]:[Total Points]],5,0),\"\")","v":36},{"$f":"IFERROR(VLOOKUP(League[[#This Row],[Parkrun '#]],Parkrun[],7,FALSE),\"\")","v":""},{"$f":"IFERROR(VLOOKUP(League[[#This Row],[Memberno]],Club5k[],5,FALSE),\"\")","v":25},{"$f":"IFERROR(VLOOKUP(League[[#This Row],[Memberno]],Halfmarathon[Mem]:Halfmarathon[Points],4,0),\"\")","v":68},{"$f":"IFERROR(VLOOKUP(League[[#This Row],[Memberno]],Marathon[],4,FALSE),\"\")","v":""},{"$f":"IFERROR(VLOOKUP(League[[#This Row],[Memberno]],Table18[],5,FALSE),\"\")","v":""},{"$f":"IFERROR(VLOOKUP(League[[#This Row],[Memberno]],tenK[[Member '#]:[Total Points]],2,FALSE),\"\")","v":32},{"$f":"IFERROR(VLOOKUP(League[[#This Row],[Memberno]],Thunderrun[],3,FALSE),\"\")","v":""}]
[null,"Chitra Dunn",{"$f":"IFERROR(VLOOKUP(League[[#This Row],[Name]],members,2,FALSE),\"\")","v":238},346162,{"$f":"COUNT(League[[#This Row],[XC]:[Thunder Run]])","v":4},"M",{"$f":"VLOOKUP(League[[#This Row],[Memberno]],Allmembers[],7,FALSE)","v":"MV50"},{"$f":"RANK(League[[#This Row],[Total Points]],League[Total Points])","v":41},{"$f":"IF(League[[#This Row],[Gender]]=\"M\",RANK(League[Total Points],mrank),\"\")","v":29},{"$f":"IF(League[[#This Row],[Gender]]=\"F\",RANK(League[Total Points],wrank),\"\")","v":""},{"$f":"SUM(League[[#This Row],[XC]:[Thunder Run]])","v":159},{"$f":"IFERROR(VLOOKUP(League[[#This Row],[Memberno]],XC[[Mem]:[Total Points]],5,0),\"\")","v":""},{"$f":"IFERROR(VLOOKUP(League[[#This Row],[Parkrun '#]],Parkrun[],7,FALSE),\"\")","v":20},{"$f":"IFERROR(VLOOKUP(League[[#This Row],[Memberno]],Club5k[],5,FALSE),\"\")","v":55},{"$f":"IFERROR(VLOOKUP(League[[#This Row],[Memberno]],Halfmarathon[Mem]:Halfmarathon[Points],4,0),\"\")","v":""},{"$f":"IFERROR(VLOOKUP(League[[#This Row],[Memberno]],Marathon[],4,FALSE),\"\")","v":""},{"$f":"IFERROR(VLOOKUP(League[[#This Row],[Memberno]],Table18[],5,FALSE),\"\")","v":35},{"$f":"IFERROR(VLOOKUP(League[[#This Row],[Memberno]],tenK[[Member '#]:[Total Points]],2,FALSE),\"\")","v":49},{"$f":"IFERROR(VLOOKUP(League[[#This Row],[Memberno]],Thunderrun[],3,FALSE),\"\")","v":""}]
[null,"Richard Moreton",283,646541,{"$f":"COUNT(League[[#This Row],[XC]:[Thunder Run]])","v":4},"M",{"$f":"VLOOKUP(League[[#This Row],[Memberno]],Allmembers[],7,FALSE)","v":"MV40"},{"$f":"RANK(League[[#This Row],[Total Points]],League[Total Points])","v":42},{"$f":"IF(League[[#This Row],[Gender]]=\"M\",RANK(League[Total Points],mrank),\"\")","v":30},{"$f":"IF(League[[#This Row],[Gender]]=\"F\",RANK(League[Total Points],wrank),\"\")","v":""},{"$f":"SUM(League[[#This Row],[XC]:[Thunder Run]])","v":151},{"$f":"IFERROR(VLOOKUP(League[[#This Row],[Memberno]],XC[[Mem]:[Total Points]],5,0),\"\")","v":68},{"$f":"IFERROR(VLOOKUP(League[[#This Row],[Parkrun '#]],Parkrun[],7,FALSE),\"\")","v":28},{"$f":"IFERROR(VLOOKUP(League[[#This Row],[Memberno]],Club5k[],5,FALSE),\"\")","v":30},{"$f":"IFERROR(VLOOKUP(League[[#This Row],[Memberno]],Halfmarathon[Mem]:Halfmarathon[Points],4,0),\"\")","v":""},{"$f":"IFERROR(VLOOKUP(League[[#This Row],[Memberno]],Marathon[],4,FALSE),\"\")","v":""},{"$f":"IFERROR(VLOOKUP(League[[#This Row],[Memberno]],Table18[],5,FALSE),\"\")","v":""},{"$f":"IFERROR(VLOOKUP(League[[#This Row],[Memberno]],tenK[[Member '#]:[Total Points]],2,FALSE),\"\")","v":25},{"$f":"IFERROR(VLOOKUP(League[[#This Row],[Memberno]],Thunderrun[],3,FALSE),\"\")","v":""}]
[null,"Jennifer Cunniff",{"$f":"IFERROR(VLOOKUP(League[[#This Row],[Name]],members,2,FALSE),\"\")","v":225}," ",{"$f":"COUNT(League[[#This Row],[XC]:[Thunder Run]])","v":3},"F",{"$f":"VLOOKUP(League[[#This Row],[Memberno]],Allmembers[],7,FALSE)","v":"FS"},{"$f":"RANK(League[[#This Row],[Total Points]],League[Total Points])","v":43},{"$f":"IF(League[[#This Row],[Gender]]=\"M\",RANK(League[Total Points],mrank),\"\")","v":""},{"$f":"IF(League[[#This Row],[Gender]]=\"F\",RANK(League[Total Points],wrank),\"\")","v":13},{"$f":"SUM(League[[#This Row],[XC]:[Thunder Run]])","v":146},{"$f":"IFERROR(VLOOKUP(League[[#This Row],[Memberno]],XC[[Mem]:[Total Points]],5,0),\"\")","v":86},{"$f":"IFERROR(VLOOKUP(League[[#This Row],[Parkrun '#]],Parkrun[],7,FALSE),\"\")","v":""},{"$f":"IFERROR(VLOOKUP(League[[#This Row],[Memberno]],Club5k[],5,FALSE),\"\")","v":15},{"$f":"IFERROR(VLOOKUP(League[[#This Row],[Memberno]],Halfmarathon[Mem]:Halfmarathon[Points],4,0),\"\")","v":""},{"$f":"IFERROR(VLOOKUP(League[[#This Row],[Memberno]],Marathon[],4,FALSE),\"\")","v":""},{"$f":"IFERROR(VLOOKUP(League[[#This Row],[Memberno]],Table18[],5,FALSE),\"\")","v":""},{"$f":"IFERROR(VLOOKUP(League[[#This Row],[Memberno]],tenK[[Member '#]:[Total Points]],2,FALSE),\"\")","v":45},{"$f":"IFERROR(VLOOKUP(League[[#This Row],[Memberno]],Thunderrun[],3,FALSE),\"\")","v":""}]
[null,"Karen Wilkins",{"$f":"IFERROR(VLOOKUP(League[[#This Row],[Name]],members,2,FALSE),\"\")","v":116},350193,{"$f":"COUNT(League[[#This Row],[XC]:[Thunder Run]])","v":4},"F",{"$f":"VLOOKUP(League[[#This Row],[Memberno]],Allmembers[],7,FALSE)","v":"FV35"},{"$f":"RANK(League[[#This Row],[Total Points]],League[Total Points])","v":44},{"$f":"IF(League[[#This Row],[Gender]]=\"M\",RANK(League[Total Points],mrank),\"\")","v":""},{"$f":"IF(League[[#This Row],[Gender]]=\"F\",RANK(League[Total Points],wrank),\"\")","v":14},{"$f":"SUM(League[[#This Row],[XC]:[Thunder Run]])","v":137},{"$f":"IFERROR(VLOOKUP(League[[#This Row],[Memberno]],XC[[Mem]:[Total Points]],5,0),\"\")","v":48},{"$f":"IFERROR(VLOOKUP(League[[#This Row],[Parkrun '#]],Parkrun[],7,FALSE),\"\")","v":""},{"$f":"IFERROR(VLOOKUP(League[[#This Row],[Memberno]],Club5k[],5,FALSE),\"\")","v":10},{"$f":"IFERROR(VLOOKUP(League[[#This Row],[Memberno]],Halfmarathon[Mem]:Halfmarathon[Points],4,0),\"\")","v":49},{"$f":"IFERROR(VLOOKUP(League[[#This Row],[Memberno]],Marathon[],4,FALSE),\"\")","v":30},{"$f":"IFERROR(VLOOKUP(League[[#This Row],[Memberno]],Table18[],5,FALSE),\"\")","v":""},{"$f":"IFERROR(VLOOKUP(League[[#This Row],[Memberno]],tenK[[Member '#]:[Total Points]],2,FALSE),\"\")","v":""},{"$f":"IFERROR(VLOOKUP(League[[#This Row],[Memberno]],Thunderrun[],3,FALSE),\"\")","v":""}]
[null,"Ian Long",{"$f":"IFERROR(VLOOKUP(League[[#This Row],[Name]],members,2,FALSE),\"\")","v":167},220217,{"$f":"COUNT(League[[#This Row],[XC]:[Thunder Run]])","v":4},"M",{"$f":"VLOOKUP(League[[#This Row],[Memberno]],Allmembers[],7,FALSE)","v":"MV40"},{"$f":"RANK(League[[#This Row],[Total Points]],League[Total Points])","v":45},{"$f":"IF(League[[#This Row],[Gender]]=\"M\",RANK(League[Total Points],mrank),\"\")","v":31},{"$f":"IF(League[[#This Row],[Gender]]=\"F\",RANK(League[Total Points],wrank),\"\")","v":""},{"$f":"SUM(League[[#This Row],[XC]:[Thunder Run]])","v":130},{"$f":"IFERROR(VLOOKUP(League[[#This Row],[Memberno]],XC[[Mem]:[Total Points]],5,0),\"\")","v":70},{"$f":"IFERROR(VLOOKUP(League[[#This Row],[Parkrun '#]],Parkrun[],7,FALSE),\"\")","v":25},{"$f":"IFERROR(VLOOKUP(League[[#This Row],[Memberno]],Club5k[],5,FALSE),\"\")","v":5},{"$f":"IFERROR(VLOOKUP(League[[#This Row],[Memberno]],Halfmarathon[Mem]:Halfmarathon[Points],4,0),\"\")","v":""},{"$f":"IFERROR(VLOOKUP(League[[#This Row],[Memberno]],Marathon[],4,FALSE),\"\")","v":30},{"$f":"IFERROR(VLOOKUP(League[[#This Row],[Memberno]],Table18[],5,FALSE),\"\")","v":""},{"$f":"IFERROR(VLOOKUP(League[[#This Row],[Memberno]],tenK[[Member '#]:[Total Points]],2,FALSE),\"\")","v":""},{"$f":"IFERROR(VLOOKUP(League[[#This Row],[Memberno]],Thunderrun[],3,FALSE),\"\")","v":""}]
[null,"Laura Nathan",{"$f":"IFERROR(VLOOKUP(League[[#This Row],[Name]],members,2,FALSE),\"\")","v":13},287836,{"$f":"COUNT(League[[#This Row],[XC]:[Thunder Run]])","v":4},"F",{"$f":"VLOOKUP(League[[#This Row],[Memberno]],Allmembers[],7,FALSE)","v":"FV35"},{"$f":"RANK(League[[#This Row],[Total Points]],League[Total Points])","v":46},{"$f":"IF(League[[#This Row],[Gender]]=\"M\",RANK(League[Total Points],mrank),\"\")","v":""},{"$f":"IF(League[[#This Row],[Gender]]=\"F\",RANK(League[Total Points],wrank),\"\")","v":15},{"$f":"SUM(League[[#This Row],[XC]:[Thunder Run]])","v":128},{"$f":"IFERROR(VLOOKUP(League[[#This Row],[Memberno]],XC[[Mem]:[Total Points]],5,0),\"\")","v":45},{"$f":"IFERROR(VLOOKUP(League[[#This Row],[Parkrun '#]],Parkrun[],7,FALSE),\"\")","v":""},{"$f":"IFERROR(VLOOKUP(League[[#This Row],[Memberno]],Club5k[],5,FALSE),\"\")","v":10},{"$f":"IFERROR(VLOOKUP(League[[#This Row],[Memberno]],Halfmarathon[Mem]:Halfmarathon[Points],4,0),\"\")","v":""},{"$f":"IFERROR(VLOOKUP(League[[#This Row],[Memberno]],Marathon[],4,FALSE),\"\")","v":30},{"$f":"IFERROR(VLOOKUP(League[[#This Row],[Memberno]],Table18[],5,FALSE),\"\")","v":""},{"$f":"IFERROR(VLOOKUP(League[[#This Row],[Memberno]],tenK[[Member '#]:[Total Points]],2,FALSE),\"\")","v":43},{"$f":"IFERROR(VLOOKUP(League[[#This Row],[Memberno]],Thunderrun[],3,FALSE),\"\")","v":""}]
[null,"John Rowlands",{"$f":"IFERROR(VLOOKUP(League[[#This Row],[Name]],members,2,FALSE),\"\")","v":185},248706,{"$f":"COUNT(League[[#This Row],[XC]:[Thunder Run]])","v":5},"M",{"$f":"VLOOKUP(League[[#This Row],[Memberno]],Allmembers[],7,FALSE)","v":"MV60"},{"$f":"RANK(League[[#This Row],[Total Points]],League[Total Points])","v":47},{"$f":"IF(League[[#This Row],[Gender]]=\"M\",RANK(League[Total Points],mrank),\"\")","v":32},{"$f":"IF(League[[#This Row],[Gender]]=\"F\",RANK(League[Total Points],wrank),\"\")","v":""},{"$f":"SUM(League[[#This Row],[XC]:[Thunder Run]])","v":126},{"$f":"IFERROR(VLOOKUP(League[[#This Row],[Memberno]],XC[[Mem]:[Total Points]],5,0),\"\")","v":28},{"$f":"IFERROR(VLOOKUP(League[[#This Row],[Parkrun '#]],Parkrun[],7,FALSE),\"\")","v":22},{"$f":"IFERROR(VLOOKUP(League[[#This Row],[Memberno]],Club5k[],5,FALSE),\"\")","v":10},{"$f":"IFERROR(VLOOKUP(League[[#This Row],[Memberno]],Halfmarathon[Mem]:Halfmarathon[Points],4,0),\"\")","v":""},{"$f":"IFERROR(VLOOKUP(League[[#This Row],[Memberno]],Marathon[],4,FALSE),\"\")","v":""},{"$f":"IFERROR(VLOOKUP(League[[#This Row],[Memberno]],Table18[],5,FALSE),\"\")","v":36},{"$f":"IFERROR(VLOOKUP(League[[#This Row],[Memberno]],tenK[[Member '#]:[Total Points]],2,FALSE),\"\")","v":30},{"$f":"IFERROR(VLOOKUP(League[[#This Row],[Memberno]],Thunderrun[],3,FALSE),\"\")","v":""}]
[null,"Craig Harper",{"$f":"IFERROR(VLOOKUP(League[[#This Row],[Name]],members,2,FALSE),\"\")","v":114}," ",{"$f":"COUNT(League[[#This Row],[XC]:[Thunder Run]])","v":3},"M",{"$f":"VLOOKUP(League[[#This Row],[Memberno]],Allmembers[],7,FALSE)","v":"MS"},{"$f":"RANK(League[[#This Row],[Total Points]],League[Total Points])","v":48},{"$f":"IF(League[[#This Row],[Gender]]=\"M\",RANK(League[Total Points],mrank),\"\")","v":33},{"$f":"IF(League[[#This Row],[Gender]]=\"F\",RANK(League[Total Points],wrank),\"\")","v":""},{"$f":"SUM(League[[#This Row],[XC]:[Thunder Run]])","v":125},{"$f":"IFERROR(VLOOKUP(League[[#This Row],[Memberno]],XC[[Mem]:[Total Points]],5,0),\"\")","v":78},{"$f":"IFERROR(VLOOKUP(League[[#This Row],[Parkrun '#]],Parkrun[],7,FALSE),\"\")","v":""},{"$f":"IFERROR(VLOOKUP(League[[#This Row],[Memberno]],Club5k[],5,FALSE),\"\")","v":5},{"$f":"IFERROR(VLOOKUP(League[[#This Row],[Memberno]],Halfmarathon[Mem]:Halfmarathon[Points],4,0),\"\")","v":""},{"$f":"IFERROR(VLOOKUP(League[[#This Row],[Memberno]],Marathon[],4,FALSE),\"\")","v":""},{"$f":"IFERROR(VLOOKUP(League[[#This Row],[Memberno]],Table18[],5,FALSE),\"\")","v":""},{"$f":"IFERROR(VLOOKUP(League[[#This Row],[Memberno]],tenK[[Member '#]:[Total Points]],2,FALSE),\"\")","v":42},{"$f":"IFERROR(VLOOKUP(League[[#This Row],[Memberno]],Thunderrun[],3,FALSE),\"\")","v":""}]
[null,"Richard Bruce",{"$f":"IFERROR(VLOOKUP(League[[#This Row],[Name]],members,2,FALSE),\"\")","v":152}," ",{"$f":"COUNT(League[[#This Row],[XC]:[Thunder Run]])","v":2},"M",{"$f":"VLOOKUP(League[[#This Row],[Memberno]],Allmembers[],7,FALSE)","v":"MV40"},{"$f":"RANK(League[[#This Row],[Total Points]],League[Total Points])","v":49},{"$f":"IF(League[[#This Row],[Gender]]=\"M\",RANK(League[Total Points],mrank),\"\")","v":34},{"$f":"IF(League[[#This Row],[Gender]]=\"F\",RANK(League[Total Points],wrank),\"\")","v":""},{"$f":"SUM(League[[#This Row],[XC]:[Thunder Run]])","v":123},{"$f":"IFERROR(VLOOKUP(League[[#This Row],[Memberno]],XC[[Mem]:[Total Points]],5,0),\"\")","v":93},{"$f":"IFERROR(VLOOKUP(League[[#This Row],[Parkrun '#]],Parkrun[],7,FALSE),\"\")","v":""},{"$f":"IFERROR(VLOOKUP(League[[#This Row],[Memberno]],Club5k[],5,FALSE),\"\")","v":""},{"$f":"IFERROR(VLOOKUP(League[[#This Row],[Memberno]],Halfmarathon[Mem]:Halfmarathon[Points],4,0),\"\")","v":""},{"$f":"IFERROR(VLOOKUP(League[[#This Row],[Memberno]],Marathon[],4,FALSE),\"\")","v":30},{"$f":"IFERROR(VLOOKUP(League[[#This Row],[Memberno]],Table18[],5,FALSE),\"\")","v":""},{"$f":"IFERROR(VLOOKUP(League[[#This Row],[Memberno]],tenK[[Member '#]:[Total Points]],2,FALSE),\"\")","v":""},{"$f":"IFERROR(VLOOKUP(League[[#This Row],[Memberno]],Thunderrun[],3,FALSE),\"\")","v":""}]
[null,"Colette Pidgeon",{"$f":"IFERROR(VLOOKUP(League[[#This Row],[Name]],members,2,FALSE),\"\")","v":124},422513,{"$f":"COUNT(League[[#This Row],[XC]:[Thunder Run]])","v":3},"F",{"$f":"VLOOKUP(League[[#This Row],[Memberno]],Allmembers[],7,FALSE)","v":"FV35"},{"$f":"RANK(League[[#This Row],[Total Points]],League[Total Points])","v":50},{"$f":"IF(League[[#This Row],[Gender]]=\"M\",RANK(League[Total Points],mrank),\"\")","v":""},{"$f":"IF(League[[#This Row],[Gender]]=\"F\",RANK(League[Total Points],wrank),\"\")","v":16},{"$f":"SUM(League[[#This Row],[XC]:[Thunder Run]])","v":122},{"$f":"IFERROR(VLOOKUP(League[[#This Row],[Memberno]],XC[[Mem]:[Total Points]],5,0),\"\")","v":""},{"$f":"IFERROR(VLOOKUP(League[[#This Row],[Parkrun '#]],Parkrun[],7,FALSE),\"\")","v":40},{"$f":"IFERROR(VLOOKUP(League[[#This Row],[Memberno]],Club5k[],5,FALSE),\"\")","v":45},{"$f":"IFERROR(VLOOKUP(League[[#This Row],[Memberno]],Halfmarathon[Mem]:Halfmarathon[Points],4,0),\"\")","v":""},{"$f":"IFERROR(VLOOKUP(League[[#This Row],[Memberno]],Marathon[],4,FALSE),\"\")","v":""},{"$f":"IFERROR(VLOOKUP(League[[#This Row],[Memberno]],Table18[],5,FALSE),\"\")","v":""},{"$f":"IFERROR(VLOOKUP(League[[#This Row],[Memberno]],tenK[[Member '#]:[Total Points]],2,FALSE),\"\")","v":37},{"$f":"IFERROR(VLOOKUP(League[[#This Row],[Memberno]],Thunderrun[],3,FALSE),\"\")","v":""}]
[null,"Joolz Scott",{"$f":"IFERROR(VLOOKUP(League[[#This Row],[Name]],members,2,FALSE),\"\")","v":178},295917,{"$f":"COUNT(League[[#This Row],[XC]:[Thunder Run]])","v":3},"F",{"$f":"VLOOKUP(League[[#This Row],[Memberno]],Allmembers[],7,FALSE)","v":"FV45"},{"$f":"RANK(League[[#This Row],[Total Points]],League[Total Points])","v":51},{"$f":"IF(League[[#This Row],[Gender]]=\"M\",RANK(League[Total Points],mrank),\"\")","v":""},{"$f":"IF(League[[#This Row],[Gender]]=\"F\",RANK(League[Total Points],wrank),\"\")","v":17},{"$f":"SUM(League[[#This Row],[XC]:[Thunder Run]])","v":120},{"$f":"IFERROR(VLOOKUP(League[[#This Row],[Memberno]],XC[[Mem]:[Total Points]],5,0),\"\")","v":46},{"$f":"IFERROR(VLOOKUP(League[[#This Row],[Parkrun '#]],Parkrun[],7,FALSE),\"\")","v":""},{"$f":"IFERROR(VLOOKUP(League[[#This Row],[Memberno]],Club5k[],5,FALSE),\"\")","v":30},{"$f":"IFERROR(VLOOKUP(League[[#This Row],[Memberno]],Halfmarathon[Mem]:Halfmarathon[Points],4,0),\"\")","v":44},{"$f":"IFERROR(VLOOKUP(League[[#This Row],[Memberno]],Marathon[],4,FALSE),\"\")","v":""},{"$f":"IFERROR(VLOOKUP(League[[#This Row],[Memberno]],Table18[],5,FALSE),\"\")","v":""},{"$f":"IFERROR(VLOOKUP(League[[#This Row],[Memberno]],tenK[[Member '#]:[Total Points]],2,FALSE),\"\")","v":""},{"$f":"IFERROR(VLOOKUP(League[[#This Row],[Memberno]],Thunderrun[],3,FALSE),\"\")","v":""}]
[null,"Justin Busby",{"$f":"IFERROR(VLOOKUP(League[[#This Row],[Name]],members,2,FALSE),\"\")","v":292},null,{"$f":"COUNT(League[[#This Row],[XC]:[Thunder Run]])","v":4},"M",{"$f":"VLOOKUP(League[[#This Row],[Memberno]],Allmembers[],7,FALSE)","v":"MS"},{"$f":"RANK(League[[#This Row],[Total Points]],League[Total Points])","v":52},{"$f":"IF(League[[#This Row],[Gender]]=\"M\",RANK(League[Total Points],mrank),\"\")","v":35},{"$f":"IF(League[[#This Row],[Gender]]=\"F\",RANK(League[Total Points],wrank),\"\")","v":""},{"$f":"SUM(League[[#This Row],[XC]:[Thunder Run]])","v":114},{"$f":"IFERROR(VLOOKUP(League[[#This Row],[Memberno]],XC[[Mem]:[Total Points]],5,0),\"\")","v":38},{"$f":"IFERROR(VLOOKUP(League[[#This Row],[Parkrun '#]],Parkrun[],7,FALSE),\"\")","v":""},{"$f":"IFERROR(VLOOKUP(League[[#This Row],[Memberno]],Club5k[],5,FALSE),\"\")","v":5},{"$f":"IFERROR(VLOOKUP(League[[#This Row],[Memberno]],Halfmarathon[Mem]:Halfmarathon[Points],4,0),\"\")","v":35},{"$f":"IFERROR(VLOOKUP(League[[#This Row],[Memberno]],Marathon[],4,FALSE),\"\")","v":""},{"$f":"IFERROR(VLOOKUP(League[[#This Row],[Memberno]],Table18[],5,FALSE),\"\")","v":""},{"$f":"IFERROR(VLOOKUP(League[[#This Row],[Memberno]],tenK[[Member '#]:[Total Points]],2,FALSE),\"\")","v":36},{"$f":"IFERROR(VLOOKUP(League[[#This Row],[Memberno]],Thunderrun[],3,FALSE),\"\")","v":""}]
[null,"Ian Smart",{"$f":"IFERROR(VLOOKUP(League[[#This Row],[Name]],members,2,FALSE),\"\")","v":60}," ",{"$f":"COUNT(League[[#This Row],[XC]:[Thunder Run]])","v":3},"M",{"$f":"VLOOKUP(League[[#This Row],[Memberno]],Allmembers[],7,FALSE)","v":"MV50"},{"$f":"RANK(League[[#This Row],[Total Points]],League[Total Points])","v":53},{"$f":"IF(League[[#This Row],[Gender]]=\"M\",RANK(League[Total Points],mrank),\"\")","v":36},{"$f":"IF(League[[#This Row],[Gender]]=\"F\",RANK(League[Total Points],wrank),\"\")","v":""},{"$f":"SUM(League[[#This Row],[XC]:[Thunder Run]])","v":110},{"$f":"IFERROR(VLOOKUP(League[[#This Row],[Memberno]],XC[[Mem]:[Total Points]],5,0),\"\")","v":""},{"$f":"IFERROR(VLOOKUP(League[[#This Row],[Parkrun '#]],Parkrun[],7,FALSE),\"\")","v":""},{"$f":"IFERROR(VLOOKUP(League[[#This Row],[Memberno]],Club5k[],5,FALSE),\"\")","v":""},{"$f":"IFERROR(VLOOKUP(League[[#This Row],[Memberno]],Halfmarathon[Mem]:Halfmarathon[Points],4,0),\"\")","v":38},{"$f":"IFERROR(VLOOKUP(League[[#This Row],[Memberno]],Marathon[],4,FALSE),\"\")","v":""},{"$f":"IFERROR(VLOOKUP(League[[#This Row],[Memberno]],Table18[],5,FALSE),\"\")","v":40},{"$f":"IFERROR(VLOOKUP(League[[#This Row],[Memberno]],tenK[[Member '#]:[Total Points]],2,FALSE),\"\")","v":32},{"$f":"IFERROR(VLOOKUP(League[[#This Row],[Memberno]],Thunderrun[],3,FALSE),\"\")","v":""}]
[null,"Georgia Dench",{"$f":"IFERROR(VLOOKUP(League[[#This Row],[Name]],members,2,FALSE),\"\")","v":254}," ",{"$f":"COUNT(League[[#This Row],[XC]:[Thunder Run]])","v":1},"F",{"$f":"VLOOKUP(League[[#This Row],[Memberno]],Allmembers[],7,FALSE)","v":"FV35"},{"$f":"RANK(League[[#This Row],[Total Points]],League[Total Points])","v":54},{"$f":"IF(League[[#This Row],[Gender]]=\"M\",RANK(League[Total Points],mrank),\"\")","v":""},{"$f":"IF(League[[#This Row],[Gender]]=\"F\",RANK(League[Total Points],wrank),\"\")","v":18},{"$f":"SUM(League[[#This Row],[XC]:[Thunder Run]])","v":99},{"$f":"IFERROR(VLOOKUP(League[[#This Row],[Memberno]],XC[[Mem]:[Total Points]],5,0),\"\")","v":99},{"$f":"IFERROR(VLOOKUP(League[[#This Row],[Parkrun '#]],Parkrun[],7,FALSE),\"\")","v":""},{"$f":"IFERROR(VLOOKUP(League[[#This Row],[Memberno]],Club5k[],5,FALSE),\"\")","v":""},{"$f":"IFERROR(VLOOKUP(League[[#This Row],[Memberno]],Halfmarathon[Mem]:Halfmarathon[Points],4,0),\"\")","v":""},{"$f":"IFERROR(VLOOKUP(League[[#This Row],[Memberno]],Marathon[],4,FALSE),\"\")","v":""},{"$f":"IFERROR(VLOOKUP(League[[#This Row],[Memberno]],Table18[],5,FALSE),\"\")","v":""},{"$f":"IFERROR(VLOOKUP(League[[#This Row],[Memberno]],tenK[[Member '#]:[Total Points]],2,FALSE),\"\")","v":""},{"$f":"IFERROR(VLOOKUP(League[[#This Row],[Memberno]],Thunderrun[],3,FALSE),\"\")","v":""}]
[null,"Riana Walsh",316,null,{"$f":"COUNT(League[[#This Row],[XC]:[Thunder Run]])","v":2},"F",{"$f":"VLOOKUP(League[[#This Row],[Memberno]],Allmembers[],7,FALSE)","v":"FV35"},{"$f":"RANK(League[[#This Row],[Total Points]],League[Total Points])","v":55},{"$f":"IF(League[[#This Row],[Gender]]=\"M\",RANK(League[Total Points],mrank),\"\")","v":""},{"$f":"IF(League[[#This Row],[Gender]]=\"F\",RANK(League[Total Points],wrank),\"\")","v":19},{"$f":"SUM(League[[#This Row],[XC]:[Thunder Run]])","v":96},{"$f":"IFERROR(VLOOKUP(League[[#This Row],[Memberno]],XC[[Mem]:[Total Points]],5,0),\"\")","v":91},{"$f":"IFERROR(VLOOKUP(League[[#This Row],[Parkrun '#]],Parkrun[],7,FALSE),\"\")","v":""},{"$f":"IFERROR(VLOOKUP(League[[#This Row],[Memberno]],Club5k[],5,FALSE),\"\")","v":5},{"$f":"IFERROR(VLOOKUP(League[[#This Row],[Memberno]],Halfmarathon[Mem]:Halfmarathon[Points],4,0),\"\")","v":""},{"$f":"IFERROR(VLOOKUP(League[[#This Row],[Memberno]],Marathon[],4,FALSE),\"\")","v":""},{"$f":"IFERROR(VLOOKUP(League[[#This Row],[Memberno]],Table18[],5,FALSE),\"\")","v":""},{"$f":"IFERROR(VLOOKUP(League[[#This Row],[Memberno]],tenK[[Member '#]:[Total Points]],2,FALSE),\"\")","v":""},{"$f":"IFERROR(VLOOKUP(League[[#This Row],[Memberno]],Thunderrun[],3,FALSE),\"\")","v":""}]
[null,"James Chasen",{"$f":"IFERROR(VLOOKUP(League[[#This Row],[Name]],members,2,FALSE),\"\")","v":294},null,{"$f":"COUNT(League[[#This Row],[XC]:[Thunder Run]])","v":2},"M",{"$f":"VLOOKUP(League[[#This Row],[Memberno]],Allmembers[],7,FALSE)","v":"MS"},{"$f":"RANK(League[[#This Row],[Total Points]],League[Total Points])","v":56},{"$f":"IF(League[[#This Row],[Gender]]=\"M\",RANK(League[Total Points],mrank),\"\")","v":37},{"$f":"IF(League[[#This Row],[Gender]]=\"F\",RANK(League[Total Points],wrank),\"\")","v":""},{"$f":"SUM(League[[#This Row],[XC]:[Thunder Run]])","v":95},{"$f":"IFERROR(VLOOKUP(League[[#This Row],[Memberno]],XC[[Mem]:[Total Points]],5,0),\"\")","v":46},{"$f":"IFERROR(VLOOKUP(League[[#This Row],[Parkrun '#]],Parkrun[],7,FALSE),\"\")","v":""},{"$f":"IFERROR(VLOOKUP(League[[#This Row],[Memberno]],Club5k[],5,FALSE),\"\")","v":""},{"$f":"IFERROR(VLOOKUP(League[[#This Row],[Memberno]],Halfmarathon[Mem]:Halfmarathon[Points],4,0),\"\")","v":""},{"$f":"IFERROR(VLOOKUP(League[[#This Row],[Memberno]],Marathon[],4,FALSE),\"\")","v":""},{"$f":"IFERROR(VLOOKUP(League[[#This Row],[Memberno]],Table18[],5,FALSE),\"\")","v":""},{"$f":"IFERROR(VLOOKUP(League[[#This Row],[Memberno]],tenK[[Member '#]:[Total Points]],2,FALSE),\"\")","v":49},{"$f":"IFERROR(VLOOKUP(League[[#This Row],[Memberno]],Thunderrun[],3,FALSE),\"\")","v":""}]
[null,"Jason W Smith",{"$f":"IFERROR(VLOOKUP(League[[#This Row],[Name]],members,2,FALSE),\"\")","v":263},"   ",{"$f":"COUNT(League[[#This Row],[XC]:[Thunder Run]])","v":3},"M",{"$f":"VLOOKUP(League[[#This Row],[Memberno]],Allmembers[],7,FALSE)","v":"MV40"},{"$f":"RANK(League[[#This Row],[Total Points]],League[Total Points])","v":57},{"$f":"IF(League[[#This Row],[Gender]]=\"M\",RANK(League[Total Points],mrank),\"\")","v":38},{"$f":"IF(League[[#This Row],[Gender]]=\"F\",RANK(League[Total Points],wrank),\"\")","v":""},{"$f":"SUM(League[[#This Row],[XC]:[Thunder Run]])","v":90},{"$f":"IFERROR(VLOOKUP(League[[#This Row],[Memberno]],XC[[Mem]:[Total Points]],5,0),\"\")","v":""},{"$f":"IFERROR(VLOOKUP(League[[#This Row],[Parkrun '#]],Parkrun[],7,FALSE),\"\")","v":""},{"$f":"IFERROR(VLOOKUP(League[[#This Row],[Memberno]],Club5k[],5,FALSE),\"\")","v":15},{"$f":"IFERROR(VLOOKUP(League[[#This Row],[Memberno]],Halfmarathon[Mem]:Halfmarathon[Points],4,0),\"\")","v":45},{"$f":"IFERROR(VLOOKUP(League[[#This Row],[Memberno]],Marathon[],4,FALSE),\"\")","v":""},{"$f":"IFERROR(VLOOKUP(League[[#This Row],[Memberno]],Table18[],5,FALSE),\"\")","v":""},{"$f":"IFERROR(VLOOKUP(League[[#This Row],[Memberno]],tenK[[Member '#]:[Total Points]],2,FALSE),\"\")","v":30},{"$f":"IFERROR(VLOOKUP(League[[#This Row],[Memberno]],Thunderrun[],3,FALSE),\"\")","v":""}]
[null,"Iain Tucker",{"$f":"IFERROR(VLOOKUP(League[[#This Row],[Name]],members,2,FALSE),\"\")","v":302},653726,{"$f":"COUNT(League[[#This Row],[XC]:[Thunder Run]])","v":2},"M",{"$f":"VLOOKUP(League[[#This Row],[Memberno]],Allmembers[],7,FALSE)","v":"MS"},{"$f":"RANK(League[[#This Row],[Total Points]],League[Total Points])","v":58},{"$f":"IF(League[[#This Row],[Gender]]=\"M\",RANK(League[Total Points],mrank),\"\")","v":39},{"$f":"IF(League[[#This Row],[Gender]]=\"F\",RANK(League[Total Points],wrank),\"\")","v":""},{"$f":"SUM(League[[#This Row],[XC]:[Thunder Run]])","v":89},{"$f":"IFERROR(VLOOKUP(League[[#This Row],[Memberno]],XC[[Mem]:[Total Points]],5,0),\"\")","v":""},{"$f":"IFERROR(VLOOKUP(League[[#This Row],[Parkrun '#]],Parkrun[],7,FALSE),\"\")","v":44},{"$f":"IFERROR(VLOOKUP(League[[#This Row],[Memberno]],Club5k[],5,FALSE),\"\")","v":""},{"$f":"IFERROR(VLOOKUP(League[[#This Row],[Memberno]],Halfmarathon[Mem]:Halfmarathon[Points],4,0),\"\")","v":""},{"$f":"IFERROR(VLOOKUP(League[[#This Row],[Memberno]],Marathon[],4,FALSE),\"\")","v":""},{"$f":"IFERROR(VLOOKUP(League[[#This Row],[Memberno]],Table18[],5,FALSE),\"\")","v":""},{"$f":"IFERROR(VLOOKUP(League[[#This Row],[Memberno]],tenK[[Member '#]:[Total Points]],2,FALSE),\"\")","v":45},{"$f":"IFERROR(VLOOKUP(League[[#This Row],[Memberno]],Thunderrun[],3,FALSE),\"\")","v":""}]
[null,"Norman Whitwood",{"$f":"IFERROR(VLOOKUP(League[[#This Row],[Name]],members,2,FALSE),\"\")","v":93},645231,{"$f":"COUNT(League[[#This Row],[XC]:[Thunder Run]])","v":4},"M",{"$f":"VLOOKUP(League[[#This Row],[Memberno]],Allmembers[],7,FALSE)","v":"MV60"},{"$f":"RANK(League[[#This Row],[Total Points]],League[Total Points])","v":58},{"$f":"IF(League[[#This Row],[Gender]]=\"M\",RANK(League[Total Points],mrank),\"\")","v":39},{"$f":"IF(League[[#This Row],[Gender]]=\"F\",RANK(League[Total Points],wrank),\"\")","v":""},{"$f":"SUM(League[[#This Row],[XC]:[Thunder Run]])","v":89},{"$f":"IFERROR(VLOOKUP(League[[#This Row],[Memberno]],XC[[Mem]:[Total Points]],5,0),\"\")","v":51},{"$f":"IFERROR(VLOOKUP(League[[#This Row],[Parkrun '#]],Parkrun[],7,FALSE),\"\")","v":16},{"$f":"IFERROR(VLOOKUP(League[[#This Row],[Memberno]],Club5k[],5,FALSE),\"\")","v":5},{"$f":"IFERROR(VLOOKUP(League[[#This Row],[Memberno]],Halfmarathon[Mem]:Halfmarathon[Points],4,0),\"\")","v":""},{"$f":"IFERROR(VLOOKUP(League[[#This Row],[Memberno]],Marathon[],4,FALSE),\"\")","v":""},{"$f":"IFERROR(VLOOKUP(League[[#This Row],[Memberno]],Table18[],5,FALSE),\"\")","v":""},{"$f":"IFERROR(VLOOKUP(League[[#This Row],[Memberno]],tenK[[Member '#]:[Total Points]],2,FALSE),\"\")","v":17},{"$f":"IFERROR(VLOOKUP(League[[#This Row],[Memberno]],Thunderrun[],3,FALSE),\"\")","v":""}]
[null,"David Moritz",214,235751,{"$f":"COUNT(League[[#This Row],[XC]:[Thunder Run]])","v":2},"M",{"$f":"VLOOKUP(League[[#This Row],[Memberno]],Allmembers[],7,FALSE)","v":"MS"},{"$f":"RANK(League[[#This Row],[Total Points]],League[Total Points])","v":60},{"$f":"IF(League[[#This Row],[Gender]]=\"M\",RANK(League[Total Points],mrank),\"\")","v":41},{"$f":"IF(League[[#This Row],[Gender]]=\"F\",RANK(League[Total Points],wrank),\"\")","v":""},{"$f":"SUM(League[[#This Row],[XC]:[Thunder Run]])","v":88},{"$f":"IFERROR(VLOOKUP(League[[#This Row],[Memberno]],XC[[Mem]:[Total Points]],5,0),\"\")","v":""},{"$f":"IFERROR(VLOOKUP(League[[#This Row],[Parkrun '#]],Parkrun[],7,FALSE),\"\")","v":45},{"$f":"IFERROR(VLOOKUP(League[[#This Row],[Memberno]],Club5k[],5,FALSE),\"\")","v":""},{"$f":"IFERROR(VLOOKUP(League[[#This Row],[Memberno]],Halfmarathon[Mem]:Halfmarathon[Points],4,0),\"\")","v":""},{"$f":"IFERROR(VLOOKUP(League[[#This Row],[Memberno]],Marathon[],4,FALSE),\"\")","v":""},{"$f":"IFERROR(VLOOKUP(League[[#This Row],[Memberno]],Table18[],5,FALSE),\"\")","v":""},{"$f":"IFERROR(VLOOKUP(League[[#This Row],[Memberno]],tenK[[Member '#]:[Total Points]],2,FALSE),\"\")","v":43},{"$f":"IFERROR(VLOOKUP(League[[#This Row],[Memberno]],Thunderrun[],3,FALSE),\"\")","v":""}]
[null,"Fiona Price",248," ",{"$f":"COUNT(League[[#This Row],[XC]:[Thunder Run]])","v":1},"F",{"$f":"VLOOKUP(League[[#This Row],[Memberno]],Allmembers[],7,FALSE)","v":"FV35"},{"$f":"RANK(League[[#This Row],[Total Points]],League[Total Points])","v":60},{"$f":"IF(League[[#This Row],[Gender]]=\"M\",RANK(League[Total Points],mrank),\"\")","v":""},{"$f":"IF(League[[#This Row],[Gender]]=\"F\",RANK(League[Total Points],wrank),\"\")","v":20},{"$f":"SUM(League[[#This Row],[XC]:[Thunder Run]])","v":88},{"$f":"IFERROR(VLOOKUP(League[[#This Row],[Memberno]],XC[[Mem]:[Total Points]],5,0),\"\")","v":""},{"$f":"IFERROR(VLOOKUP(League[[#This Row],[Parkrun '#]],Parkrun[],7,FALSE),\"\")","v":""},{"$f":"IFERROR(VLOOKUP(League[[#This Row],[Memberno]],Club5k[],5,FALSE),\"\")","v":""},{"$f":"IFERROR(VLOOKUP(League[[#This Row],[Memberno]],Halfmarathon[Mem]:Halfmarathon[Points],4,0),\"\")","v":""},{"$f":"IFERROR(VLOOKUP(League[[#This Row],[Memberno]],Marathon[],4,FALSE),\"\")","v":""},{"$f":"IFERROR(VLOOKUP(League[[#This Row],[Memberno]],Table18[],5,FALSE),\"\")","v":""},{"$f":"IFERROR(VLOOKUP(League[[#This Row],[Memberno]],tenK[[Member '#]:[Total Points]],2,FALSE),\"\")","v":88},{"$f":"IFERROR(VLOOKUP(League[[#This Row],[Memberno]],Thunderrun[],3,FALSE),\"\")","v":""}]
[null,"Chris Cottle",{"$f":"IFERROR(VLOOKUP(League[[#This Row],[Name]],members,2,FALSE),\"\")","v":227},755680,{"$f":"COUNT(League[[#This Row],[XC]:[Thunder Run]])","v":3},"M",{"$f":"VLOOKUP(League[[#This Row],[Memberno]],Allmembers[],7,FALSE)","v":"MS"},{"$f":"RANK(League[[#This Row],[Total Points]],League[Total Points])","v":62},{"$f":"IF(League[[#This Row],[Gender]]=\"M\",RANK(League[Total Points],mrank),\"\")","v":42},{"$f":"IF(League[[#This Row],[Gender]]=\"F\",RANK(League[Total Points],wrank),\"\")","v":""},{"$f":"SUM(League[[#This Row],[XC]:[Thunder Run]])","v":87},{"$f":"IFERROR(VLOOKUP(League[[#This Row],[Memberno]],XC[[Mem]:[Total Points]],5,0),\"\")","v":""},{"$f":"IFERROR(VLOOKUP(League[[#This Row],[Parkrun '#]],Parkrun[],7,FALSE),\"\")","v":31},{"$f":"IFERROR(VLOOKUP(League[[#This Row],[Memberno]],Club5k[],5,FALSE),\"\")","v":15},{"$f":"IFERROR(VLOOKUP(League[[#This Row],[Memberno]],Halfmarathon[Mem]:Halfmarathon[Points],4,0),\"\")","v":41},{"$f":"IFERROR(VLOOKUP(League[[#This Row],[Memberno]],Marathon[],4,FALSE),\"\")","v":""},{"$f":"IFERROR(VLOOKUP(League[[#This Row],[Memberno]],Table18[],5,FALSE),\"\")","v":""},{"$f":"IFERROR(VLOOKUP(League[[#This Row],[Memberno]],tenK[[Member '#]:[Total Points]],2,FALSE),\"\")","v":""},{"$f":"IFERROR(VLOOKUP(League[[#This Row],[Memberno]],Thunderrun[],3,FALSE),\"\")","v":""}]
[null,"Dee Bretnall",{"$f":"IFERROR(VLOOKUP(League[[#This Row],[Name]],members,2,FALSE),\"\")","v":230}," ",{"$f":"COUNT(League[[#This Row],[XC]:[Thunder Run]])","v":2},"F",{"$f":"VLOOKUP(League[[#This Row],[Memberno]],Allmembers[],7,FALSE)","v":"FV35"},{"$f":"RANK(League[[#This Row],[Total Points]],League[Total Points])","v":62},{"$f":"IF(League[[#This Row],[Gender]]=\"M\",RANK(League[Total Points],mrank),\"\")","v":""},{"$f":"IF(League[[#This Row],[Gender]]=\"F\",RANK(League[Total Points],wrank),\"\")","v":21},{"$f":"SUM(League[[#This Row],[XC]:[Thunder Run]])","v":87},{"$f":"IFERROR(VLOOKUP(League[[#This Row],[Memberno]],XC[[Mem]:[Total Points]],5,0),\"\")","v":""},{"$f":"IFERROR(VLOOKUP(League[[#This Row],[Parkrun '#]],Parkrun[],7,FALSE),\"\")","v":""},{"$f":"IFERROR(VLOOKUP(League[[#This Row],[Memberno]],Club5k[],5,FALSE),\"\")","v":""},{"$f":"IFERROR(VLOOKUP(League[[#This Row],[Memberno]],Halfmarathon[Mem]:Halfmarathon[Points],4,0),\"\")","v":44},{"$f":"IFERROR(VLOOKUP(League[[#This Row],[Memberno]],Marathon[],4,FALSE),\"\")","v":""},{"$f":"IFERROR(VLOOKUP(League[[#This Row],[Memberno]],Table18[],5,FALSE),\"\")","v":43},{"$f":"IFERROR(VLOOKUP(League[[#This Row],[Memberno]],tenK[[Member '#]:[Total Points]],2,FALSE),\"\")","v":""},{"$f":"IFERROR(VLOOKUP(League[[#This Row],[Memberno]],Thunderrun[],3,FALSE),\"\")","v":""}]
[null,"Lorna Townsend",{"$f":"IFERROR(VLOOKUP(League[[#This Row],[Name]],members,2,FALSE),\"\")","v":242}," ",{"$f":"COUNT(League[[#This Row],[XC]:[Thunder Run]])","v":1},"F",{"$f":"VLOOKUP(League[[#This Row],[Memberno]],Allmembers[],7,FALSE)","v":"F"},{"$f":"RANK(League[[#This Row],[Total Points]],League[Total Points])","v":64},{"$f":"IF(League[[#This Row],[Gender]]=\"M\",RANK(League[Total Points],mrank),\"\")","v":""},{"$f":"IF(League[[#This Row],[Gender]]=\"F\",RANK(League[Total Points],wrank),\"\")","v":22},{"$f":"SUM(League[[#This Row],[XC]:[Thunder Run]])","v":86},{"$f":"IFERROR(VLOOKUP(League[[#This Row],[Memberno]],XC[[Mem]:[Total Points]],5,0),\"\")","v":86},{"$f":"IFERROR(VLOOKUP(League[[#This Row],[Parkrun '#]],Parkrun[],7,FALSE),\"\")","v":""},{"$f":"IFERROR(VLOOKUP(League[[#This Row],[Memberno]],Club5k[],5,FALSE),\"\")","v":""},{"$f":"IFERROR(VLOOKUP(League[[#This Row],[Memberno]],Halfmarathon[Mem]:Halfmarathon[Points],4,0),\"\")","v":""},{"$f":"IFERROR(VLOOKUP(League[[#This Row],[Memberno]],Marathon[],4,FALSE),\"\")","v":""},{"$f":"IFERROR(VLOOKUP(League[[#This Row],[Memberno]],Table18[],5,FALSE),\"\")","v":""},{"$f":"IFERROR(VLOOKUP(League[[#This Row],[Memberno]],tenK[[Member '#]:[Total Points]],2,FALSE),\"\")","v":""},{"$f":"IFERROR(VLOOKUP(League[[#This Row],[Memberno]],Thunderrun[],3,FALSE),\"\")","v":""}]
[null,"Janice Nisbet",307,null,{"$f":"COUNT(League[[#This Row],[XC]:[Thunder Run]])","v":1},"F",{"$f":"VLOOKUP(League[[#This Row],[Memberno]],Allmembers[],7,FALSE)","v":"FV55"},{"$f":"RANK(League[[#This Row],[Total Points]],League[Total Points])","v":65},{"$f":"IF(League[[#This Row],[Gender]]=\"M\",RANK(League[Total Points],mrank),\"\")","v":""},{"$f":"IF(League[[#This Row],[Gender]]=\"F\",RANK(League[Total Points],wrank),\"\")","v":23},{"$f":"SUM(League[[#This Row],[XC]:[Thunder Run]])","v":83},{"$f":"IFERROR(VLOOKUP(League[[#This Row],[Memberno]],XC[[Mem]:[Total Points]],5,0),\"\")","v":83},{"$f":"IFERROR(VLOOKUP(League[[#This Row],[Parkrun '#]],Parkrun[],7,FALSE),\"\")","v":""},{"$f":"IFERROR(VLOOKUP(League[[#This Row],[Memberno]],Club5k[],5,FALSE),\"\")","v":""},{"$f":"IFERROR(VLOOKUP(League[[#This Row],[Memberno]],Halfmarathon[Mem]:Halfmarathon[Points],4,0),\"\")","v":""},{"$f":"IFERROR(VLOOKUP(League[[#This Row],[Memberno]],Marathon[],4,FALSE),\"\")","v":""},{"$f":"IFERROR(VLOOKUP(League[[#This Row],[Memberno]],Table18[],5,FALSE),\"\")","v":""},{"$f":"IFERROR(VLOOKUP(League[[#This Row],[Memberno]],tenK[[Member '#]:[Total Points]],2,FALSE),\"\")","v":""},{"$f":"IFERROR(VLOOKUP(League[[#This Row],[Memberno]],Thunderrun[],3,FALSE),\"\")","v":""}]
[null,"Annette Godfrey",{"$f":"IFERROR(VLOOKUP(League[[#This Row],[Name]],members,2,FALSE),\"\")","v":51}," ",{"$f":"COUNT(League[[#This Row],[XC]:[Thunder Run]])","v":2},"F",{"$f":"VLOOKUP(League[[#This Row],[Memberno]],Allmembers[],7,FALSE)","v":"FV45"},{"$f":"RANK(League[[#This Row],[Total Points]],League[Total Points])","v":66},{"$f":"IF(League[[#This Row],[Gender]]=\"M\",RANK(League[Total Points],mrank),\"\")","v":""},{"$f":"IF(League[[#This Row],[Gender]]=\"F\",RANK(League[Total Points],wrank),\"\")","v":24},{"$f":"SUM(League[[#This Row],[XC]:[Thunder Run]])","v":82},{"$f":"IFERROR(VLOOKUP(League[[#This Row],[Memberno]],XC[[Mem]:[Total Points]],5,0),\"\")","v":""},{"$f":"IFERROR(VLOOKUP(League[[#This Row],[Parkrun '#]],Parkrun[],7,FALSE),\"\")","v":""},{"$f":"IFERROR(VLOOKUP(League[[#This Row],[Memberno]],Club5k[],5,FALSE),\"\")","v":""},{"$f":"IFERROR(VLOOKUP(League[[#This Row],[Memberno]],Halfmarathon[Mem]:Halfmarathon[Points],4,0),\"\")","v":""},{"$f":"IFERROR(VLOOKUP(League[[#This Row],[Memberno]],Marathon[],4,FALSE),\"\")","v":""},{"$f":"IFERROR(VLOOKUP(League[[#This Row],[Memberno]],Table18[],5,FALSE),\"\")","v":39},{"$f":"IFERROR(VLOOKUP(League[[#This Row],[Memberno]],tenK[[Member '#]:[Total Points]],2,FALSE),\"\")","v":43},{"$f":"IFERROR(VLOOKUP(League[[#This Row],[Memberno]],Thunderrun[],3,FALSE),\"\")","v":""}]
[null,"Simon Kitchener",{"$f":"IFERROR(VLOOKUP(League[[#This Row],[Name]],members,2,FALSE),\"\")","v":9}," ",{"$f":"COUNT(League[[#This Row],[XC]:[Thunder Run]])","v":2},"M",{"$f":"VLOOKUP(League[[#This Row],[Memberno]],Allmembers[],7,FALSE)","v":"MV60"},{"$f":"RANK(League[[#This Row],[Total Points]],League[Total Points])","v":67},{"$f":"IF(League[[#This Row],[Gender]]=\"M\",RANK(League[Total Points],mrank),\"\")","v":43},{"$f":"IF(League[[#This Row],[Gender]]=\"F\",RANK(League[Total Points],wrank),\"\")","v":""},{"$f":"SUM(League[[#This Row],[XC]:[Thunder Run]])","v":78},{"$f":"IFERROR(VLOOKUP(League[[#This Row],[Memberno]],XC[[Mem]:[Total Points]],5,0),\"\")","v":63},{"$f":"IFERROR(VLOOKUP(League[[#This Row],[Parkrun '#]],Parkrun[],7,FALSE),\"\")","v":""},{"$f":"IFERROR(VLOOKUP(League[[#This Row],[Memberno]],Club5k[],5,FALSE),\"\")","v":15},{"$f":"IFERROR(VLOOKUP(League[[#This Row],[Memberno]],Halfmarathon[Mem]:Halfmarathon[Points],4,0),\"\")","v":""},{"$f":"IFERROR(VLOOKUP(League[[#This Row],[Memberno]],Marathon[],4,FALSE),\"\")","v":""},{"$f":"IFERROR(VLOOKUP(League[[#This Row],[Memberno]],Table18[],5,FALSE),\"\")","v":""},{"$f":"IFERROR(VLOOKUP(League[[#This Row],[Memberno]],tenK[[Member '#]:[Total Points]],2,FALSE),\"\")","v":""},{"$f":"IFERROR(VLOOKUP(League[[#This Row],[Memberno]],Thunderrun[],3,FALSE),\"\")","v":""}]
[null,"Andrew Hazley-Payne",{"$f":"IFERROR(VLOOKUP(League[[#This Row],[Name]],members,2,FALSE),\"\")","v":237}," ",{"$f":"COUNT(League[[#This Row],[XC]:[Thunder Run]])","v":3},"M",{"$f":"VLOOKUP(League[[#This Row],[Memberno]],Allmembers[],7,FALSE)","v":"MV40"},{"$f":"RANK(League[[#This Row],[Total Points]],League[Total Points])","v":68},{"$f":"IF(League[[#This Row],[Gender]]=\"M\",RANK(League[Total Points],mrank),\"\")","v":44},{"$f":"IF(League[[#This Row],[Gender]]=\"F\",RANK(League[Total Points],wrank),\"\")","v":""},{"$f":"SUM(League[[#This Row],[XC]:[Thunder Run]])","v":76},{"$f":"IFERROR(VLOOKUP(League[[#This Row],[Memberno]],XC[[Mem]:[Total Points]],5,0),\"\")","v":38},{"$f":"IFERROR(VLOOKUP(League[[#This Row],[Parkrun '#]],Parkrun[],7,FALSE),\"\")","v":""},{"$f":"IFERROR(VLOOKUP(League[[#This Row],[Memberno]],Club5k[],5,FALSE),\"\")","v":5},{"$f":"IFERROR(VLOOKUP(League[[#This Row],[Memberno]],Halfmarathon[Mem]:Halfmarathon[Points],4,0),\"\")","v":""},{"$f":"IFERROR(VLOOKUP(League[[#This Row],[Memberno]],Marathon[],4,FALSE),\"\")","v":""},{"$f":"IFERROR(VLOOKUP(League[[#This Row],[Memberno]],Table18[],5,FALSE),\"\")","v":""},{"$f":"IFERROR(VLOOKUP(League[[#This Row],[Memberno]],tenK[[Member '#]:[Total Points]],2,FALSE),\"\")","v":33},{"$f":"IFERROR(VLOOKUP(League[[#This Row],[Memberno]],Thunderrun[],3,FALSE),\"\")","v":""}]
[null,"Jenny Birch",94," ",{"$f":"COUNT(League[[#This Row],[XC]:[Thunder Run]])","v":2},"F",{"$f":"VLOOKUP(League[[#This Row],[Memberno]],Allmembers[],7,FALSE)","v":"FV35"},{"$f":"RANK(League[[#This Row],[Total Points]],League[Total Points])","v":68},{"$f":"IF(League[[#This Row],[Gender]]=\"M\",RANK(League[Total Points],mrank),\"\")","v":""},{"$f":"IF(League[[#This Row],[Gender]]=\"F\",RANK(League[Total Points],wrank),\"\")","v":25},{"$f":"SUM(League[[#This Row],[XC]:[Thunder Run]])","v":76},{"$f":"IFERROR(VLOOKUP(League[[#This Row],[Memberno]],XC[[Mem]:[Total Points]],5,0),\"\")","v":41},{"$f":"IFERROR(VLOOKUP(League[[#This Row],[Parkrun '#]],Parkrun[],7,FALSE),\"\")","v":""},{"$f":"IFERROR(VLOOKUP(League[[#This Row],[Memberno]],Club5k[],5,FALSE),\"\")","v":35},{"$f":"IFERROR(VLOOKUP(League[[#This Row],[Memberno]],Halfmarathon[Mem]:Halfmarathon[Points],4,0),\"\")","v":""},{"$f":"IFERROR(VLOOKUP(League[[#This Row],[Memberno]],Marathon[],4,FALSE),\"\")","v":""},{"$f":"IFERROR(VLOOKUP(League[[#This Row],[Memberno]],Table18[],5,FALSE),\"\")","v":""},{"$f":"IFERROR(VLOOKUP(League[[#This Row],[Memberno]],tenK[[Member '#]:[Total Points]],2,FALSE),\"\")","v":""},{"$f":"IFERROR(VLOOKUP(League[[#This Row],[Memberno]],Thunderrun[],3,FALSE),\"\")","v":""}]
[null,"Tina Pidgeon",{"$f":"IFERROR(VLOOKUP(League[[#This Row],[Name]],members,2,FALSE),\"\")","v":123},425723,{"$f":"COUNT(League[[#This Row],[XC]:[Thunder Run]])","v":3},"F",{"$f":"VLOOKUP(League[[#This Row],[Memberno]],Allmembers[],7,FALSE)","v":"FV35"},{"$f":"RANK(League[[#This Row],[Total Points]],League[Total Points])","v":68},{"$f":"IF(League[[#This Row],[Gender]]=\"M\",RANK(League[Total Points],mrank),\"\")","v":""},{"$f":"IF(League[[#This Row],[Gender]]=\"F\",RANK(League[Total Points],wrank),\"\")","v":25},{"$f":"SUM(League[[#This Row],[XC]:[Thunder Run]])","v":76},{"$f":"IFERROR(VLOOKUP(League[[#This Row],[Memberno]],XC[[Mem]:[Total Points]],5,0),\"\")","v":""},{"$f":"IFERROR(VLOOKUP(League[[#This Row],[Parkrun '#]],Parkrun[],7,FALSE),\"\")","v":36},{"$f":"IFERROR(VLOOKUP(League[[#This Row],[Memberno]],Club5k[],5,FALSE),\"\")","v":5},{"$f":"IFERROR(VLOOKUP(League[[#This Row],[Memberno]],Halfmarathon[Mem]:Halfmarathon[Points],4,0),\"\")","v":""},{"$f":"IFERROR(VLOOKUP(League[[#This Row],[Memberno]],Marathon[],4,FALSE),\"\")","v":""},{"$f":"IFERROR(VLOOKUP(League[[#This Row],[Memberno]],Table18[],5,FALSE),\"\")","v":""},{"$f":"IFERROR(VLOOKUP(League[[#This Row],[Memberno]],tenK[[Member '#]:[Total Points]],2,FALSE),\"\")","v":35},{"$f":"IFERROR(VLOOKUP(League[[#This Row],[Memberno]],Thunderrun[],3,FALSE),\"\")","v":""}]
[null,"Vicki Moran",{"$f":"IFERROR(VLOOKUP(League[[#This Row],[Name]],members,2,FALSE),\"\")","v":228}," ",{"$f":"COUNT(League[[#This Row],[XC]:[Thunder Run]])","v":2},"F",{"$f":"VLOOKUP(League[[#This Row],[Memberno]],Allmembers[],7,FALSE)","v":"FS"},{"$f":"RANK(League[[#This Row],[Total Points]],League[Total Points])","v":68},{"$f":"IF(League[[#This Row],[Gender]]=\"M\",RANK(League[Total Points],mrank),\"\")","v":""},{"$f":"IF(League[[#This Row],[Gender]]=\"F\",RANK(League[Total Points],wrank),\"\")","v":25},{"$f":"SUM(League[[#This Row],[XC]:[Thunder Run]])","v":76},{"$f":"IFERROR(VLOOKUP(League[[#This Row],[Memberno]],XC[[Mem]:[Total Points]],5,0),\"\")","v":""},{"$f":"IFERROR(VLOOKUP(League[[#This Row],[Parkrun '#]],Parkrun[],7,FALSE),\"\")","v":""},{"$f":"IFERROR(VLOOKUP(League[[#This Row],[Memberno]],Club5k[],5,FALSE),\"\")","v":""},{"$f":"IFERROR(VLOOKUP(League[[#This Row],[Memberno]],Halfmarathon[Mem]:Halfmarathon[Points],4,0),\"\")","v":""},{"$f":"IFERROR(VLOOKUP(League[[#This Row],[Memberno]],Marathon[],4,FALSE),\"\")","v":""},{"$f":"IFERROR(VLOOKUP(League[[#This Row],[Memberno]],Table18[],5,FALSE),\"\")","v":37},{"$f":"IFERROR(VLOOKUP(League[[#This Row],[Memberno]],tenK[[Member '#]:[Total Points]],2,FALSE),\"\")","v":39},{"$f":"IFERROR(VLOOKUP(League[[#This Row],[Memberno]],Thunderrun[],3,FALSE),\"\")","v":""}]
[null,"Johanna Wood",{"$f":"IFERROR(VLOOKUP(League[[#This Row],[Name]],members,2,FALSE),\"\")","v":143}," ",{"$f":"COUNT(League[[#This Row],[XC]:[Thunder Run]])","v":2},"F",{"$f":"VLOOKUP(League[[#This Row],[Memberno]],Allmembers[],7,FALSE)","v":"FV45"},{"$f":"RANK(League[[#This Row],[Total Points]],League[Total Points])","v":72},{"$f":"IF(League[[#This Row],[Gender]]=\"M\",RANK(League[Total Points],mrank),\"\")","v":""},{"$f":"IF(League[[#This Row],[Gender]]=\"F\",RANK(League[Total Points],wrank),\"\")","v":28},{"$f":"SUM(League[[#This Row],[XC]:[Thunder Run]])","v":66},{"$f":"IFERROR(VLOOKUP(League[[#This Row],[Memberno]],XC[[Mem]:[Total Points]],5,0),\"\")","v":""},{"$f":"IFERROR(VLOOKUP(League[[#This Row],[Parkrun '#]],Parkrun[],7,FALSE),\"\")","v":""},{"$f":"IFERROR(VLOOKUP(League[[#This Row],[Memberno]],Club5k[],5,FALSE),\"\")","v":25},{"$f":"IFERROR(VLOOKUP(League[[#This Row],[Memberno]],Halfmarathon[Mem]:Halfmarathon[Points],4,0),\"\")","v":""},{"$f":"IFERROR(VLOOKUP(League[[#This Row],[Memberno]],Marathon[],4,FALSE),\"\")","v":""},{"$f":"IFERROR(VLOOKUP(League[[#This Row],[Memberno]],Table18[],5,FALSE),\"\")","v":""},{"$f":"IFERROR(VLOOKUP(League[[#This Row],[Memberno]],tenK[[Member '#]:[Total Points]],2,FALSE),\"\")","v":41},{"$f":"IFERROR(VLOOKUP(League[[#This Row],[Memberno]],Thunderrun[],3,FALSE),\"\")","v":""}]
[null,"Robert Goldhawk",{"$f":"IFERROR(VLOOKUP(League[[#This Row],[Name]],members,2,FALSE),\"\")","v":258}," ",{"$f":"COUNT(League[[#This Row],[XC]:[Thunder Run]])","v":2},"M",{"$f":"VLOOKUP(League[[#This Row],[Memberno]],Allmembers[],7,FALSE)","v":"MV40"},{"$f":"RANK(League[[#This Row],[Total Points]],League[Total Points])","v":72},{"$f":"IF(League[[#This Row],[Gender]]=\"M\",RANK(League[Total Points],mrank),\"\")","v":45},{"$f":"IF(League[[#This Row],[Gender]]=\"F\",RANK(League[Total Points],wrank),\"\")","v":""},{"$f":"SUM(League[[#This Row],[XC]:[Thunder Run]])","v":66},{"$f":"IFERROR(VLOOKUP(League[[#This Row],[Memberno]],XC[[Mem]:[Total Points]],5,0),\"\")","v":""},{"$f":"IFERROR(VLOOKUP(League[[#This Row],[Parkrun '#]],Parkrun[],7,FALSE),\"\")","v":""},{"$f":"IFERROR(VLOOKUP(League[[#This Row],[Memberno]],Club5k[],5,FALSE),\"\")","v":""},{"$f":"IFERROR(VLOOKUP(League[[#This Row],[Memberno]],Halfmarathon[Mem]:Halfmarathon[Points],4,0),\"\")","v":43},{"$f":"IFERROR(VLOOKUP(League[[#This Row],[Memberno]],Marathon[],4,FALSE),\"\")","v":""},{"$f":"IFERROR(VLOOKUP(League[[#This Row],[Memberno]],Table18[],5,FALSE),\"\")","v":""},{"$f":"IFERROR(VLOOKUP(League[[#This Row],[Memberno]],tenK[[Member '#]:[Total Points]],2,FALSE),\"\")","v":23},{"$f":"IFERROR(VLOOKUP(League[[#This Row],[Memberno]],Thunderrun[],3,FALSE),\"\")","v":""}]
[null,"Jon Stagg",{"$f":"IFERROR(VLOOKUP(League[[#This Row],[Name]],members,2,FALSE),\"\")","v":273},null,{"$f":"COUNT(League[[#This Row],[XC]:[Thunder Run]])","v":2},"M",{"$f":"VLOOKUP(League[[#This Row],[Memberno]],Allmembers[],7,FALSE)","v":"MS"},{"$f":"RANK(League[[#This Row],[Total Points]],League[Total Points])","v":74},{"$f":"IF(League[[#This Row],[Gender]]=\"M\",RANK(League[Total Points],mrank),\"\")","v":46},{"$f":"IF(League[[#This Row],[Gender]]=\"F\",RANK(League[Total Points],wrank),\"\")","v":""},{"$f":"SUM(League[[#This Row],[XC]:[Thunder Run]])","v":64},{"$f":"IFERROR(VLOOKUP(League[[#This Row],[Memberno]],XC[[Mem]:[Total Points]],5,0),\"\")","v":""},{"$f":"IFERROR(VLOOKUP(League[[#This Row],[Parkrun '#]],Parkrun[],7,FALSE),\"\")","v":""},{"$f":"IFERROR(VLOOKUP(League[[#This Row],[Memberno]],Club5k[],5,FALSE),\"\")","v":""},{"$f":"IFERROR(VLOOKUP(League[[#This Row],[Memberno]],Halfmarathon[Mem]:Halfmarathon[Points],4,0),\"\")","v":33},{"$f":"IFERROR(VLOOKUP(League[[#This Row],[Memberno]],Marathon[],4,FALSE),\"\")","v":""},{"$f":"IFERROR(VLOOKUP(League[[#This Row],[Memberno]],Table18[],5,FALSE),\"\")","v":""},{"$f":"IFERROR(VLOOKUP(League[[#This Row],[Memberno]],tenK[[Member '#]:[Total Points]],2,FALSE),\"\")","v":31},{"$f":"IFERROR(VLOOKUP(League[[#This Row],[Memberno]],Thunderrun[],3,FALSE),\"\")","v":""}]
[null,"Paul Brewster",194," ",{"$f":"COUNT(League[[#This Row],[XC]:[Thunder Run]])","v":2},"M",{"$f":"VLOOKUP(League[[#This Row],[Memberno]],Allmembers[],7,FALSE)","v":"MV50"},{"$f":"RANK(League[[#This Row],[Total Points]],League[Total Points])","v":75},{"$f":"IF(League[[#This Row],[Gender]]=\"M\",RANK(League[Total Points],mrank),\"\")","v":47},{"$f":"IF(League[[#This Row],[Gender]]=\"F\",RANK(League[Total Points],wrank),\"\")","v":""},{"$f":"SUM(League[[#This Row],[XC]:[Thunder Run]])","v":60},{"$f":"IFERROR(VLOOKUP(League[[#This Row],[Memberno]],XC[[Mem]:[Total Points]],5,0),\"\")","v":""},{"$f":"IFERROR(VLOOKUP(League[[#This Row],[Parkrun '#]],Parkrun[],7,FALSE),\"\")","v":""},{"$f":"IFERROR(VLOOKUP(League[[#This Row],[Memberno]],Club5k[],5,FALSE),\"\")","v":5},{"$f":"IFERROR(VLOOKUP(League[[#This Row],[Memberno]],Halfmarathon[Mem]:Halfmarathon[Points],4,0),\"\")","v":""},{"$f":"IFERROR(VLOOKUP(League[[#This Row],[Memberno]],Marathon[],4,FALSE),\"\")","v":""},{"$f":"IFERROR(VLOOKUP(League[[#This Row],[Memberno]],Table18[],5,FALSE),\"\")","v":""},{"$f":"IFERROR(VLOOKUP(League[[#This Row],[Memberno]],tenK[[Member '#]:[Total Points]],2,FALSE),\"\")","v":55},{"$f":"IFERROR(VLOOKUP(League[[#This Row],[Memberno]],Thunderrun[],3,FALSE),\"\")","v":""}]
[null,"Alison Cole",256," ",{"$f":"COUNT(League[[#This Row],[XC]:[Thunder Run]])","v":2},"F",{"$f":"VLOOKUP(League[[#This Row],[Memberno]],Allmembers[],7,FALSE)","v":"FV35"},{"$f":"RANK(League[[#This Row],[Total Points]],League[Total Points])","v":76},{"$f":"IF(League[[#This Row],[Gender]]=\"M\",RANK(League[Total Points],mrank),\"\")","v":""},{"$f":"IF(League[[#This Row],[Gender]]=\"F\",RANK(League[Total Points],wrank),\"\")","v":29},{"$f":"SUM(League[[#This Row],[XC]:[Thunder Run]])","v":59},{"$f":"IFERROR(VLOOKUP(League[[#This Row],[Memberno]],XC[[Mem]:[Total Points]],5,0),\"\")","v":""},{"$f":"IFERROR(VLOOKUP(League[[#This Row],[Parkrun '#]],Parkrun[],7,FALSE),\"\")","v":""},{"$f":"IFERROR(VLOOKUP(League[[#This Row],[Memberno]],Club5k[],5,FALSE),\"\")","v":10},{"$f":"IFERROR(VLOOKUP(League[[#This Row],[Memberno]],Halfmarathon[Mem]:Halfmarathon[Points],4,0),\"\")","v":""},{"$f":"IFERROR(VLOOKUP(League[[#This Row],[Memberno]],Marathon[],4,FALSE),\"\")","v":""},{"$f":"IFERROR(VLOOKUP(League[[#This Row],[Memberno]],Table18[],5,FALSE),\"\")","v":""},{"$f":"IFERROR(VLOOKUP(League[[#This Row],[Memberno]],tenK[[Member '#]:[Total Points]],2,FALSE),\"\")","v":49},{"$f":"IFERROR(VLOOKUP(League[[#This Row],[Memberno]],Thunderrun[],3,FALSE),\"\")","v":""}]
[null,"Catriona Davis",{"$f":"IFERROR(VLOOKUP(League[[#This Row],[Name]],members,2,FALSE),\"\")","v":234}," ",{"$f":"COUNT(League[[#This Row],[XC]:[Thunder Run]])","v":2},"F",{"$f":"VLOOKUP(League[[#This Row],[Memberno]],Allmembers[],7,FALSE)","v":"FV35"},{"$f":"RANK(League[[#This Row],[Total Points]],League[Total Points])","v":77},{"$f":"IF(League[[#This Row],[Gender]]=\"M\",RANK(League[Total Points],mrank),\"\")","v":""},{"$f":"IF(League[[#This Row],[Gender]]=\"F\",RANK(League[Total Points],wrank),\"\")","v":30},{"$f":"SUM(League[[#This Row],[XC]:[Thunder Run]])","v":55},{"$f":"IFERROR(VLOOKUP(League[[#This Row],[Memberno]],XC[[Mem]:[Total Points]],5,0),\"\")","v":""},{"$f":"IFERROR(VLOOKUP(League[[#This Row],[Parkrun '#]],Parkrun[],7,FALSE),\"\")","v":""},{"$f":"IFERROR(VLOOKUP(League[[#This Row],[Memberno]],Club5k[],5,FALSE),\"\")","v":5},{"$f":"IFERROR(VLOOKUP(League[[#This Row],[Memberno]],Halfmarathon[Mem]:Halfmarathon[Points],4,0),\"\")","v":""},{"$f":"IFERROR(VLOOKUP(League[[#This Row],[Memberno]],Marathon[],4,FALSE),\"\")","v":""},{"$f":"IFERROR(VLOOKUP(League[[#This Row],[Memberno]],Table18[],5,FALSE),\"\")","v":""},{"$f":"IFERROR(VLOOKUP(League[[#This Row],[Memberno]],tenK[[Member '#]:[Total Points]],2,FALSE),\"\")","v":50},{"$f":"IFERROR(VLOOKUP(League[[#This Row],[Memberno]],Thunderrun[],3,FALSE),\"\")","v":""}]
[null,"Victoria Johns",275," ",{"$f":"COUNT(League[[#This Row],[XC]:[Thunder Run]])","v":2},"F",{"$f":"VLOOKUP(League[[#This Row],[Memberno]],Allmembers[],7,FALSE)","v":"FS"},{"$f":"RANK(League[[#This Row],[Total Points]],League[Total Points])","v":77},{"$f":"IF(League[[#This Row],[Gender]]=\"M\",RANK(League[Total Points],mrank),\"\")","v":""},{"$f":"IF(League[[#This Row],[Gender]]=\"F\",RANK(League[Total Points],wrank),\"\")","v":30},{"$f":"SUM(League[[#This Row],[XC]:[Thunder Run]])","v":55},{"$f":"IFERROR(VLOOKUP(League[[#This Row],[Memberno]],XC[[Mem]:[Total Points]],5,0),\"\")","v":""},{"$f":"IFERROR(VLOOKUP(League[[#This Row],[Parkrun '#]],Parkrun[],7,FALSE),\"\")","v":""},{"$f":"IFERROR(VLOOKUP(League[[#This Row],[Memberno]],Club5k[],5,FALSE),\"\")","v":15},{"$f":"IFERROR(VLOOKUP(League[[#This Row],[Memberno]],Halfmarathon[Mem]:Halfmarathon[Points],4,0),\"\")","v":""},{"$f":"IFERROR(VLOOKUP(League[[#This Row],[Memberno]],Marathon[],4,FALSE),\"\")","v":""},{"$f":"IFERROR(VLOOKUP(League[[#This Row],[Memberno]],Table18[],5,FALSE),\"\")","v":""},{"$f":"IFERROR(VLOOKUP(League[[#This Row],[Memberno]],tenK[[Member '#]:[Total Points]],2,FALSE),\"\")","v":40},{"$f":"IFERROR(VLOOKUP(League[[#This Row],[Memberno]],Thunderrun[],3,FALSE),\"\")","v":""}]
[null,"Christine Esson",{"$f":"IFERROR(VLOOKUP(League[[#This Row],[Name]],members,2,FALSE),\"\")","v":270},430429,{"$f":"COUNT(League[[#This Row],[XC]:[Thunder Run]])","v":2},"F",{"$f":"VLOOKUP(League[[#This Row],[Memberno]],Allmembers[],7,FALSE)","v":"FV45"},{"$f":"RANK(League[[#This Row],[Total Points]],League[Total Points])","v":79},{"$f":"IF(League[[#This Row],[Gender]]=\"M\",RANK(League[Total Points],mrank),\"\")","v":""},{"$f":"IF(League[[#This Row],[Gender]]=\"F\",RANK(League[Total Points],wrank),\"\")","v":32},{"$f":"SUM(League[[#This Row],[XC]:[Thunder Run]])","v":52},{"$f":"IFERROR(VLOOKUP(League[[#This Row],[Memberno]],XC[[Mem]:[Total Points]],5,0),\"\")","v":""},{"$f":"IFERROR(VLOOKUP(League[[#This Row],[Parkrun '#]],Parkrun[],7,FALSE),\"\")","v":37},{"$f":"IFERROR(VLOOKUP(League[[#This Row],[Memberno]],Club5k[],5,FALSE),\"\")","v":15},{"$f":"IFERROR(VLOOKUP(League[[#This Row],[Memberno]],Halfmarathon[Mem]:Halfmarathon[Points],4,0),\"\")","v":""},{"$f":"IFERROR(VLOOKUP(League[[#This Row],[Memberno]],Marathon[],4,FALSE),\"\")","v":""},{"$f":"IFERROR(VLOOKUP(League[[#This Row],[Memberno]],Table18[],5,FALSE),\"\")","v":""},{"$f":"IFERROR(VLOOKUP(League[[#This Row],[Memberno]],tenK[[Member '#]:[Total Points]],2,FALSE),\"\")","v":""},{"$f":"IFERROR(VLOOKUP(League[[#This Row],[Memberno]],Thunderrun[],3,FALSE),\"\")","v":""}]
[null,"Helen MacFarlane",282," ",{"$f":"COUNT(League[[#This Row],[XC]:[Thunder Run]])","v":2},"F",{"$f":"VLOOKUP(League[[#This Row],[Memberno]],Allmembers[],7,FALSE)","v":"FV35"},{"$f":"RANK(League[[#This Row],[Total Points]],League[Total Points])","v":79},{"$f":"IF(League[[#This Row],[Gender]]=\"M\",RANK(League[Total Points],mrank),\"\")","v":""},{"$f":"IF(League[[#This Row],[Gender]]=\"F\",RANK(League[Total Points],wrank),\"\")","v":32},{"$f":"SUM(League[[#This Row],[XC]:[Thunder Run]])","v":52},{"$f":"IFERROR(VLOOKUP(League[[#This Row],[Memberno]],XC[[Mem]:[Total Points]],5,0),\"\")","v":""},{"$f":"IFERROR(VLOOKUP(League[[#This Row],[Parkrun '#]],Parkrun[],7,FALSE),\"\")","v":""},{"$f":"IFERROR(VLOOKUP(League[[#This Row],[Memberno]],Club5k[],5,FALSE),\"\")","v":5},{"$f":"IFERROR(VLOOKUP(League[[#This Row],[Memberno]],Halfmarathon[Mem]:Halfmarathon[Points],4,0),\"\")","v":""},{"$f":"IFERROR(VLOOKUP(League[[#This Row],[Memberno]],Marathon[],4,FALSE),\"\")","v":""},{"$f":"IFERROR(VLOOKUP(League[[#This Row],[Memberno]],Table18[],5,FALSE),\"\")","v":47},{"$f":"IFERROR(VLOOKUP(League[[#This Row],[Memberno]],tenK[[Member '#]:[Total Points]],2,FALSE),\"\")","v":""},{"$f":"IFERROR(VLOOKUP(League[[#This Row],[Memberno]],Thunderrun[],3,FALSE),\"\")","v":""}]
[null,"Ben Turner",189,516185,{"$f":"COUNT(League[[#This Row],[XC]:[Thunder Run]])","v":2},"M",{"$f":"VLOOKUP(League[[#This Row],[Memberno]],Allmembers[],7,FALSE)","v":"MV40"},{"$f":"RANK(League[[#This Row],[Total Points]],League[Total Points])","v":81},{"$f":"IF(League[[#This Row],[Gender]]=\"M\",RANK(League[Total Points],mrank),\"\")","v":48},{"$f":"IF(League[[#This Row],[Gender]]=\"F\",RANK(League[Total Points],wrank),\"\")","v":""},{"$f":"SUM(League[[#This Row],[XC]:[Thunder Run]])","v":50},{"$f":"IFERROR(VLOOKUP(League[[#This Row],[Memberno]],XC[[Mem]:[Total Points]],5,0),\"\")","v":31},{"$f":"IFERROR(VLOOKUP(League[[#This Row],[Parkrun '#]],Parkrun[],7,FALSE),\"\")","v":19},{"$f":"IFERROR(VLOOKUP(League[[#This Row],[Memberno]],Club5k[],5,FALSE),\"\")","v":""},{"$f":"IFERROR(VLOOKUP(League[[#This Row],[Memberno]],Halfmarathon[Mem]:Halfmarathon[Points],4,0),\"\")","v":""},{"$f":"IFERROR(VLOOKUP(League[[#This Row],[Memberno]],Marathon[],4,FALSE),\"\")","v":""},{"$f":"IFERROR(VLOOKUP(League[[#This Row],[Memberno]],Table18[],5,FALSE),\"\")","v":""},{"$f":"IFERROR(VLOOKUP(League[[#This Row],[Memberno]],tenK[[Member '#]:[Total Points]],2,FALSE),\"\")","v":""},{"$f":"IFERROR(VLOOKUP(League[[#This Row],[Memberno]],Thunderrun[],3,FALSE),\"\")","v":""}]
[null,"Tim Mauchline",{"$f":"IFERROR(VLOOKUP(League[[#This Row],[Name]],members,2,FALSE),\"\")","v":103},null,{"$f":"COUNT(League[[#This Row],[XC]:[Thunder Run]])","v":1},"M",{"$f":"VLOOKUP(League[[#This Row],[Memberno]],Allmembers[],7,FALSE)","v":"MS"},{"$f":"RANK(League[[#This Row],[Total Points]],League[Total Points])","v":81},{"$f":"IF(League[[#This Row],[Gender]]=\"M\",RANK(League[Total Points],mrank),\"\")","v":48},{"$f":"IF(League[[#This Row],[Gender]]=\"F\",RANK(League[Total Points],wrank),\"\")","v":""},{"$f":"SUM(League[[#This Row],[XC]:[Thunder Run]])","v":50},{"$f":"IFERROR(VLOOKUP(League[[#This Row],[Memberno]],XC[[Mem]:[Total Points]],5,0),\"\")","v":50},{"$f":"IFERROR(VLOOKUP(League[[#This Row],[Parkrun '#]],Parkrun[],7,FALSE),\"\")","v":""},{"$f":"IFERROR(VLOOKUP(League[[#This Row],[Memberno]],Club5k[],5,FALSE),\"\")","v":""},{"$f":"IFERROR(VLOOKUP(League[[#This Row],[Memberno]],Halfmarathon[Mem]:Halfmarathon[Points],4,0),\"\")","v":""},{"$f":"IFERROR(VLOOKUP(League[[#This Row],[Memberno]],Marathon[],4,FALSE),\"\")","v":""},{"$f":"IFERROR(VLOOKUP(League[[#This Row],[Memberno]],Table18[],5,FALSE),\"\")","v":""},{"$f":"IFERROR(VLOOKUP(League[[#This Row],[Memberno]],tenK[[Member '#]:[Total Points]],2,FALSE),\"\")","v":""},{"$f":"IFERROR(VLOOKUP(League[[#This Row],[Memberno]],Thunderrun[],3,FALSE),\"\")","v":""}]
[null,"Pierre-Louis Gatti",{"$f":"IFERROR(VLOOKUP(League[[#This Row],[Name]],members,2,FALSE),\"\")","v":233},351148,{"$f":"COUNT(League[[#This Row],[XC]:[Thunder Run]])","v":3},"M",{"$f":"VLOOKUP(League[[#This Row],[Memberno]],Allmembers[],7,FALSE)","v":"MS"},{"$f":"RANK(League[[#This Row],[Total Points]],League[Total Points])","v":83},{"$f":"IF(League[[#This Row],[Gender]]=\"M\",RANK(League[Total Points],mrank),\"\")","v":50},{"$f":"IF(League[[#This Row],[Gender]]=\"F\",RANK(League[Total Points],wrank),\"\")","v":""},{"$f":"SUM(League[[#This Row],[XC]:[Thunder Run]])","v":49},{"$f":"IFERROR(VLOOKUP(League[[#This Row],[Memberno]],XC[[Mem]:[Total Points]],5,0),\"\")","v":""},{"$f":"IFERROR(VLOOKUP(League[[#This Row],[Parkrun '#]],Parkrun[],7,FALSE),\"\")","v":18},{"$f":"IFERROR(VLOOKUP(League[[#This Row],[Memberno]],Club5k[],5,FALSE),\"\")","v":5},{"$f":"IFERROR(VLOOKUP(League[[#This Row],[Memberno]],Halfmarathon[Mem]:Halfmarathon[Points],4,0),\"\")","v":26},{"$f":"IFERROR(VLOOKUP(League[[#This Row],[Memberno]],Marathon[],4,FALSE),\"\")","v":""},{"$f":"IFERROR(VLOOKUP(League[[#This Row],[Memberno]],Table18[],5,FALSE),\"\")","v":""},{"$f":"IFERROR(VLOOKUP(League[[#This Row],[Memberno]],tenK[[Member '#]:[Total Points]],2,FALSE),\"\")","v":""},{"$f":"IFERROR(VLOOKUP(League[[#This Row],[Memberno]],Thunderrun[],3,FALSE),\"\")","v":""}]
[null,"Alexandra O'DONOVAN",{"$f":"IFERROR(VLOOKUP(League[[#This Row],[Name]],members,2,FALSE),\"\")","v":250},407032,{"$f":"COUNT(League[[#This Row],[XC]:[Thunder Run]])","v":1},"F",{"$f":"VLOOKUP(League[[#This Row],[Memberno]],Allmembers[],7,FALSE)","v":"FS"},{"$f":"RANK(League[[#This Row],[Total Points]],League[Total Points])","v":84},{"$f":"IF(League[[#This Row],[Gender]]=\"M\",RANK(League[Total Points],mrank),\"\")","v":""},{"$f":"IF(League[[#This Row],[Gender]]=\"F\",RANK(League[Total Points],wrank),\"\")","v":34},{"$f":"SUM(League[[#This Row],[XC]:[Thunder Run]])","v":48},{"$f":"IFERROR(VLOOKUP(League[[#This Row],[Memberno]],XC[[Mem]:[Total Points]],5,0),\"\")","v":""},{"$f":"IFERROR(VLOOKUP(League[[#This Row],[Parkrun '#]],Parkrun[],7,FALSE),\"\")","v":48},{"$f":"IFERROR(VLOOKUP(League[[#This Row],[Memberno]],Club5k[],5,FALSE),\"\")","v":""},{"$f":"IFERROR(VLOOKUP(League[[#This Row],[Memberno]],Halfmarathon[Mem]:Halfmarathon[Points],4,0),\"\")","v":""},{"$f":"IFERROR(VLOOKUP(League[[#This Row],[Memberno]],Marathon[],4,FALSE),\"\")","v":""},{"$f":"IFERROR(VLOOKUP(League[[#This Row],[Memberno]],Table18[],5,FALSE),\"\")","v":""},{"$f":"IFERROR(VLOOKUP(League[[#This Row],[Memberno]],tenK[[Member '#]:[Total Points]],2,FALSE),\"\")","v":""},{"$f":"IFERROR(VLOOKUP(League[[#This Row],[Memberno]],Thunderrun[],3,FALSE),\"\")","v":""}]
[null,"Philip Wigg",285,"  ",{"$f":"COUNT(League[[#This Row],[XC]:[Thunder Run]])","v":2},"M",{"$f":"VLOOKUP(League[[#This Row],[Memberno]],Allmembers[],7,FALSE)","v":"MS"},{"$f":"RANK(League[[#This Row],[Total Points]],League[Total Points])","v":84},{"$f":"IF(League[[#This Row],[Gender]]=\"M\",RANK(League[Total Points],mrank),\"\")","v":51},{"$f":"IF(League[[#This Row],[Gender]]=\"F\",RANK(League[Total Points],wrank),\"\")","v":""},{"$f":"SUM(League[[#This Row],[XC]:[Thunder Run]])","v":48},{"$f":"IFERROR(VLOOKUP(League[[#This Row],[Memberno]],XC[[Mem]:[Total Points]],5,0),\"\")","v":""},{"$f":"IFERROR(VLOOKUP(League[[#This Row],[Parkrun '#]],Parkrun[],7,FALSE),\"\")","v":""},{"$f":"IFERROR(VLOOKUP(League[[#This Row],[Memberno]],Club5k[],5,FALSE),\"\")","v":20},{"$f":"IFERROR(VLOOKUP(League[[#This Row],[Memberno]],Halfmarathon[Mem]:Halfmarathon[Points],4,0),\"\")","v":""},{"$f":"IFERROR(VLOOKUP(League[[#This Row],[Memberno]],Marathon[],4,FALSE),\"\")","v":""},{"$f":"IFERROR(VLOOKUP(League[[#This Row],[Memberno]],Table18[],5,FALSE),\"\")","v":""},{"$f":"IFERROR(VLOOKUP(League[[#This Row],[Memberno]],tenK[[Member '#]:[Total Points]],2,FALSE),\"\")","v":28},{"$f":"IFERROR(VLOOKUP(League[[#This Row],[Memberno]],Thunderrun[],3,FALSE),\"\")","v":""}]
[null,"Katherine Caris-Harris",314,null,{"$f":"COUNT(League[[#This Row],[XC]:[Thunder Run]])","v":1},"F",{"$f":"VLOOKUP(League[[#This Row],[Memberno]],Allmembers[],7,FALSE)","v":"FV35"},{"$f":"RANK(League[[#This Row],[Total Points]],League[Total Points])","v":86},{"$f":"IF(League[[#This Row],[Gender]]=\"M\",RANK(League[Total Points],mrank),\"\")","v":""},{"$f":"IF(League[[#This Row],[Gender]]=\"F\",RANK(League[Total Points],wrank),\"\")","v":35},{"$f":"SUM(League[[#This Row],[XC]:[Thunder Run]])","v":47},{"$f":"IFERROR(VLOOKUP(League[[#This Row],[Memberno]],XC[[Mem]:[Total Points]],5,0),\"\")","v":47},{"$f":"IFERROR(VLOOKUP(League[[#This Row],[Parkrun '#]],Parkrun[],7,FALSE),\"\")","v":""},{"$f":"IFERROR(VLOOKUP(League[[#This Row],[Memberno]],Club5k[],5,FALSE),\"\")","v":""},{"$f":"IFERROR(VLOOKUP(League[[#This Row],[Memberno]],Halfmarathon[Mem]:Halfmarathon[Points],4,0),\"\")","v":""},{"$f":"IFERROR(VLOOKUP(League[[#This Row],[Memberno]],Marathon[],4,FALSE),\"\")","v":""},{"$f":"IFERROR(VLOOKUP(League[[#This Row],[Memberno]],Table18[],5,FALSE),\"\")","v":""},{"$f":"IFERROR(VLOOKUP(League[[#This Row],[Memberno]],tenK[[Member '#]:[Total Points]],2,FALSE),\"\")","v":""},{"$f":"IFERROR(VLOOKUP(League[[#This Row],[Memberno]],Thunderrun[],3,FALSE),\"\")","v":""}]
[null,"Thomas Hallam",280," ",{"$f":"COUNT(League[[#This Row],[XC]:[Thunder Run]])","v":1},"M",{"$f":"VLOOKUP(League[[#This Row],[Memberno]],Allmembers[],7,FALSE)","v":"MS"},{"$f":"RANK(League[[#This Row],[Total Points]],League[Total Points])","v":86},{"$f":"IF(League[[#This Row],[Gender]]=\"M\",RANK(League[Total Points],mrank),\"\")","v":52},{"$f":"IF(League[[#This Row],[Gender]]=\"F\",RANK(League[Total Points],wrank),\"\")","v":""},{"$f":"SUM(League[[#This Row],[XC]:[Thunder Run]])","v":47},{"$f":"IFERROR(VLOOKUP(League[[#This Row],[Memberno]],XC[[Mem]:[Total Points]],5,0),\"\")","v":""},{"$f":"IFERROR(VLOOKUP(League[[#This Row],[Parkrun '#]],Parkrun[],7,FALSE),\"\")","v":""},{"$f":"IFERROR(VLOOKUP(League[[#This Row],[Memberno]],Club5k[],5,FALSE),\"\")","v":""},{"$f":"IFERROR(VLOOKUP(League[[#This Row],[Memberno]],Halfmarathon[Mem]:Halfmarathon[Points],4,0),\"\")","v":""},{"$f":"IFERROR(VLOOKUP(League[[#This Row],[Memberno]],Marathon[],4,FALSE),\"\")","v":""},{"$f":"IFERROR(VLOOKUP(League[[#This Row],[Memberno]],Table18[],5,FALSE),\"\")","v":""},{"$f":"IFERROR(VLOOKUP(League[[#This Row],[Memberno]],tenK[[Member '#]:[Total Points]],2,FALSE),\"\")","v":47},{"$f":"IFERROR(VLOOKUP(League[[#This Row],[Memberno]],Thunderrun[],3,FALSE),\"\")","v":""}]
[null,"Jonathan Budge",279," ",{"$f":"COUNT(League[[#This Row],[XC]:[Thunder Run]])","v":2},"M",{"$f":"VLOOKUP(League[[#This Row],[Memberno]],Allmembers[],7,FALSE)","v":"MS"},{"$f":"RANK(League[[#This Row],[Total Points]],League[Total Points])","v":88},{"$f":"IF(League[[#This Row],[Gender]]=\"M\",RANK(League[Total Points],mrank),\"\")","v":53},{"$f":"IF(League[[#This Row],[Gender]]=\"F\",RANK(League[Total Points],wrank),\"\")","v":""},{"$f":"SUM(League[[#This Row],[XC]:[Thunder Run]])","v":44},{"$f":"IFERROR(VLOOKUP(League[[#This Row],[Memberno]],XC[[Mem]:[Total Points]],5,0),\"\")","v":""},{"$f":"IFERROR(VLOOKUP(League[[#This Row],[Parkrun '#]],Parkrun[],7,FALSE),\"\")","v":""},{"$f":"IFERROR(VLOOKUP(League[[#This Row],[Memberno]],Club5k[],5,FALSE),\"\")","v":5},{"$f":"IFERROR(VLOOKUP(League[[#This Row],[Memberno]],Halfmarathon[Mem]:Halfmarathon[Points],4,0),\"\")","v":""},{"$f":"IFERROR(VLOOKUP(League[[#This Row],[Memberno]],Marathon[],4,FALSE),\"\")","v":""},{"$f":"IFERROR(VLOOKUP(League[[#This Row],[Memberno]],Table18[],5,FALSE),\"\")","v":""},{"$f":"IFERROR(VLOOKUP(League[[#This Row],[Memberno]],tenK[[Member '#]:[Total Points]],2,FALSE),\"\")","v":39},{"$f":"IFERROR(VLOOKUP(League[[#This Row],[Memberno]],Thunderrun[],3,FALSE),\"\")","v":""}]
[null,"Colin Wareham",1,403208,{"$f":"COUNT(League[[#This Row],[XC]:[Thunder Run]])","v":2},"M",{"$f":"VLOOKUP(League[[#This Row],[Memberno]],Allmembers[],7,FALSE)","v":"MV40"},{"$f":"RANK(League[[#This Row],[Total Points]],League[Total Points])","v":89},{"$f":"IF(League[[#This Row],[Gender]]=\"M\",RANK(League[Total Points],mrank),\"\")","v":54},{"$f":"IF(League[[#This Row],[Gender]]=\"F\",RANK(League[Total Points],wrank),\"\")","v":""},{"$f":"SUM(League[[#This Row],[XC]:[Thunder Run]])","v":40},{"$f":"IFERROR(VLOOKUP(League[[#This Row],[Memberno]],XC[[Mem]:[Total Points]],5,0),\"\")","v":""},{"$f":"IFERROR(VLOOKUP(League[[#This Row],[Parkrun '#]],Parkrun[],7,FALSE),\"\")","v":""},{"$f":"IFERROR(VLOOKUP(League[[#This Row],[Memberno]],Club5k[],5,FALSE),\"\")","v":5},{"$f":"IFERROR(VLOOKUP(League[[#This Row],[Memberno]],Halfmarathon[Mem]:Halfmarathon[Points],4,0),\"\")","v":""},{"$f":"IFERROR(VLOOKUP(League[[#This Row],[Memberno]],Marathon[],4,FALSE),\"\")","v":""},{"$f":"IFERROR(VLOOKUP(League[[#This Row],[Memberno]],Table18[],5,FALSE),\"\")","v":""},{"$f":"IFERROR(VLOOKUP(League[[#This Row],[Memberno]],tenK[[Member '#]:[Total Points]],2,FALSE),\"\")","v":35},{"$f":"IFERROR(VLOOKUP(League[[#This Row],[Memberno]],Thunderrun[],3,FALSE),\"\")","v":""}]
[null,"Jamie Nathan",{"$f":"IFERROR(VLOOKUP(League[[#This Row],[Name]],members,2,FALSE),\"\")","v":203},287837,{"$f":"COUNT(League[[#This Row],[XC]:[Thunder Run]])","v":2},"M",{"$f":"VLOOKUP(League[[#This Row],[Memberno]],Allmembers[],7,FALSE)","v":"MS"},{"$f":"RANK(League[[#This Row],[Total Points]],League[Total Points])","v":89},{"$f":"IF(League[[#This Row],[Gender]]=\"M\",RANK(League[Total Points],mrank),\"\")","v":54},{"$f":"IF(League[[#This Row],[Gender]]=\"F\",RANK(League[Total Points],wrank),\"\")","v":""},{"$f":"SUM(League[[#This Row],[XC]:[Thunder Run]])","v":40},{"$f":"IFERROR(VLOOKUP(League[[#This Row],[Memberno]],XC[[Mem]:[Total Points]],5,0),\"\")","v":""},{"$f":"IFERROR(VLOOKUP(League[[#This Row],[Parkrun '#]],Parkrun[],7,FALSE),\"\")","v":""},{"$f":"IFERROR(VLOOKUP(League[[#This Row],[Memberno]],Club5k[],5,FALSE),\"\")","v":10},{"$f":"IFERROR(VLOOKUP(League[[#This Row],[Memberno]],Halfmarathon[Mem]:Halfmarathon[Points],4,0),\"\")","v":""},{"$f":"IFERROR(VLOOKUP(League[[#This Row],[Memberno]],Marathon[],4,FALSE),\"\")","v":30},{"$f":"IFERROR(VLOOKUP(League[[#This Row],[Memberno]],Table18[],5,FALSE),\"\")","v":""},{"$f":"IFERROR(VLOOKUP(League[[#This Row],[Memberno]],tenK[[Member '#]:[Total Points]],2,FALSE),\"\")","v":""},{"$f":"IFERROR(VLOOKUP(League[[#This Row],[Memberno]],Thunderrun[],3,FALSE),\"\")","v":""}]
[null,"Stephanie Heard",113," ",{"$f":"COUNT(League[[#This Row],[XC]:[Thunder Run]])","v":1},"F",{"$f":"VLOOKUP(League[[#This Row],[Memberno]],Allmembers[],7,FALSE)","v":"FS"},{"$f":"RANK(League[[#This Row],[Total Points]],League[Total Points])","v":89},{"$f":"IF(League[[#This Row],[Gender]]=\"M\",RANK(League[Total Points],mrank),\"\")","v":""},{"$f":"IF(League[[#This Row],[Gender]]=\"F\",RANK(League[Total Points],wrank),\"\")","v":36},{"$f":"SUM(League[[#This Row],[XC]:[Thunder Run]])","v":40},{"$f":"IFERROR(VLOOKUP(League[[#This Row],[Memberno]],XC[[Mem]:[Total Points]],5,0),\"\")","v":""},{"$f":"IFERROR(VLOOKUP(League[[#This Row],[Parkrun '#]],Parkrun[],7,FALSE),\"\")","v":""},{"$f":"IFERROR(VLOOKUP(League[[#This Row],[Memberno]],Club5k[],5,FALSE),\"\")","v":""},{"$f":"IFERROR(VLOOKUP(League[[#This Row],[Memberno]],Halfmarathon[Mem]:Halfmarathon[Points],4,0),\"\")","v":""},{"$f":"IFERROR(VLOOKUP(League[[#This Row],[Memberno]],Marathon[],4,FALSE),\"\")","v":""},{"$f":"IFERROR(VLOOKUP(League[[#This Row],[Memberno]],Table18[],5,FALSE),\"\")","v":""},{"$f":"IFERROR(VLOOKUP(League[[#This Row],[Memberno]],tenK[[Member '#]:[Total Points]],2,FALSE),\"\")","v":40},{"$f":"IFERROR(VLOOKUP(League[[#This Row],[Memberno]],Thunderrun[],3,FALSE),\"\")","v":""}]
[null,"Susan Smith",{"$f":"IFERROR(VLOOKUP(League[[#This Row],[Name]],members,2,FALSE),\"\")","v":176}," ",{"$f":"COUNT(League[[#This Row],[XC]:[Thunder Run]])","v":1},"F",{"$f":"VLOOKUP(League[[#This Row],[Memberno]],Allmembers[],7,FALSE)","v":"FV45"},{"$f":"RANK(League[[#This Row],[Total Points]],League[Total Points])","v":92},{"$f":"IF(League[[#This Row],[Gender]]=\"M\",RANK(League[Total Points],mrank),\"\")","v":""},{"$f":"IF(League[[#This Row],[Gender]]=\"F\",RANK(League[Total Points],wrank),\"\")","v":37},{"$f":"SUM(League[[#This Row],[XC]:[Thunder Run]])","v":39},{"$f":"IFERROR(VLOOKUP(League[[#This Row],[Memberno]],XC[[Mem]:[Total Points]],5,0),\"\")","v":""},{"$f":"IFERROR(VLOOKUP(League[[#This Row],[Parkrun '#]],Parkrun[],7,FALSE),\"\")","v":""},{"$f":"IFERROR(VLOOKUP(League[[#This Row],[Memberno]],Club5k[],5,FALSE),\"\")","v":""},{"$f":"IFERROR(VLOOKUP(League[[#This Row],[Memberno]],Halfmarathon[Mem]:Halfmarathon[Points],4,0),\"\")","v":""},{"$f":"IFERROR(VLOOKUP(League[[#This Row],[Memberno]],Marathon[],4,FALSE),\"\")","v":""},{"$f":"IFERROR(VLOOKUP(League[[#This Row],[Memberno]],Table18[],5,FALSE),\"\")","v":""},{"$f":"IFERROR(VLOOKUP(League[[#This Row],[Memberno]],tenK[[Member '#]:[Total Points]],2,FALSE),\"\")","v":39},{"$f":"IFERROR(VLOOKUP(League[[#This Row],[Memberno]],Thunderrun[],3,FALSE),\"\")","v":""}]
[null,"Helen Pearson",{"$f":"IFERROR(VLOOKUP(League[[#This Row],[Name]],members,2,FALSE),\"\")","v":205}," ",{"$f":"COUNT(League[[#This Row],[XC]:[Thunder Run]])","v":1},"F",{"$f":"VLOOKUP(League[[#This Row],[Memberno]],Allmembers[],7,FALSE)","v":"FV45"},{"$f":"RANK(League[[#This Row],[Total Points]],League[Total Points])","v":93},{"$f":"IF(League[[#This Row],[Gender]]=\"M\",RANK(League[Total Points],mrank),\"\")","v":""},{"$f":"IF(League[[#This Row],[Gender]]=\"F\",RANK(League[Total Points],wrank),\"\")","v":38},{"$f":"SUM(League[[#This Row],[XC]:[Thunder Run]])","v":38},{"$f":"IFERROR(VLOOKUP(League[[#This Row],[Memberno]],XC[[Mem]:[Total Points]],5,0),\"\")","v":""},{"$f":"IFERROR(VLOOKUP(League[[#This Row],[Parkrun '#]],Parkrun[],7,FALSE),\"\")","v":""},{"$f":"IFERROR(VLOOKUP(League[[#This Row],[Memberno]],Club5k[],5,FALSE),\"\")","v":""},{"$f":"IFERROR(VLOOKUP(League[[#This Row],[Memberno]],Halfmarathon[Mem]:Halfmarathon[Points],4,0),\"\")","v":""},{"$f":"IFERROR(VLOOKUP(League[[#This Row],[Memberno]],Marathon[],4,FALSE),\"\")","v":""},{"$f":"IFERROR(VLOOKUP(League[[#This Row],[Memberno]],Table18[],5,FALSE),\"\")","v":""},{"$f":"IFERROR(VLOOKUP(League[[#This Row],[Memberno]],tenK[[Member '#]:[Total Points]],2,FALSE),\"\")","v":38},{"$f":"IFERROR(VLOOKUP(League[[#This Row],[Memberno]],Thunderrun[],3,FALSE),\"\")","v":""}]
[null,"Kay Greenway",{"$f":"IFERROR(VLOOKUP(League[[#This Row],[Name]],members,2,FALSE),\"\")","v":268},687568,{"$f":"COUNT(League[[#This Row],[XC]:[Thunder Run]])","v":1},"F",{"$f":"VLOOKUP(League[[#This Row],[Memberno]],Allmembers[],7,FALSE)","v":"FV45"},{"$f":"RANK(League[[#This Row],[Total Points]],League[Total Points])","v":93},{"$f":"IF(League[[#This Row],[Gender]]=\"M\",RANK(League[Total Points],mrank),\"\")","v":""},{"$f":"IF(League[[#This Row],[Gender]]=\"F\",RANK(League[Total Points],wrank),\"\")","v":38},{"$f":"SUM(League[[#This Row],[XC]:[Thunder Run]])","v":38},{"$f":"IFERROR(VLOOKUP(League[[#This Row],[Memberno]],XC[[Mem]:[Total Points]],5,0),\"\")","v":""},{"$f":"IFERROR(VLOOKUP(League[[#This Row],[Parkrun '#]],Parkrun[],7,FALSE),\"\")","v":38},{"$f":"IFERROR(VLOOKUP(League[[#This Row],[Memberno]],Club5k[],5,FALSE),\"\")","v":""},{"$f":"IFERROR(VLOOKUP(League[[#This Row],[Memberno]],Halfmarathon[Mem]:Halfmarathon[Points],4,0),\"\")","v":""},{"$f":"IFERROR(VLOOKUP(League[[#This Row],[Memberno]],Marathon[],4,FALSE),\"\")","v":""},{"$f":"IFERROR(VLOOKUP(League[[#This Row],[Memberno]],Table18[],5,FALSE),\"\")","v":""},{"$f":"IFERROR(VLOOKUP(League[[#This Row],[Memberno]],tenK[[Member '#]:[Total Points]],2,FALSE),\"\")","v":""},{"$f":"IFERROR(VLOOKUP(League[[#This Row],[Memberno]],Thunderrun[],3,FALSE),\"\")","v":""}]
[null,"Paul Hermsen",{"$f":"IFERROR(VLOOKUP(League[[#This Row],[Name]],members,2,FALSE),\"\")","v":216}," ",{"$f":"COUNT(League[[#This Row],[XC]:[Thunder Run]])","v":1},"M",{"$f":"VLOOKUP(League[[#This Row],[Memberno]],Allmembers[],7,FALSE)","v":"MS"},{"$f":"RANK(League[[#This Row],[Total Points]],League[Total Points])","v":95},{"$f":"IF(League[[#This Row],[Gender]]=\"M\",RANK(League[Total Points],mrank),\"\")","v":56},{"$f":"IF(League[[#This Row],[Gender]]=\"F\",RANK(League[Total Points],wrank),\"\")","v":""},{"$f":"SUM(League[[#This Row],[XC]:[Thunder Run]])","v":37},{"$f":"IFERROR(VLOOKUP(League[[#This Row],[Memberno]],XC[[Mem]:[Total Points]],5,0),\"\")","v":37},{"$f":"IFERROR(VLOOKUP(League[[#This Row],[Parkrun '#]],Parkrun[],7,FALSE),\"\")","v":""},{"$f":"IFERROR(VLOOKUP(League[[#This Row],[Memberno]],Club5k[],5,FALSE),\"\")","v":""},{"$f":"IFERROR(VLOOKUP(League[[#This Row],[Memberno]],Halfmarathon[Mem]:Halfmarathon[Points],4,0),\"\")","v":""},{"$f":"IFERROR(VLOOKUP(League[[#This Row],[Memberno]],Marathon[],4,FALSE),\"\")","v":""},{"$f":"IFERROR(VLOOKUP(League[[#This Row],[Memberno]],Table18[],5,FALSE),\"\")","v":""},{"$f":"IFERROR(VLOOKUP(League[[#This Row],[Memberno]],tenK[[Member '#]:[Total Points]],2,FALSE),\"\")","v":""},{"$f":"IFERROR(VLOOKUP(League[[#This Row],[Memberno]],Thunderrun[],3,FALSE),\"\")","v":""}]
[null,"Sarah Thomas",{"$f":"IFERROR(VLOOKUP(League[[#This Row],[Name]],members,2,FALSE),\"\")","v":201}," ",{"$f":"COUNT(League[[#This Row],[XC]:[Thunder Run]])","v":1},"F",{"$f":"VLOOKUP(League[[#This Row],[Memberno]],Allmembers[],7,FALSE)","v":"F"},{"$f":"RANK(League[[#This Row],[Total Points]],League[Total Points])","v":96},{"$f":"IF(League[[#This Row],[Gender]]=\"M\",RANK(League[Total Points],mrank),\"\")","v":""},{"$f":"IF(League[[#This Row],[Gender]]=\"F\",RANK(League[Total Points],wrank),\"\")","v":40},{"$f":"SUM(League[[#This Row],[XC]:[Thunder Run]])","v":36},{"$f":"IFERROR(VLOOKUP(League[[#This Row],[Memberno]],XC[[Mem]:[Total Points]],5,0),\"\")","v":""},{"$f":"IFERROR(VLOOKUP(League[[#This Row],[Parkrun '#]],Parkrun[],7,FALSE),\"\")","v":""},{"$f":"IFERROR(VLOOKUP(League[[#This Row],[Memberno]],Club5k[],5,FALSE),\"\")","v":""},{"$f":"IFERROR(VLOOKUP(League[[#This Row],[Memberno]],Halfmarathon[Mem]:Halfmarathon[Points],4,0),\"\")","v":""},{"$f":"IFERROR(VLOOKUP(League[[#This Row],[Memberno]],Marathon[],4,FALSE),\"\")","v":""},{"$f":"IFERROR(VLOOKUP(League[[#This Row],[Memberno]],Table18[],5,FALSE),\"\")","v":""},{"$f":"IFERROR(VLOOKUP(League[[#This Row],[Memberno]],tenK[[Member '#]:[Total Points]],2,FALSE),\"\")","v":36},{"$f":"IFERROR(VLOOKUP(League[[#This Row],[Memberno]],Thunderrun[],3,FALSE),\"\")","v":""}]
[null,"Lisa Long",{"$f":"IFERROR(VLOOKUP(League[[#This Row],[Name]],members,2,FALSE),\"\")","v":219},220225,{"$f":"COUNT(League[[#This Row],[XC]:[Thunder Run]])","v":2},"F",{"$f":"VLOOKUP(League[[#This Row],[Memberno]],Allmembers[],7,FALSE)","v":"FV35"},{"$f":"RANK(League[[#This Row],[Total Points]],League[Total Points])","v":97},{"$f":"IF(League[[#This Row],[Gender]]=\"M\",RANK(League[Total Points],mrank),\"\")","v":""},{"$f":"IF(League[[#This Row],[Gender]]=\"F\",RANK(League[Total Points],wrank),\"\")","v":41},{"$f":"SUM(League[[#This Row],[XC]:[Thunder Run]])","v":35},{"$f":"IFERROR(VLOOKUP(League[[#This Row],[Memberno]],XC[[Mem]:[Total Points]],5,0),\"\")","v":""},{"$f":"IFERROR(VLOOKUP(League[[#This Row],[Parkrun '#]],Parkrun[],7,FALSE),\"\")","v":""},{"$f":"IFERROR(VLOOKUP(League[[#This Row],[Memberno]],Club5k[],5,FALSE),\"\")","v":5},{"$f":"IFERROR(VLOOKUP(League[[#This Row],[Memberno]],Halfmarathon[Mem]:Halfmarathon[Points],4,0),\"\")","v":""},{"$f":"IFERROR(VLOOKUP(League[[#This Row],[Memberno]],Marathon[],4,FALSE),\"\")","v":30},{"$f":"IFERROR(VLOOKUP(League[[#This Row],[Memberno]],Table18[],5,FALSE),\"\")","v":""},{"$f":"IFERROR(VLOOKUP(League[[#This Row],[Memberno]],tenK[[Member '#]:[Total Points]],2,FALSE),\"\")","v":""},{"$f":"IFERROR(VLOOKUP(League[[#This Row],[Memberno]],Thunderrun[],3,FALSE),\"\")","v":""}]
[null,"Ben Sweeting",{"$f":"IFERROR(VLOOKUP(League[[#This Row],[Name]],members,2,FALSE),\"\")","v":260}," ",{"$f":"COUNT(League[[#This Row],[XC]:[Thunder Run]])","v":2},"M",{"$f":"VLOOKUP(League[[#This Row],[Memberno]],Allmembers[],7,FALSE)","v":"MS"},{"$f":"RANK(League[[#This Row],[Total Points]],League[Total Points])","v":98},{"$f":"IF(League[[#This Row],[Gender]]=\"M\",RANK(League[Total Points],mrank),\"\")","v":57},{"$f":"IF(League[[#This Row],[Gender]]=\"F\",RANK(League[Total Points],wrank),\"\")","v":""},{"$f":"SUM(League[[#This Row],[XC]:[Thunder Run]])","v":34},{"$f":"IFERROR(VLOOKUP(League[[#This Row],[Memberno]],XC[[Mem]:[Total Points]],5,0),\"\")","v":""},{"$f":"IFERROR(VLOOKUP(League[[#This Row],[Parkrun '#]],Parkrun[],7,FALSE),\"\")","v":""},{"$f":"IFERROR(VLOOKUP(League[[#This Row],[Memberno]],Club5k[],5,FALSE),\"\")","v":5},{"$f":"IFERROR(VLOOKUP(League[[#This Row],[Memberno]],Halfmarathon[Mem]:Halfmarathon[Points],4,0),\"\")","v":""},{"$f":"IFERROR(VLOOKUP(League[[#This Row],[Memberno]],Marathon[],4,FALSE),\"\")","v":""},{"$f":"IFERROR(VLOOKUP(League[[#This Row],[Memberno]],Table18[],5,FALSE),\"\")","v":""},{"$f":"IFERROR(VLOOKUP(League[[#This Row],[Memberno]],tenK[[Member '#]:[Total Points]],2,FALSE),\"\")","v":29},{"$f":"IFERROR(VLOOKUP(League[[#This Row],[Memberno]],Thunderrun[],3,FALSE),\"\")","v":""}]
[null,"Theo Green",{"$f":"IFERROR(VLOOKUP(League[[#This Row],[Name]],members,2,FALSE),\"\")","v":288},580161,{"$f":"COUNT(League[[#This Row],[XC]:[Thunder Run]])","v":2},"M",{"$f":"VLOOKUP(League[[#This Row],[Memberno]],Allmembers[],7,FALSE)","v":"M"},{"$f":"RANK(League[[#This Row],[Total Points]],League[Total Points])","v":98},{"$f":"IF(League[[#This Row],[Gender]]=\"M\",RANK(League[Total Points],mrank),\"\")","v":57},{"$f":"IF(League[[#This Row],[Gender]]=\"F\",RANK(League[Total Points],wrank),\"\")","v":""},{"$f":"SUM(League[[#This Row],[XC]:[Thunder Run]])","v":34},{"$f":"IFERROR(VLOOKUP(League[[#This Row],[Memberno]],XC[[Mem]:[Total Points]],5,0),\"\")","v":""},{"$f":"IFERROR(VLOOKUP(League[[#This Row],[Parkrun '#]],Parkrun[],7,FALSE),\"\")","v":29},{"$f":"IFERROR(VLOOKUP(League[[#This Row],[Memberno]],Club5k[],5,FALSE),\"\")","v":5},{"$f":"IFERROR(VLOOKUP(League[[#This Row],[Memberno]],Halfmarathon[Mem]:Halfmarathon[Points],4,0),\"\")","v":""},{"$f":"IFERROR(VLOOKUP(League[[#This Row],[Memberno]],Marathon[],4,FALSE),\"\")","v":""},{"$f":"IFERROR(VLOOKUP(League[[#This Row],[Memberno]],Table18[],5,FALSE),\"\")","v":""},{"$f":"IFERROR(VLOOKUP(League[[#This Row],[Memberno]],tenK[[Member '#]:[Total Points]],2,FALSE),\"\")","v":""},{"$f":"IFERROR(VLOOKUP(League[[#This Row],[Memberno]],Thunderrun[],3,FALSE),\"\")","v":""}]
[null,"Jamie Fisher",{"$f":"IFERROR(VLOOKUP(League[[#This Row],[Name]],members,2,FALSE),\"\")","v":99},157874,{"$f":"COUNT(League[[#This Row],[XC]:[Thunder Run]])","v":1},"M",{"$f":"VLOOKUP(League[[#This Row],[Memberno]],Allmembers[],7,FALSE)","v":"MV40"},{"$f":"RANK(League[[#This Row],[Total Points]],League[Total Points])","v":100},{"$f":"IF(League[[#This Row],[Gender]]=\"M\",RANK(League[Total Points],mrank),\"\")","v":59},{"$f":"IF(League[[#This Row],[Gender]]=\"F\",RANK(League[Total Points],wrank),\"\")","v":""},{"$f":"SUM(League[[#This Row],[XC]:[Thunder Run]])","v":33},{"$f":"IFERROR(VLOOKUP(League[[#This Row],[Memberno]],XC[[Mem]:[Total Points]],5,0),\"\")","v":""},{"$f":"IFERROR(VLOOKUP(League[[#This Row],[Parkrun '#]],Parkrun[],7,FALSE),\"\")","v":33},{"$f":"IFERROR(VLOOKUP(League[[#This Row],[Memberno]],Club5k[],5,FALSE),\"\")","v":""},{"$f":"IFERROR(VLOOKUP(League[[#This Row],[Memberno]],Halfmarathon[Mem]:Halfmarathon[Points],4,0),\"\")","v":""},{"$f":"IFERROR(VLOOKUP(League[[#This Row],[Memberno]],Marathon[],4,FALSE),\"\")","v":""},{"$f":"IFERROR(VLOOKUP(League[[#This Row],[Memberno]],Table18[],5,FALSE),\"\")","v":""},{"$f":"IFERROR(VLOOKUP(League[[#This Row],[Memberno]],tenK[[Member '#]:[Total Points]],2,FALSE),\"\")","v":""},{"$f":"IFERROR(VLOOKUP(League[[#This Row],[Memberno]],Thunderrun[],3,FALSE),\"\")","v":""}]
[null,"Ken Murray",310,null,{"$f":"COUNT(League[[#This Row],[XC]:[Thunder Run]])","v":1},"M",{"$f":"VLOOKUP(League[[#This Row],[Memberno]],Allmembers[],7,FALSE)","v":"MV40"},{"$f":"RANK(League[[#This Row],[Total Points]],League[Total Points])","v":101},{"$f":"IF(League[[#This Row],[Gender]]=\"M\",RANK(League[Total Points],mrank),\"\")","v":60},{"$f":"IF(League[[#This Row],[Gender]]=\"F\",RANK(League[Total Points],wrank),\"\")","v":""},{"$f":"SUM(League[[#This Row],[XC]:[Thunder Run]])","v":32},{"$f":"IFERROR(VLOOKUP(League[[#This Row],[Memberno]],XC[[Mem]:[Total Points]],5,0),\"\")","v":32},{"$f":"IFERROR(VLOOKUP(League[[#This Row],[Parkrun '#]],Parkrun[],7,FALSE),\"\")","v":""},{"$f":"IFERROR(VLOOKUP(League[[#This Row],[Memberno]],Club5k[],5,FALSE),\"\")","v":""},{"$f":"IFERROR(VLOOKUP(League[[#This Row],[Memberno]],Halfmarathon[Mem]:Halfmarathon[Points],4,0),\"\")","v":""},{"$f":"IFERROR(VLOOKUP(League[[#This Row],[Memberno]],Marathon[],4,FALSE),\"\")","v":""},{"$f":"IFERROR(VLOOKUP(League[[#This Row],[Memberno]],Table18[],5,FALSE),\"\")","v":""},{"$f":"IFERROR(VLOOKUP(League[[#This Row],[Memberno]],tenK[[Member '#]:[Total Points]],2,FALSE),\"\")","v":""},{"$f":"IFERROR(VLOOKUP(League[[#This Row],[Memberno]],Thunderrun[],3,FALSE),\"\")","v":""}]
[null,"Gordon Ray",{"$f":"IFERROR(VLOOKUP(League[[#This Row],[Name]],members,2,FALSE),\"\")","v":289},null,{"$f":"COUNT(League[[#This Row],[XC]:[Thunder Run]])","v":2},"M",{"$f":"VLOOKUP(League[[#This Row],[Memberno]],Allmembers[],7,FALSE)","v":"MS"},{"$f":"RANK(League[[#This Row],[Total Points]],League[Total Points])","v":102},{"$f":"IF(League[[#This Row],[Gender]]=\"M\",RANK(League[Total Points],mrank),\"\")","v":61},{"$f":"IF(League[[#This Row],[Gender]]=\"F\",RANK(League[Total Points],wrank),\"\")","v":""},{"$f":"SUM(League[[#This Row],[XC]:[Thunder Run]])","v":31},{"$f":"IFERROR(VLOOKUP(League[[#This Row],[Memberno]],XC[[Mem]:[Total Points]],5,0),\"\")","v":""},{"$f":"IFERROR(VLOOKUP(League[[#This Row],[Parkrun '#]],Parkrun[],7,FALSE),\"\")","v":""},{"$f":"IFERROR(VLOOKUP(League[[#This Row],[Memberno]],Club5k[],5,FALSE),\"\")","v":5},{"$f":"IFERROR(VLOOKUP(League[[#This Row],[Memberno]],Halfmarathon[Mem]:Halfmarathon[Points],4,0),\"\")","v":""},{"$f":"IFERROR(VLOOKUP(League[[#This Row],[Memberno]],Marathon[],4,FALSE),\"\")","v":""},{"$f":"IFERROR(VLOOKUP(League[[#This Row],[Memberno]],Table18[],5,FALSE),\"\")","v":""},{"$f":"IFERROR(VLOOKUP(League[[#This Row],[Memberno]],tenK[[Member '#]:[Total Points]],2,FALSE),\"\")","v":26},{"$f":"IFERROR(VLOOKUP(League[[#This Row],[Memberno]],Thunderrun[],3,FALSE),\"\")","v":""}]
[null,"Nigel Marsden",{"$f":"IFERROR(VLOOKUP(League[[#This Row],[Name]],members,2,FALSE),\"\")","v":96}," ",{"$f":"COUNT(League[[#This Row],[XC]:[Thunder Run]])","v":1},"M",{"$f":"VLOOKUP(League[[#This Row],[Memberno]],Allmembers[],7,FALSE)","v":"MV40"},{"$f":"RANK(League[[#This Row],[Total Points]],League[Total Points])","v":102},{"$f":"IF(League[[#This Row],[Gender]]=\"M\",RANK(League[Total Points],mrank),\"\")","v":61},{"$f":"IF(League[[#This Row],[Gender]]=\"F\",RANK(League[Total Points],wrank),\"\")","v":""},{"$f":"SUM(League[[#This Row],[XC]:[Thunder Run]])","v":31},{"$f":"IFERROR(VLOOKUP(League[[#This Row],[Memberno]],XC[[Mem]:[Total Points]],5,0),\"\")","v":""},{"$f":"IFERROR(VLOOKUP(League[[#This Row],[Parkrun '#]],Parkrun[],7,FALSE),\"\")","v":""},{"$f":"IFERROR(VLOOKUP(League[[#This Row],[Memberno]],Club5k[],5,FALSE),\"\")","v":""},{"$f":"IFERROR(VLOOKUP(League[[#This Row],[Memberno]],Halfmarathon[Mem]:Halfmarathon[Points],4,0),\"\")","v":""},{"$f":"IFERROR(VLOOKUP(League[[#This Row],[Memberno]],Marathon[],4,FALSE),\"\")","v":""},{"$f":"IFERROR(VLOOKUP(League[[#This Row],[Memberno]],Table18[],5,FALSE),\"\")","v":""},{"$f":"IFERROR(VLOOKUP(League[[#This Row],[Memberno]],tenK[[Member '#]:[Total Points]],2,FALSE),\"\")","v":31},{"$f":"IFERROR(VLOOKUP(League[[#This Row],[Memberno]],Thunderrun[],3,FALSE),\"\")","v":""}]
[null,"Paul Hill",287,null,{"$f":"COUNT(League[[#This Row],[XC]:[Thunder Run]])","v":2},"M",{"$f":"VLOOKUP(League[[#This Row],[Memberno]],Allmembers[],7,FALSE)","v":"MV40"},{"$f":"RANK(League[[#This Row],[Total Points]],League[Total Points])","v":104},{"$f":"IF(League[[#This Row],[Gender]]=\"M\",RANK(League[Total Points],mrank),\"\")","v":63},{"$f":"IF(League[[#This Row],[Gender]]=\"F\",RANK(League[Total Points],wrank),\"\")","v":""},{"$f":"SUM(League[[#This Row],[XC]:[Thunder Run]])","v":29},{"$f":"IFERROR(VLOOKUP(League[[#This Row],[Memberno]],XC[[Mem]:[Total Points]],5,0),\"\")","v":""}," ",{"$f":"IFERROR(VLOOKUP(League[[#This Row],[Memberno]],Club5k[],5,FALSE),\"\")","v":5},{"$f":"IFERROR(VLOOKUP(League[[#This Row],[Memberno]],Halfmarathon[Mem]:Halfmarathon[Points],4,0),\"\")","v":""},{"$f":"IFERROR(VLOOKUP(League[[#This Row],[Memberno]],Marathon[],4,FALSE),\"\")","v":""},{"$f":"IFERROR(VLOOKUP(League[[#This Row],[Memberno]],Table18[],5,FALSE),\"\")","v":""},{"$f":"IFERROR(VLOOKUP(League[[#This Row],[Memberno]],tenK[[Member '#]:[Total Points]],2,FALSE),\"\")","v":24},{"$f":"IFERROR(VLOOKUP(League[[#This Row],[Memberno]],Thunderrun[],3,FALSE),\"\")","v":""}]
[null,"Clive Borthwick",{"$f":"IFERROR(VLOOKUP(League[[#This Row],[Name]],members,2,FALSE),\"\")","v":79}," ",{"$f":"COUNT(League[[#This Row],[XC]:[Thunder Run]])","v":1},"M",{"$f":"VLOOKUP(League[[#This Row],[Memberno]],Allmembers[],7,FALSE)","v":"MV60"},{"$f":"RANK(League[[#This Row],[Total Points]],League[Total Points])","v":105},{"$f":"IF(League[[#This Row],[Gender]]=\"M\",RANK(League[Total Points],mrank),\"\")","v":64},{"$f":"IF(League[[#This Row],[Gender]]=\"F\",RANK(League[Total Points],wrank),\"\")","v":""},{"$f":"SUM(League[[#This Row],[XC]:[Thunder Run]])","v":25},{"$f":"IFERROR(VLOOKUP(League[[#This Row],[Memberno]],XC[[Mem]:[Total Points]],5,0),\"\")","v":""},{"$f":"IFERROR(VLOOKUP(League[[#This Row],[Parkrun '#]],Parkrun[],7,FALSE),\"\")","v":""},{"$f":"IFERROR(VLOOKUP(League[[#This Row],[Memberno]],Club5k[],5,FALSE),\"\")","v":25},{"$f":"IFERROR(VLOOKUP(League[[#This Row],[Memberno]],Halfmarathon[Mem]:Halfmarathon[Points],4,0),\"\")","v":""},{"$f":"IFERROR(VLOOKUP(League[[#This Row],[Memberno]],Marathon[],4,FALSE),\"\")","v":""},{"$f":"IFERROR(VLOOKUP(League[[#This Row],[Memberno]],Table18[],5,FALSE),\"\")","v":""},{"$f":"IFERROR(VLOOKUP(League[[#This Row],[Memberno]],tenK[[Member '#]:[Total Points]],2,FALSE),\"\")","v":""},{"$f":"IFERROR(VLOOKUP(League[[#This Row],[Memberno]],Thunderrun[],3,FALSE),\"\")","v":""}]
[null,"Joanne Curtis",{"$f":"IFERROR(VLOOKUP(League[[#This Row],[Name]],members,2,FALSE),\"\")","v":267}," ",{"$f":"COUNT(League[[#This Row],[XC]:[Thunder Run]])","v":1},"F",{"$f":"VLOOKUP(League[[#This Row],[Memberno]],Allmembers[],7,FALSE)","v":"FV35"},{"$f":"RANK(League[[#This Row],[Total Points]],League[Total Points])","v":105},{"$f":"IF(League[[#This Row],[Gender]]=\"M\",RANK(League[Total Points],mrank),\"\")","v":""},{"$f":"IF(League[[#This Row],[Gender]]=\"F\",RANK(League[Total Points],wrank),\"\")","v":42},{"$f":"SUM(League[[#This Row],[XC]:[Thunder Run]])","v":25},{"$f":"IFERROR(VLOOKUP(League[[#This Row],[Memberno]],XC[[Mem]:[Total Points]],5,0),\"\")","v":""},{"$f":"IFERROR(VLOOKUP(League[[#This Row],[Parkrun '#]],Parkrun[],7,FALSE),\"\")","v":""},{"$f":"IFERROR(VLOOKUP(League[[#This Row],[Memberno]],Club5k[],5,FALSE),\"\")","v":25},{"$f":"IFERROR(VLOOKUP(League[[#This Row],[Memberno]],Halfmarathon[Mem]:Halfmarathon[Points],4,0),\"\")","v":""},{"$f":"IFERROR(VLOOKUP(League[[#This Row],[Memberno]],Marathon[],4,FALSE),\"\")","v":""},{"$f":"IFERROR(VLOOKUP(League[[#This Row],[Memberno]],Table18[],5,FALSE),\"\")","v":""},{"$f":"IFERROR(VLOOKUP(League[[#This Row],[Memberno]],tenK[[Member '#]:[Total Points]],2,FALSE),\"\")","v":""},{"$f":"IFERROR(VLOOKUP(League[[#This Row],[Memberno]],Thunderrun[],3,FALSE),\"\")","v":""}]
[null,"Tom Flett",{"$f":"IFERROR(VLOOKUP(League[[#This Row],[Name]],members,2,FALSE),\"\")","v":293},null,{"$f":"COUNT(League[[#This Row],[XC]:[Thunder Run]])","v":2},"M",{"$f":"VLOOKUP(League[[#This Row],[Memberno]],Allmembers[],7,FALSE)","v":"MV70"},{"$f":"RANK(League[[#This Row],[Total Points]],League[Total Points])","v":107},{"$f":"IF(League[[#This Row],[Gender]]=\"M\",RANK(League[Total Points],mrank),\"\")","v":65},{"$f":"IF(League[[#This Row],[Gender]]=\"F\",RANK(League[Total Points],wrank),\"\")","v":""},{"$f":"SUM(League[[#This Row],[XC]:[Thunder Run]])","v":24},{"$f":"IFERROR(VLOOKUP(League[[#This Row],[Memberno]],XC[[Mem]:[Total Points]],5,0),\"\")","v":""},{"$f":"IFERROR(VLOOKUP(League[[#This Row],[Parkrun '#]],Parkrun[],7,FALSE),\"\")","v":""},{"$f":"IFERROR(VLOOKUP(League[[#This Row],[Memberno]],Club5k[],5,FALSE),\"\")","v":5},{"$f":"IFERROR(VLOOKUP(League[[#This Row],[Memberno]],Halfmarathon[Mem]:Halfmarathon[Points],4,0),\"\")","v":""},{"$f":"IFERROR(VLOOKUP(League[[#This Row],[Memberno]],Marathon[],4,FALSE),\"\")","v":""},{"$f":"IFERROR(VLOOKUP(League[[#This Row],[Memberno]],Table18[],5,FALSE),\"\")","v":""},{"$f":"IFERROR(VLOOKUP(League[[#This Row],[Memberno]],tenK[[Member '#]:[Total Points]],2,FALSE),\"\")","v":19},{"$f":"IFERROR(VLOOKUP(League[[#This Row],[Memberno]],Thunderrun[],3,FALSE),\"\")","v":""}]
[null,"Derek Lambert",{"$f":"IFERROR(VLOOKUP(League[[#This Row],[Name]],members,2,FALSE),\"\")","v":264}," ",{"$f":"COUNT(League[[#This Row],[XC]:[Thunder Run]])","v":1},"M",{"$f":"VLOOKUP(League[[#This Row],[Memberno]],Allmembers[],7,FALSE)","v":"MV50"},{"$f":"RANK(League[[#This Row],[Total Points]],League[Total Points])","v":108},{"$f":"IF(League[[#This Row],[Gender]]=\"M\",RANK(League[Total Points],mrank),\"\")","v":66},{"$f":"IF(League[[#This Row],[Gender]]=\"F\",RANK(League[Total Points],wrank),\"\")","v":""},{"$f":"SUM(League[[#This Row],[XC]:[Thunder Run]])","v":20},{"$f":"IFERROR(VLOOKUP(League[[#This Row],[Memberno]],XC[[Mem]:[Total Points]],5,0),\"\")","v":""},{"$f":"IFERROR(VLOOKUP(League[[#This Row],[Parkrun '#]],Parkrun[],7,FALSE),\"\")","v":""},{"$f":"IFERROR(VLOOKUP(League[[#This Row],[Memberno]],Club5k[],5,FALSE),\"\")","v":20},{"$f":"IFERROR(VLOOKUP(League[[#This Row],[Memberno]],Halfmarathon[Mem]:Halfmarathon[Points],4,0),\"\")","v":""},{"$f":"IFERROR(VLOOKUP(League[[#This Row],[Memberno]],Marathon[],4,FALSE),\"\")","v":""},{"$f":"IFERROR(VLOOKUP(League[[#This Row],[Memberno]],Table18[],5,FALSE),\"\")","v":""},{"$f":"IFERROR(VLOOKUP(League[[#This Row],[Memberno]],tenK[[Member '#]:[Total Points]],2,FALSE),\"\")","v":""},{"$f":"IFERROR(VLOOKUP(League[[#This Row],[Memberno]],Thunderrun[],3,FALSE),\"\")","v":""}]
[null,"David Salmon",{"$f":"IFERROR(VLOOKUP(League[[#This Row],[Name]],members,2,FALSE),\"\")","v":290},null,{"$f":"COUNT(League[[#This Row],[XC]:[Thunder Run]])","v":1},"M",{"$f":"VLOOKUP(League[[#This Row],[Memberno]],Allmembers[],7,FALSE)","v":"MV50"},{"$f":"RANK(League[[#This Row],[Total Points]],League[Total Points])","v":109},{"$f":"IF(League[[#This Row],[Gender]]=\"M\",RANK(League[Total Points],mrank),\"\")","v":67},{"$f":"IF(League[[#This Row],[Gender]]=\"F\",RANK(League[Total Points],wrank),\"\")","v":""},{"$f":"SUM(League[[#This Row],[XC]:[Thunder Run]])","v":15},{"$f":"IFERROR(VLOOKUP(League[[#This Row],[Memberno]],XC[[Mem]:[Total Points]],5,0),\"\")","v":""},{"$f":"IFERROR(VLOOKUP(League[[#This Row],[Parkrun '#]],Parkrun[],7,FALSE),\"\")","v":""},{"$f":"IFERROR(VLOOKUP(League[[#This Row],[Memberno]],Club5k[],5,FALSE),\"\")","v":15},{"$f":"IFERROR(VLOOKUP(League[[#This Row],[Memberno]],Halfmarathon[Mem]:Halfmarathon[Points],4,0),\"\")","v":""},{"$f":"IFERROR(VLOOKUP(League[[#This Row],[Memberno]],Marathon[],4,FALSE),\"\")","v":""},{"$f":"IFERROR(VLOOKUP(League[[#This Row],[Memberno]],Table18[],5,FALSE),\"\")","v":""},{"$f":"IFERROR(VLOOKUP(League[[#This Row],[Memberno]],tenK[[Member '#]:[Total Points]],2,FALSE),\"\")","v":""},{"$f":"IFERROR(VLOOKUP(League[[#This Row],[Memberno]],Thunderrun[],3,FALSE),\"\")","v":""}]
[null,"Steff Bailey",204," ",{"$f":"COUNT(League[[#This Row],[XC]:[Thunder Run]])","v":1},"F",{"$f":"VLOOKUP(League[[#This Row],[Memberno]],Allmembers[],7,FALSE)","v":"FS"},{"$f":"RANK(League[[#This Row],[Total Points]],League[Total Points])","v":109},{"$f":"IF(League[[#This Row],[Gender]]=\"M\",RANK(League[Total Points],mrank),\"\")","v":""},{"$f":"IF(League[[#This Row],[Gender]]=\"F\",RANK(League[Total Points],wrank),\"\")","v":43},{"$f":"SUM(League[[#This Row],[XC]:[Thunder Run]])","v":15},{"$f":"IFERROR(VLOOKUP(League[[#This Row],[Memberno]],XC[[Mem]:[Total Points]],5,0),\"\")","v":""},{"$f":"IFERROR(VLOOKUP(League[[#This Row],[Parkrun '#]],Parkrun[],7,FALSE),\"\")","v":""},{"$f":"IFERROR(VLOOKUP(League[[#This Row],[Memberno]],Club5k[],5,FALSE),\"\")","v":15},{"$f":"IFERROR(VLOOKUP(League[[#This Row],[Memberno]],Halfmarathon[Mem]:Halfmarathon[Points],4,0),\"\")","v":""},{"$f":"IFERROR(VLOOKUP(League[[#This Row],[Memberno]],Marathon[],4,FALSE),\"\")","v":""},{"$f":"IFERROR(VLOOKUP(League[[#This Row],[Memberno]],Table18[],5,FALSE),\"\")","v":""},{"$f":"IFERROR(VLOOKUP(League[[#This Row],[Memberno]],tenK[[Member '#]:[Total Points]],2,FALSE),\"\")","v":""},{"$f":"IFERROR(VLOOKUP(League[[#This Row],[Memberno]],Thunderrun[],3,FALSE),\"\")","v":""}]
[null,"Amy Curtis",{"$f":"IFERROR(VLOOKUP(League[[#This Row],[Name]],members,2,FALSE),\"\")","v":171}," ",{"$f":"COUNT(League[[#This Row],[XC]:[Thunder Run]])","v":1},"F",{"$f":"VLOOKUP(League[[#This Row],[Memberno]],Allmembers[],7,FALSE)","v":"FS"},{"$f":"RANK(League[[#This Row],[Total Points]],League[Total Points])","v":111},{"$f":"IF(League[[#This Row],[Gender]]=\"M\",RANK(League[Total Points],mrank),\"\")","v":""},{"$f":"IF(League[[#This Row],[Gender]]=\"F\",RANK(League[Total Points],wrank),\"\")","v":44},{"$f":"SUM(League[[#This Row],[XC]:[Thunder Run]])","v":10},{"$f":"IFERROR(VLOOKUP(League[[#This Row],[Memberno]],XC[[Mem]:[Total Points]],5,0),\"\")","v":""},{"$f":"IFERROR(VLOOKUP(League[[#This Row],[Parkrun '#]],Parkrun[],7,FALSE),\"\")","v":""},{"$f":"IFERROR(VLOOKUP(League[[#This Row],[Memberno]],Club5k[],5,FALSE),\"\")","v":10},{"$f":"IFERROR(VLOOKUP(League[[#This Row],[Memberno]],Halfmarathon[Mem]:Halfmarathon[Points],4,0),\"\")","v":""},{"$f":"IFERROR(VLOOKUP(League[[#This Row],[Memberno]],Marathon[],4,FALSE),\"\")","v":""},{"$f":"IFERROR(VLOOKUP(League[[#This Row],[Memberno]],Table18[],5,FALSE),\"\")","v":""},{"$f":"IFERROR(VLOOKUP(League[[#This Row],[Memberno]],tenK[[Member '#]:[Total Points]],2,FALSE),\"\")","v":""},{"$f":"IFERROR(VLOOKUP(League[[#This Row],[Memberno]],Thunderrun[],3,FALSE),\"\")","v":""}]
[null,"Ellen Colebrook",{"$f":"IFERROR(VLOOKUP(League[[#This Row],[Name]],members,2,FALSE),\"\")","v":266}," ",{"$f":"COUNT(League[[#This Row],[XC]:[Thunder Run]])","v":1},"F",{"$f":"VLOOKUP(League[[#This Row],[Memberno]],Allmembers[],7,FALSE)","v":"FS"},{"$f":"RANK(League[[#This Row],[Total Points]],League[Total Points])","v":111},{"$f":"IF(League[[#This Row],[Gender]]=\"M\",RANK(League[Total Points],mrank),\"\")","v":""},{"$f":"IF(League[[#This Row],[Gender]]=\"F\",RANK(League[Total Points],wrank),\"\")","v":44},{"$f":"SUM(League[[#This Row],[XC]:[Thunder Run]])","v":10},{"$f":"IFERROR(VLOOKUP(League[[#This Row],[Memberno]],XC[[Mem]:[Total Points]],5,0),\"\")","v":""},{"$f":"IFERROR(VLOOKUP(League[[#This Row],[Parkrun '#]],Parkrun[],7,FALSE),\"\")","v":""},{"$f":"IFERROR(VLOOKUP(League[[#This Row],[Memberno]],Club5k[],5,FALSE),\"\")","v":10},{"$f":"IFERROR(VLOOKUP(League[[#This Row],[Memberno]],Halfmarathon[Mem]:Halfmarathon[Points],4,0),\"\")","v":""},{"$f":"IFERROR(VLOOKUP(League[[#This Row],[Memberno]],Marathon[],4,FALSE),\"\")","v":""},{"$f":"IFERROR(VLOOKUP(League[[#This Row],[Memberno]],Table18[],5,FALSE),\"\")","v":""},{"$f":"IFERROR(VLOOKUP(League[[#This Row],[Memberno]],tenK[[Member '#]:[Total Points]],2,FALSE),\"\")","v":""},{"$f":"IFERROR(VLOOKUP(League[[#This Row],[Memberno]],Thunderrun[],3,FALSE),\"\")","v":""}]
[null,"Iona Aitken",284," ",{"$f":"COUNT(League[[#This Row],[XC]:[Thunder Run]])","v":1},"F",{"$f":"VLOOKUP(League[[#This Row],[Memberno]],Allmembers[],7,FALSE)","v":"FV35"},{"$f":"RANK(League[[#This Row],[Total Points]],League[Total Points])","v":111},{"$f":"IF(League[[#This Row],[Gender]]=\"M\",RANK(League[Total Points],mrank),\"\")","v":""},{"$f":"IF(League[[#This Row],[Gender]]=\"F\",RANK(League[Total Points],wrank),\"\")","v":44},{"$f":"SUM(League[[#This Row],[XC]:[Thunder Run]])","v":10},{"$f":"IFERROR(VLOOKUP(League[[#This Row],[Memberno]],XC[[Mem]:[Total Points]],5,0),\"\")","v":""},{"$f":"IFERROR(VLOOKUP(League[[#This Row],[Parkrun '#]],Parkrun[],7,FALSE),\"\")","v":""},{"$f":"IFERROR(VLOOKUP(League[[#This Row],[Memberno]],Club5k[],5,FALSE),\"\")","v":10},{"$f":"IFERROR(VLOOKUP(League[[#This Row],[Memberno]],Halfmarathon[Mem]:Halfmarathon[Points],4,0),\"\")","v":""},{"$f":"IFERROR(VLOOKUP(League[[#This Row],[Memberno]],Marathon[],4,FALSE),\"\")","v":""},{"$f":"IFERROR(VLOOKUP(League[[#This Row],[Memberno]],Table18[],5,FALSE),\"\")","v":""},{"$f":"IFERROR(VLOOKUP(League[[#This Row],[Memberno]],tenK[[Member '#]:[Total Points]],2,FALSE),\"\")","v":""},{"$f":"IFERROR(VLOOKUP(League[[#This Row],[Memberno]],Thunderrun[],3,FALSE),\"\")","v":""}]
[null,"Alex Butterworth",{"$f":"IFERROR(VLOOKUP(League[[#This Row],[Name]],members,2,FALSE),\"\")","v":259}," ",{"$f":"COUNT(League[[#This Row],[XC]:[Thunder Run]])","v":1},"M",{"$f":"VLOOKUP(League[[#This Row],[Memberno]],Allmembers[],7,FALSE)","v":"MV40"},{"$f":"RANK(League[[#This Row],[Total Points]],League[Total Points])","v":114},{"$f":"IF(League[[#This Row],[Gender]]=\"M\",RANK(League[Total Points],mrank),\"\")","v":68},{"$f":"IF(League[[#This Row],[Gender]]=\"F\",RANK(League[Total Points],wrank),\"\")","v":""},{"$f":"SUM(League[[#This Row],[XC]:[Thunder Run]])","v":5},{"$f":"IFERROR(VLOOKUP(League[[#This Row],[Memberno]],XC[[Mem]:[Total Points]],5,0),\"\")","v":""},{"$f":"IFERROR(VLOOKUP(League[[#This Row],[Parkrun '#]],Parkrun[],7,FALSE),\"\")","v":""},{"$f":"IFERROR(VLOOKUP(League[[#This Row],[Memberno]],Club5k[],5,FALSE),\"\")","v":5},{"$f":"IFERROR(VLOOKUP(League[[#This Row],[Memberno]],Halfmarathon[Mem]:Halfmarathon[Points],4,0),\"\")","v":""},{"$f":"IFERROR(VLOOKUP(League[[#This Row],[Memberno]],Marathon[],4,FALSE),\"\")","v":""},{"$f":"IFERROR(VLOOKUP(League[[#This Row],[Memberno]],Table18[],5,FALSE),\"\")","v":""},{"$f":"IFERROR(VLOOKUP(League[[#This Row],[Memberno]],tenK[[Member '#]:[Total Points]],2,FALSE),\"\")","v":""},{"$f":"IFERROR(VLOOKUP(League[[#This Row],[Memberno]],Thunderrun[],3,FALSE),\"\")","v":""}]
[null,"Carl Batchelder",{"$f":"IFERROR(VLOOKUP(League[[#This Row],[Name]],members,2,FALSE),\"\")","v":253}," ",{"$f":"COUNT(League[[#This Row],[XC]:[Thunder Run]])","v":1},"M",{"$f":"VLOOKUP(League[[#This Row],[Memberno]],Allmembers[],7,FALSE)","v":"M"},{"$f":"RANK(League[[#This Row],[Total Points]],League[Total Points])","v":114},{"$f":"IF(League[[#This Row],[Gender]]=\"M\",RANK(League[Total Points],mrank),\"\")","v":68},{"$f":"IF(League[[#This Row],[Gender]]=\"F\",RANK(League[Total Points],wrank),\"\")","v":""},{"$f":"SUM(League[[#This Row],[XC]:[Thunder Run]])","v":5},{"$f":"IFERROR(VLOOKUP(League[[#This Row],[Memberno]],XC[[Mem]:[Total Points]],5,0),\"\")","v":""},{"$f":"IFERROR(VLOOKUP(League[[#This Row],[Parkrun '#]],Parkrun[],7,FALSE),\"\")","v":""},{"$f":"IFERROR(VLOOKUP(League[[#This Row],[Memberno]],Club5k[],5,FALSE),\"\")","v":5},{"$f":"IFERROR(VLOOKUP(League[[#This Row],[Memberno]],Halfmarathon[Mem]:Halfmarathon[Points],4,0),\"\")","v":""},{"$f":"IFERROR(VLOOKUP(League[[#This Row],[Memberno]],Marathon[],4,FALSE),\"\")","v":""},{"$f":"IFERROR(VLOOKUP(League[[#This Row],[Memberno]],Table18[],5,FALSE),\"\")","v":""},{"$f":"IFERROR(VLOOKUP(League[[#This Row],[Memberno]],tenK[[Member '#]:[Total Points]],2,FALSE),\"\")","v":""},{"$f":"IFERROR(VLOOKUP(League[[#This Row],[Memberno]],Thunderrun[],3,FALSE),\"\")","v":""}]
[null,"Colette Gissane",{"$f":"IFERROR(VLOOKUP(League[[#This Row],[Name]],members,2,FALSE),\"\")","v":295},null,{"$f":"COUNT(League[[#This Row],[XC]:[Thunder Run]])","v":1},"F",{"$f":"VLOOKUP(League[[#This Row],[Memberno]],Allmembers[],7,FALSE)","v":"FS"},{"$f":"RANK(League[[#This Row],[Total Points]],League[Total Points])","v":114},{"$f":"IF(League[[#This Row],[Gender]]=\"M\",RANK(League[Total Points],mrank),\"\")","v":""},{"$f":"IF(League[[#This Row],[Gender]]=\"F\",RANK(League[Total Points],wrank),\"\")","v":47},{"$f":"SUM(League[[#This Row],[XC]:[Thunder Run]])","v":5},{"$f":"IFERROR(VLOOKUP(League[[#This Row],[Memberno]],XC[[Mem]:[Total Points]],5,0),\"\")","v":""},{"$f":"IFERROR(VLOOKUP(League[[#This Row],[Parkrun '#]],Parkrun[],7,FALSE),\"\")","v":""},{"$f":"IFERROR(VLOOKUP(League[[#This Row],[Memberno]],Club5k[],5,FALSE),\"\")","v":5},{"$f":"IFERROR(VLOOKUP(League[[#This Row],[Memberno]],Halfmarathon[Mem]:Halfmarathon[Points],4,0),\"\")","v":""},{"$f":"IFERROR(VLOOKUP(League[[#This Row],[Memberno]],Marathon[],4,FALSE),\"\")","v":""},{"$f":"IFERROR(VLOOKUP(League[[#This Row],[Memberno]],Table18[],5,FALSE),\"\")","v":""},{"$f":"IFERROR(VLOOKUP(League[[#This Row],[Memberno]],tenK[[Member '#]:[Total Points]],2,FALSE),\"\")","v":""},{"$f":"IFERROR(VLOOKUP(League[[#This Row],[Memberno]],Thunderrun[],3,FALSE),\"\")","v":""}]
[null,"Dan Winfield",{"$f":"IFERROR(VLOOKUP(League[[#This Row],[Name]],members,2,FALSE),\"\")","v":298},null,{"$f":"COUNT(League[[#This Row],[XC]:[Thunder Run]])","v":1},"M",{"$f":"VLOOKUP(League[[#This Row],[Memberno]],Allmembers[],7,FALSE)","v":"MV40"},{"$f":"RANK(League[[#This Row],[Total Points]],League[Total Points])","v":114},{"$f":"IF(League[[#This Row],[Gender]]=\"M\",RANK(League[Total Points],mrank),\"\")","v":68},{"$f":"IF(League[[#This Row],[Gender]]=\"F\",RANK(League[Total Points],wrank),\"\")","v":""},{"$f":"SUM(League[[#This Row],[XC]:[Thunder Run]])","v":5},{"$f":"IFERROR(VLOOKUP(League[[#This Row],[Memberno]],XC[[Mem]:[Total Points]],5,0),\"\")","v":""},{"$f":"IFERROR(VLOOKUP(League[[#This Row],[Parkrun '#]],Parkrun[],7,FALSE),\"\")","v":""},{"$f":"IFERROR(VLOOKUP(League[[#This Row],[Memberno]],Club5k[],5,FALSE),\"\")","v":5},{"$f":"IFERROR(VLOOKUP(League[[#This Row],[Memberno]],Halfmarathon[Mem]:Halfmarathon[Points],4,0),\"\")","v":""},{"$f":"IFERROR(VLOOKUP(League[[#This Row],[Memberno]],Marathon[],4,FALSE),\"\")","v":""},{"$f":"IFERROR(VLOOKUP(League[[#This Row],[Memberno]],Table18[],5,FALSE),\"\")","v":""},{"$f":"IFERROR(VLOOKUP(League[[#This Row],[Memberno]],tenK[[Member '#]:[Total Points]],2,FALSE),\"\")","v":""},{"$f":"IFERROR(VLOOKUP(League[[#This Row],[Memberno]],Thunderrun[],3,FALSE),\"\")","v":""}]
[null,"Dennis Van Goldberdinge",{"$f":"IFERROR(VLOOKUP(League[[#This Row],[Name]],members,2,FALSE),\"\")","v":134},null,{"$f":"COUNT(League[[#This Row],[XC]:[Thunder Run]])","v":1},"M",{"$f":"VLOOKUP(League[[#This Row],[Memberno]],Allmembers[],7,FALSE)","v":"MV40"},{"$f":"RANK(League[[#This Row],[Total Points]],League[Total Points])","v":114},{"$f":"IF(League[[#This Row],[Gender]]=\"M\",RANK(League[Total Points],mrank),\"\")","v":68},{"$f":"IF(League[[#This Row],[Gender]]=\"F\",RANK(League[Total Points],wrank),\"\")","v":""},{"$f":"SUM(League[[#This Row],[XC]:[Thunder Run]])","v":5},{"$f":"IFERROR(VLOOKUP(League[[#This Row],[Memberno]],XC[[Mem]:[Total Points]],5,0),\"\")","v":""},{"$f":"IFERROR(VLOOKUP(League[[#This Row],[Parkrun '#]],Parkrun[],7,FALSE),\"\")","v":""},{"$f":"IFERROR(VLOOKUP(League[[#This Row],[Memberno]],Club5k[],5,FALSE),\"\")","v":5},{"$f":"IFERROR(VLOOKUP(League[[#This Row],[Memberno]],Halfmarathon[Mem]:Halfmarathon[Points],4,0),\"\")","v":""},{"$f":"IFERROR(VLOOKUP(League[[#This Row],[Memberno]],Marathon[],4,FALSE),\"\")","v":""},{"$f":"IFERROR(VLOOKUP(League[[#This Row],[Memberno]],Table18[],5,FALSE),\"\")","v":""},{"$f":"IFERROR(VLOOKUP(League[[#This Row],[Memberno]],tenK[[Member '#]:[Total Points]],2,FALSE),\"\")","v":""},{"$f":"IFERROR(VLOOKUP(League[[#This Row],[Memberno]],Thunderrun[],3,FALSE),\"\")","v":""}]
[null,"Iain O'Kane",{"$f":"IFERROR(VLOOKUP(League[[#This Row],[Name]],members,2,FALSE),\"\")","v":291},null,{"$f":"COUNT(League[[#This Row],[XC]:[Thunder Run]])","v":1},"M",{"$f":"VLOOKUP(League[[#This Row],[Memberno]],Allmembers[],7,FALSE)","v":"MS"},{"$f":"RANK(League[[#This Row],[Total Points]],League[Total Points])","v":114},{"$f":"IF(League[[#This Row],[Gender]]=\"M\",RANK(League[Total Points],mrank),\"\")","v":68},{"$f":"IF(League[[#This Row],[Gender]]=\"F\",RANK(League[Total Points],wrank),\"\")","v":""},{"$f":"SUM(League[[#This Row],[XC]:[Thunder Run]])","v":5},{"$f":"IFERROR(VLOOKUP(League[[#This Row],[Memberno]],XC[[Mem]:[Total Points]],5,0),\"\")","v":""},{"$f":"IFERROR(VLOOKUP(League[[#This Row],[Parkrun '#]],Parkrun[],7,FALSE),\"\")","v":""},{"$f":"IFERROR(VLOOKUP(League[[#This Row],[Memberno]],Club5k[],5,FALSE),\"\")","v":5},{"$f":"IFERROR(VLOOKUP(League[[#This Row],[Memberno]],Halfmarathon[Mem]:Halfmarathon[Points],4,0),\"\")","v":""},{"$f":"IFERROR(VLOOKUP(League[[#This Row],[Memberno]],Marathon[],4,FALSE),\"\")","v":""},{"$f":"IFERROR(VLOOKUP(League[[#This Row],[Memberno]],Table18[],5,FALSE),\"\")","v":""},{"$f":"IFERROR(VLOOKUP(League[[#This Row],[Memberno]],tenK[[Member '#]:[Total Points]],2,FALSE),\"\")","v":""},{"$f":"IFERROR(VLOOKUP(League[[#This Row],[Memberno]],Thunderrun[],3,FALSE),\"\")","v":""}]
[null,"Kate Kitchener",{"$f":"IFERROR(VLOOKUP(League[[#This Row],[Name]],members,2,FALSE),\"\")","v":306},null,{"$f":"COUNT(League[[#This Row],[XC]:[Thunder Run]])","v":1},"F",{"$f":"VLOOKUP(League[[#This Row],[Memberno]],Allmembers[],7,FALSE)","v":"FV55"},{"$f":"RANK(League[[#This Row],[Total Points]],League[Total Points])","v":114},{"$f":"IF(League[[#This Row],[Gender]]=\"M\",RANK(League[Total Points],mrank),\"\")","v":""},{"$f":"IF(League[[#This Row],[Gender]]=\"F\",RANK(League[Total Points],wrank),\"\")","v":47},{"$f":"SUM(League[[#This Row],[XC]:[Thunder Run]])","v":5},{"$f":"IFERROR(VLOOKUP(League[[#This Row],[Memberno]],XC[[Mem]:[Total Points]],5,0),\"\")","v":""},{"$f":"IFERROR(VLOOKUP(League[[#This Row],[Parkrun '#]],Parkrun[],7,FALSE),\"\")","v":""},{"$f":"IFERROR(VLOOKUP(League[[#This Row],[Memberno]],Club5k[],5,FALSE),\"\")","v":5},{"$f":"IFERROR(VLOOKUP(League[[#This Row],[Memberno]],Halfmarathon[Mem]:Halfmarathon[Points],4,0),\"\")","v":""},{"$f":"IFERROR(VLOOKUP(League[[#This Row],[Memberno]],Marathon[],4,FALSE),\"\")","v":""},{"$f":"IFERROR(VLOOKUP(League[[#This Row],[Memberno]],Table18[],5,FALSE),\"\")","v":""},{"$f":"IFERROR(VLOOKUP(League[[#This Row],[Memberno]],tenK[[Member '#]:[Total Points]],2,FALSE),\"\")","v":""},{"$f":"IFERROR(VLOOKUP(League[[#This Row],[Memberno]],Thunderrun[],3,FALSE),\"\")","v":""}]
[null,"Richard Saunders",{"$f":"IFERROR(VLOOKUP(League[[#This Row],[Name]],members,2,FALSE),\"\")","v":255}," ",{"$f":"COUNT(League[[#This Row],[XC]:[Thunder Run]])","v":1},"M",{"$f":"VLOOKUP(League[[#This Row],[Memberno]],Allmembers[],7,FALSE)","v":"MV40"},{"$f":"RANK(League[[#This Row],[Total Points]],League[Total Points])","v":114},{"$f":"IF(League[[#This Row],[Gender]]=\"M\",RANK(League[Total Points],mrank),\"\")","v":68},{"$f":"IF(League[[#This Row],[Gender]]=\"F\",RANK(League[Total Points],wrank),\"\")","v":""},{"$f":"SUM(League[[#This Row],[XC]:[Thunder Run]])","v":5},{"$f":"IFERROR(VLOOKUP(League[[#This Row],[Memberno]],XC[[Mem]:[Total Points]],5,0),\"\")","v":""},{"$f":"IFERROR(VLOOKUP(League[[#This Row],[Parkrun '#]],Parkrun[],7,FALSE),\"\")","v":""},{"$f":"IFERROR(VLOOKUP(League[[#This Row],[Memberno]],Club5k[],5,FALSE),\"\")","v":5},{"$f":"IFERROR(VLOOKUP(League[[#This Row],[Memberno]],Halfmarathon[Mem]:Halfmarathon[Points],4,0),\"\")","v":""},{"$f":"IFERROR(VLOOKUP(League[[#This Row],[Memberno]],Marathon[],4,FALSE),\"\")","v":""},{"$f":"IFERROR(VLOOKUP(League[[#This Row],[Memberno]],Table18[],5,FALSE),\"\")","v":""},{"$f":"IFERROR(VLOOKUP(League[[#This Row],[Memberno]],tenK[[Member '#]:[Total Points]],2,FALSE),\"\")","v":""},{"$f":"IFERROR(VLOOKUP(League[[#This Row],[Memberno]],Thunderrun[],3,FALSE),\"\")","v":""}]
[null,"Robin Harris ",309,null,{"$f":"COUNT(League[[#This Row],[XC]:[Thunder Run]])","v":1},"M",{"$f":"VLOOKUP(League[[#This Row],[Memberno]],Allmembers[],7,FALSE)","v":"MV40"},{"$f":"RANK(League[[#This Row],[Total Points]],League[Total Points])","v":114},{"$f":"IF(League[[#This Row],[Gender]]=\"M\",RANK(League[Total Points],mrank),\"\")","v":68},{"$f":"IF(League[[#This Row],[Gender]]=\"F\",RANK(League[Total Points],wrank),\"\")","v":""},{"$f":"SUM(League[[#This Row],[XC]:[Thunder Run]])","v":5},{"$f":"IFERROR(VLOOKUP(League[[#This Row],[Memberno]],XC[[Mem]:[Total Points]],5,0),\"\")","v":""},{"$f":"IFERROR(VLOOKUP(League[[#This Row],[Parkrun '#]],Parkrun[],7,FALSE),\"\")","v":""},{"$f":"IFERROR(VLOOKUP(League[[#This Row],[Memberno]],Club5k[],5,FALSE),\"\")","v":5},{"$f":"IFERROR(VLOOKUP(League[[#This Row],[Memberno]],Halfmarathon[Mem]:Halfmarathon[Points],4,0),\"\")","v":""},{"$f":"IFERROR(VLOOKUP(League[[#This Row],[Memberno]],Marathon[],4,FALSE),\"\")","v":""},{"$f":"IFERROR(VLOOKUP(League[[#This Row],[Memberno]],Table18[],5,FALSE),\"\")","v":""},{"$f":"IFERROR(VLOOKUP(League[[#This Row],[Memberno]],tenK[[Member '#]:[Total Points]],2,FALSE),\"\")","v":""},{"$f":"IFERROR(VLOOKUP(League[[#This Row],[Memberno]],Thunderrun[],3,FALSE),\"\")","v":""}]
[null,"Ross Gissane",{"$f":"IFERROR(VLOOKUP(League[[#This Row],[Name]],members,2,FALSE),\"\")","v":303},null,{"$f":"COUNT(League[[#This Row],[XC]:[Thunder Run]])","v":1},"M",{"$f":"VLOOKUP(League[[#This Row],[Memberno]],Allmembers[],7,FALSE)","v":"MS"},{"$f":"RANK(League[[#This Row],[Total Points]],League[Total Points])","v":114},{"$f":"IF(League[[#This Row],[Gender]]=\"M\",RANK(League[Total Points],mrank),\"\")","v":68},{"$f":"IF(League[[#This Row],[Gender]]=\"F\",RANK(League[Total Points],wrank),\"\")","v":""},{"$f":"SUM(League[[#This Row],[XC]:[Thunder Run]])","v":5},{"$f":"IFERROR(VLOOKUP(League[[#This Row],[Memberno]],XC[[Mem]:[Total Points]],5,0),\"\")","v":""},{"$f":"IFERROR(VLOOKUP(League[[#This Row],[Parkrun '#]],Parkrun[],7,FALSE),\"\")","v":""},{"$f":"IFERROR(VLOOKUP(League[[#This Row],[Memberno]],Club5k[],5,FALSE),\"\")","v":5},{"$f":"IFERROR(VLOOKUP(League[[#This Row],[Memberno]],Halfmarathon[Mem]:Halfmarathon[Points],4,0),\"\")","v":""},{"$f":"IFERROR(VLOOKUP(League[[#This Row],[Memberno]],Marathon[],4,FALSE),\"\")","v":""},{"$f":"IFERROR(VLOOKUP(League[[#This Row],[Memberno]],Table18[],5,FALSE),\"\")","v":""},{"$f":"IFERROR(VLOOKUP(League[[#This Row],[Memberno]],tenK[[Member '#]:[Total Points]],2,FALSE),\"\")","v":""},{"$f":"IFERROR(VLOOKUP(League[[#This Row],[Memberno]],Thunderrun[],3,FALSE),\"\")","v":""}]
[null,"Warrick Raath",315,null,{"$f":"COUNT(League[[#This Row],[XC]:[Thunder Run]])","v":1},"M",{"$f":"VLOOKUP(League[[#This Row],[Memberno]],Allmembers[],7,FALSE)","v":"MS"},{"$f":"RANK(League[[#This Row],[Total Points]],League[Total Points])","v":114},{"$f":"IF(League[[#This Row],[Gender]]=\"M\",RANK(League[Total Points],mrank),\"\")","v":68},{"$f":"IF(League[[#This Row],[Gender]]=\"F\",RANK(League[Total Points],wrank),\"\")","v":""},{"$f":"SUM(League[[#This Row],[XC]:[Thunder Run]])","v":5},{"$f":"IFERROR(VLOOKUP(League[[#This Row],[Memberno]],XC[[Mem]:[Total Points]],5,0),\"\")","v":""},{"$f":"IFERROR(VLOOKUP(League[[#This Row],[Parkrun '#]],Parkrun[],7,FALSE),\"\")","v":""},{"$f":"IFERROR(VLOOKUP(League[[#This Row],[Memberno]],Club5k[],5,FALSE),\"\")","v":5},{"$f":"IFERROR(VLOOKUP(League[[#This Row],[Memberno]],Halfmarathon[Mem]:Halfmarathon[Points],4,0),\"\")","v":""},{"$f":"IFERROR(VLOOKUP(League[[#This Row],[Memberno]],Marathon[],4,FALSE),\"\")","v":""},{"$f":"IFERROR(VLOOKUP(League[[#This Row],[Memberno]],Table18[],5,FALSE),\"\")","v":""},{"$f":"IFERROR(VLOOKUP(League[[#This Row],[Memberno]],tenK[[Member '#]:[Total Points]],2,FALSE),\"\")","v":""},{"$f":"IFERROR(VLOOKUP(League[[#This Row],[Memberno]],Thunderrun[],3,FALSE),\"\")","v":""}]
[null,"Andy Hill",{"$f":"IFERROR(VLOOKUP(League[[#This Row],[Name]],members,2,FALSE),\"\")","v":163}," ",{"$f":"COUNT(League[[#This Row],[XC]:[Thunder Run]])","v":0},"M",{"$f":"VLOOKUP(League[[#This Row],[Memberno]],Allmembers[],7,FALSE)","v":"MV40"},{"$f":"RANK(League[[#This Row],[Total Points]],League[Total Points])","v":125},{"$f":"IF(League[[#This Row],[Gender]]=\"M\",RANK(League[Total Points],mrank),\"\")","v":77},{"$f":"IF(League[[#This Row],[Gender]]=\"F\",RANK(League[Total Points],wrank),\"\")","v":""},{"$f":"SUM(League[[#This Row],[XC]:[Thunder Run]])","v":0},{"$f":"IFERROR(VLOOKUP(League[[#This Row],[Memberno]],XC[[Mem]:[Total Points]],5,0),\"\")","v":""},{"$f":"IFERROR(VLOOKUP(League[[#This Row],[Parkrun '#]],Parkrun[],7,FALSE),\"\")","v":""},{"$f":"IFERROR(VLOOKUP(League[[#This Row],[Memberno]],Club5k[],5,FALSE),\"\")","v":""},{"$f":"IFERROR(VLOOKUP(League[[#This Row],[Memberno]],Halfmarathon[Mem]:Halfmarathon[Points],4,0),\"\")","v":""},{"$f":"IFERROR(VLOOKUP(League[[#This Row],[Memberno]],Marathon[],4,FALSE),\"\")","v":""},{"$f":"IFERROR(VLOOKUP(League[[#This Row],[Memberno]],Table18[],5,FALSE),\"\")","v":""},{"$f":"IFERROR(VLOOKUP(League[[#This Row],[Memberno]],tenK[[Member '#]:[Total Points]],2,FALSE),\"\")","v":""},{"$f":"IFERROR(VLOOKUP(League[[#This Row],[Memberno]],Thunderrun[],3,FALSE),\"\")","v":""}]
[null,"Annabel Taylor",318,null,{"$f":"COUNT(League[[#This Row],[XC]:[Thunder Run]])","v":0},"F",{"$f":"VLOOKUP(League[[#This Row],[Memberno]],Allmembers[],7,FALSE)","v":"FV35"},{"$f":"RANK(League[[#This Row],[Total Points]],League[Total Points])","v":125},{"$f":"IF(League[[#This Row],[Gender]]=\"M\",RANK(League[Total Points],mrank),\"\")","v":""},{"$f":"IF(League[[#This Row],[Gender]]=\"F\",RANK(League[Total Points],wrank),\"\")","v":49},{"$f":"SUM(League[[#This Row],[XC]:[Thunder Run]])","v":0},{"$f":"IFERROR(VLOOKUP(League[[#This Row],[Memberno]],XC[[Mem]:[Total Points]],5,0),\"\")","v":""},{"$f":"IFERROR(VLOOKUP(League[[#This Row],[Parkrun '#]],Parkrun[],7,FALSE),\"\")","v":""},{"$f":"IFERROR(VLOOKUP(League[[#This Row],[Memberno]],Club5k[],5,FALSE),\"\")","v":""},{"$f":"IFERROR(VLOOKUP(League[[#This Row],[Memberno]],Halfmarathon[Mem]:Halfmarathon[Points],4,0),\"\")","v":""},{"$f":"IFERROR(VLOOKUP(League[[#This Row],[Memberno]],Marathon[],4,FALSE),\"\")","v":""},{"$f":"IFERROR(VLOOKUP(League[[#This Row],[Memberno]],Table18[],5,FALSE),\"\")","v":""},{"$f":"IFERROR(VLOOKUP(League[[#This Row],[Memberno]],tenK[[Member '#]:[Total Points]],2,FALSE),\"\")","v":""},{"$f":"IFERROR(VLOOKUP(League[[#This Row],[Memberno]],Thunderrun[],3,FALSE),\"\")","v":""}]
[null,"Beverley Gosling",320,null,{"$f":"COUNT(League[[#This Row],[XC]:[Thunder Run]])","v":0},"F",{"$f":"VLOOKUP(League[[#This Row],[Memberno]],Allmembers[],7,FALSE)","v":"FV45"},{"$f":"RANK(League[[#This Row],[Total Points]],League[Total Points])","v":125},{"$f":"IF(League[[#This Row],[Gender]]=\"M\",RANK(League[Total Points],mrank),\"\")","v":""},{"$f":"IF(League[[#This Row],[Gender]]=\"F\",RANK(League[Total Points],wrank),\"\")","v":49},{"$f":"SUM(League[[#This Row],[XC]:[Thunder Run]])","v":0},{"$f":"IFERROR(VLOOKUP(League[[#This Row],[Memberno]],XC[[Mem]:[Total Points]],5,0),\"\")","v":""},{"$f":"IFERROR(VLOOKUP(League[[#This Row],[Parkrun '#]],Parkrun[],7,FALSE),\"\")","v":""},{"$f":"IFERROR(VLOOKUP(League[[#This Row],[Memberno]],Club5k[],5,FALSE),\"\")","v":""},{"$f":"IFERROR(VLOOKUP(League[[#This Row],[Memberno]],Halfmarathon[Mem]:Halfmarathon[Points],4,0),\"\")","v":""},{"$f":"IFERROR(VLOOKUP(League[[#This Row],[Memberno]],Marathon[],4,FALSE),\"\")","v":""},{"$f":"IFERROR(VLOOKUP(League[[#This Row],[Memberno]],Table18[],5,FALSE),\"\")","v":""},{"$f":"IFERROR(VLOOKUP(League[[#This Row],[Memberno]],tenK[[Member '#]:[Total Points]],2,FALSE),\"\")","v":""},{"$f":"IFERROR(VLOOKUP(League[[#This Row],[Memberno]],Thunderrun[],3,FALSE),\"\")","v":""}]
[null,"Charlotte Walsh",{"$f":"IFERROR(VLOOKUP(League[[#This Row],[Name]],members,2,FALSE),\"\")","v":297},null,{"$f":"COUNT(League[[#This Row],[XC]:[Thunder Run]])","v":0},"F",{"$f":"VLOOKUP(League[[#This Row],[Memberno]],Allmembers[],7,FALSE)","v":"FS"},{"$f":"RANK(League[[#This Row],[Total Points]],League[Total Points])","v":125},{"$f":"IF(League[[#This Row],[Gender]]=\"M\",RANK(League[Total Points],mrank),\"\")","v":""},{"$f":"IF(League[[#This Row],[Gender]]=\"F\",RANK(League[Total Points],wrank),\"\")","v":49},{"$f":"SUM(League[[#This Row],[XC]:[Thunder Run]])","v":0},{"$f":"IFERROR(VLOOKUP(League[[#This Row],[Memberno]],XC[[Mem]:[Total Points]],5,0),\"\")","v":""},{"$f":"IFERROR(VLOOKUP(League[[#This Row],[Parkrun '#]],Parkrun[],7,FALSE),\"\")","v":""},{"$f":"IFERROR(VLOOKUP(League[[#This Row],[Memberno]],Club5k[],5,FALSE),\"\")","v":""},{"$f":"IFERROR(VLOOKUP(League[[#This Row],[Memberno]],Halfmarathon[Mem]:Halfmarathon[Points],4,0),\"\")","v":""},{"$f":"IFERROR(VLOOKUP(League[[#This Row],[Memberno]],Marathon[],4,FALSE),\"\")","v":""},{"$f":"IFERROR(VLOOKUP(League[[#This Row],[Memberno]],Table18[],5,FALSE),\"\")","v":""},{"$f":"IFERROR(VLOOKUP(League[[#This Row],[Memberno]],tenK[[Member '#]:[Total Points]],2,FALSE),\"\")","v":""},{"$f":"IFERROR(VLOOKUP(League[[#This Row],[Memberno]],Thunderrun[],3,FALSE),\"\")","v":""}]
[null,"Chris Mayne",{"$f":"IFERROR(VLOOKUP(League[[#This Row],[Name]],members,2,FALSE),\"\")","v":112}," ",{"$f":"COUNT(League[[#This Row],[XC]:[Thunder Run]])","v":0},"M",{"$f":"VLOOKUP(League[[#This Row],[Memberno]],Allmembers[],7,FALSE)","v":"MV80"},{"$f":"RANK(League[[#This Row],[Total Points]],League[Total Points])","v":125},{"$f":"IF(League[[#This Row],[Gender]]=\"M\",RANK(League[Total Points],mrank),\"\")","v":77},{"$f":"IF(League[[#This Row],[Gender]]=\"F\",RANK(League[Total Points],wrank),\"\")","v":""},{"$f":"SUM(League[[#This Row],[XC]:[Thunder Run]])","v":0},{"$f":"IFERROR(VLOOKUP(League[[#This Row],[Memberno]],XC[[Mem]:[Total Points]],5,0),\"\")","v":""},{"$f":"IFERROR(VLOOKUP(League[[#This Row],[Parkrun '#]],Parkrun[],7,FALSE),\"\")","v":""},{"$f":"IFERROR(VLOOKUP(League[[#This Row],[Memberno]],Club5k[],5,FALSE),\"\")","v":""},{"$f":"IFERROR(VLOOKUP(League[[#This Row],[Memberno]],Halfmarathon[Mem]:Halfmarathon[Points],4,0),\"\")","v":""},{"$f":"IFERROR(VLOOKUP(League[[#This Row],[Memberno]],Marathon[],4,FALSE),\"\")","v":""},{"$f":"IFERROR(VLOOKUP(League[[#This Row],[Memberno]],Table18[],5,FALSE),\"\")","v":""},{"$f":"IFERROR(VLOOKUP(League[[#This Row],[Memberno]],tenK[[Member '#]:[Total Points]],2,FALSE),\"\")","v":""},{"$f":"IFERROR(VLOOKUP(League[[#This Row],[Memberno]],Thunderrun[],3,FALSE),\"\")","v":""}]
[null,"Dan Day",{"$f":"IFERROR(VLOOKUP(League[[#This Row],[Name]],members,2,FALSE),\"\")","v":166}," ",{"$f":"COUNT(League[[#This Row],[XC]:[Thunder Run]])","v":0},"M",{"$f":"VLOOKUP(League[[#This Row],[Memberno]],Allmembers[],7,FALSE)","v":"MS"},{"$f":"RANK(League[[#This Row],[Total Points]],League[Total Points])","v":125},{"$f":"IF(League[[#This Row],[Gender]]=\"M\",RANK(League[Total Points],mrank),\"\")","v":77},{"$f":"IF(League[[#This Row],[Gender]]=\"F\",RANK(League[Total Points],wrank),\"\")","v":""},{"$f":"SUM(League[[#This Row],[XC]:[Thunder Run]])","v":0},{"$f":"IFERROR(VLOOKUP(League[[#This Row],[Memberno]],XC[[Mem]:[Total Points]],5,0),\"\")","v":""},{"$f":"IFERROR(VLOOKUP(League[[#This Row],[Parkrun '#]],Parkrun[],7,FALSE),\"\")","v":""},{"$f":"IFERROR(VLOOKUP(League[[#This Row],[Memberno]],Club5k[],5,FALSE),\"\")","v":""},{"$f":"IFERROR(VLOOKUP(League[[#This Row],[Memberno]],Halfmarathon[Mem]:Halfmarathon[Points],4,0),\"\")","v":""},{"$f":"IFERROR(VLOOKUP(League[[#This Row],[Memberno]],Marathon[],4,FALSE),\"\")","v":""},{"$f":"IFERROR(VLOOKUP(League[[#This Row],[Memberno]],Table18[],5,FALSE),\"\")","v":""},{"$f":"IFERROR(VLOOKUP(League[[#This Row],[Memberno]],tenK[[Member '#]:[Total Points]],2,FALSE),\"\")","v":""},{"$f":"IFERROR(VLOOKUP(League[[#This Row],[Memberno]],Thunderrun[],3,FALSE),\"\")","v":""}]
[null,"Debbi James",{"$f":"IFERROR(VLOOKUP(League[[#This Row],[Name]],members,2,FALSE),\"\")","v":304},null,{"$f":"COUNT(League[[#This Row],[XC]:[Thunder Run]])","v":0},"F",{"$f":"VLOOKUP(League[[#This Row],[Memberno]],Allmembers[],7,FALSE)","v":"FS"},{"$f":"RANK(League[[#This Row],[Total Points]],League[Total Points])","v":125},{"$f":"IF(League[[#This Row],[Gender]]=\"M\",RANK(League[Total Points],mrank),\"\")","v":""},{"$f":"IF(League[[#This Row],[Gender]]=\"F\",RANK(League[Total Points],wrank),\"\")","v":49},{"$f":"SUM(League[[#This Row],[XC]:[Thunder Run]])","v":0},{"$f":"IFERROR(VLOOKUP(League[[#This Row],[Memberno]],XC[[Mem]:[Total Points]],5,0),\"\")","v":""},{"$f":"IFERROR(VLOOKUP(League[[#This Row],[Parkrun '#]],Parkrun[],7,FALSE),\"\")","v":""},{"$f":"IFERROR(VLOOKUP(League[[#This Row],[Memberno]],Club5k[],5,FALSE),\"\")","v":""},{"$f":"IFERROR(VLOOKUP(League[[#This Row],[Memberno]],Halfmarathon[Mem]:Halfmarathon[Points],4,0),\"\")","v":""},{"$f":"IFERROR(VLOOKUP(League[[#This Row],[Memberno]],Marathon[],4,FALSE),\"\")","v":""},{"$f":"IFERROR(VLOOKUP(League[[#This Row],[Memberno]],Table18[],5,FALSE),\"\")","v":""},{"$f":"IFERROR(VLOOKUP(League[[#This Row],[Memberno]],tenK[[Member '#]:[Total Points]],2,FALSE),\"\")","v":""},{"$f":"IFERROR(VLOOKUP(League[[#This Row],[Memberno]],Thunderrun[],3,FALSE),\"\")","v":""}]
[null,"Jim Robinson",286," ",{"$f":"COUNT(League[[#This Row],[XC]:[Thunder Run]])","v":0},"M",{"$f":"VLOOKUP(League[[#This Row],[Memberno]],Allmembers[],7,FALSE)","v":"MV40"},{"$f":"RANK(League[[#This Row],[Total Points]],League[Total Points])","v":125},{"$f":"IF(League[[#This Row],[Gender]]=\"M\",RANK(League[Total Points],mrank),\"\")","v":77},{"$f":"IF(League[[#This Row],[Gender]]=\"F\",RANK(League[Total Points],wrank),\"\")","v":""},{"$f":"SUM(League[[#This Row],[XC]:[Thunder Run]])","v":0},{"$f":"IFERROR(VLOOKUP(League[[#This Row],[Memberno]],XC[[Mem]:[Total Points]],5,0),\"\")","v":""},{"$f":"IFERROR(VLOOKUP(League[[#This Row],[Parkrun '#]],Parkrun[],7,FALSE),\"\")","v":""},{"$f":"IFERROR(VLOOKUP(League[[#This Row],[Memberno]],Club5k[],5,FALSE),\"\")","v":""},{"$f":"IFERROR(VLOOKUP(League[[#This Row],[Memberno]],Halfmarathon[Mem]:Halfmarathon[Points],4,0),\"\")","v":""},{"$f":"IFERROR(VLOOKUP(League[[#This Row],[Memberno]],Marathon[],4,FALSE),\"\")","v":""},{"$f":"IFERROR(VLOOKUP(League[[#This Row],[Memberno]],Table18[],5,FALSE),\"\")","v":""},{"$f":"IFERROR(VLOOKUP(League[[#This Row],[Memberno]],tenK[[Member '#]:[Total Points]],2,FALSE),\"\")","v":""},{"$f":"IFERROR(VLOOKUP(League[[#This Row],[Memberno]],Thunderrun[],3,FALSE),\"\")","v":""}]
[null,"Jon Carr",{"$f":"IFERROR(VLOOKUP(League[[#This Row],[Name]],members,2,FALSE),\"\")","v":246}," ",{"$f":"COUNT(League[[#This Row],[XC]:[Thunder Run]])","v":0},"M",{"$f":"VLOOKUP(League[[#This Row],[Memberno]],Allmembers[],7,FALSE)","v":"MV50"},{"$f":"RANK(League[[#This Row],[Total Points]],League[Total Points])","v":125},{"$f":"IF(League[[#This Row],[Gender]]=\"M\",RANK(League[Total Points],mrank),\"\")","v":77},{"$f":"IF(League[[#This Row],[Gender]]=\"F\",RANK(League[Total Points],wrank),\"\")","v":""},{"$f":"SUM(League[[#This Row],[XC]:[Thunder Run]])","v":0},{"$f":"IFERROR(VLOOKUP(League[[#This Row],[Memberno]],XC[[Mem]:[Total Points]],5,0),\"\")","v":""},{"$f":"IFERROR(VLOOKUP(League[[#This Row],[Parkrun '#]],Parkrun[],7,FALSE),\"\")","v":""},{"$f":"IFERROR(VLOOKUP(League[[#This Row],[Memberno]],Club5k[],5,FALSE),\"\")","v":""},{"$f":"IFERROR(VLOOKUP(League[[#This Row],[Memberno]],Halfmarathon[Mem]:Halfmarathon[Points],4,0),\"\")","v":""},{"$f":"IFERROR(VLOOKUP(League[[#This Row],[Memberno]],Marathon[],4,FALSE),\"\")","v":""},{"$f":"IFERROR(VLOOKUP(League[[#This Row],[Memberno]],Table18[],5,FALSE),\"\")","v":""},{"$f":"IFERROR(VLOOKUP(League[[#This Row],[Memberno]],tenK[[Member '#]:[Total Points]],2,FALSE),\"\")","v":""},{"$f":"IFERROR(VLOOKUP(League[[#This Row],[Memberno]],Thunderrun[],3,FALSE),\"\")","v":""}]
[null,"Jordan Thomas",313,null,{"$f":"COUNT(League[[#This Row],[XC]:[Thunder Run]])","v":0},"M",{"$f":"VLOOKUP(League[[#This Row],[Memberno]],Allmembers[],7,FALSE)","v":"M"},{"$f":"RANK(League[[#This Row],[Total Points]],League[Total Points])","v":125},{"$f":"IF(League[[#This Row],[Gender]]=\"M\",RANK(League[Total Points],mrank),\"\")","v":77},{"$f":"IF(League[[#This Row],[Gender]]=\"F\",RANK(League[Total Points],wrank),\"\")","v":""},{"$f":"SUM(League[[#This Row],[XC]:[Thunder Run]])","v":0},{"$f":"IFERROR(VLOOKUP(League[[#This Row],[Memberno]],XC[[Mem]:[Total Points]],5,0),\"\")","v":""},{"$f":"IFERROR(VLOOKUP(League[[#This Row],[Parkrun '#]],Parkrun[],7,FALSE),\"\")","v":""},{"$f":"IFERROR(VLOOKUP(League[[#This Row],[Memberno]],Club5k[],5,FALSE),\"\")","v":""},{"$f":"IFERROR(VLOOKUP(League[[#This Row],[Memberno]],Halfmarathon[Mem]:Halfmarathon[Points],4,0),\"\")","v":""},{"$f":"IFERROR(VLOOKUP(League[[#This Row],[Memberno]],Marathon[],4,FALSE),\"\")","v":""},{"$f":"IFERROR(VLOOKUP(League[[#This Row],[Memberno]],Table18[],5,FALSE),\"\")","v":""},{"$f":"IFERROR(VLOOKUP(League[[#This Row],[Memberno]],tenK[[Member '#]:[Total Points]],2,FALSE),\"\")","v":""},{"$f":"IFERROR(VLOOKUP(League[[#This Row],[Memberno]],Thunderrun[],3,FALSE),\"\")","v":""}]
[null,"Julie-Anne Moors",{"$f":"IFERROR(VLOOKUP(League[[#This Row],[Name]],members,2,FALSE),\"\")","v":305},null,{"$f":"COUNT(League[[#This Row],[XC]:[Thunder Run]])","v":0},"F",{"$f":"VLOOKUP(League[[#This Row],[Memberno]],Allmembers[],7,FALSE)","v":"FV45"},{"$f":"RANK(League[[#This Row],[Total Points]],League[Total Points])","v":125},{"$f":"IF(League[[#This Row],[Gender]]=\"M\",RANK(League[Total Points],mrank),\"\")","v":""},{"$f":"IF(League[[#This Row],[Gender]]=\"F\",RANK(League[Total Points],wrank),\"\")","v":49},{"$f":"SUM(League[[#This Row],[XC]:[Thunder Run]])","v":0},{"$f":"IFERROR(VLOOKUP(League[[#This Row],[Memberno]],XC[[Mem]:[Total Points]],5,0),\"\")","v":""},{"$f":"IFERROR(VLOOKUP(League[[#This Row],[Parkrun '#]],Parkrun[],7,FALSE),\"\")","v":""},{"$f":"IFERROR(VLOOKUP(League[[#This Row],[Memberno]],Club5k[],5,FALSE),\"\")","v":""},{"$f":"IFERROR(VLOOKUP(League[[#This Row],[Memberno]],Halfmarathon[Mem]:Halfmarathon[Points],4,0),\"\")","v":""},{"$f":"IFERROR(VLOOKUP(League[[#This Row],[Memberno]],Marathon[],4,FALSE),\"\")","v":""},{"$f":"IFERROR(VLOOKUP(League[[#This Row],[Memberno]],Table18[],5,FALSE),\"\")","v":""},{"$f":"IFERROR(VLOOKUP(League[[#This Row],[Memberno]],tenK[[Member '#]:[Total Points]],2,FALSE),\"\")","v":""},{"$f":"IFERROR(VLOOKUP(League[[#This Row],[Memberno]],Thunderrun[],3,FALSE),\"\")","v":""}]
[null,"Juliet Jacobs",{"$f":"IFERROR(VLOOKUP(League[[#This Row],[Name]],members,2,FALSE),\"\")","v":213},349306,{"$f":"COUNT(League[[#This Row],[XC]:[Thunder Run]])","v":0},"F",{"$f":"VLOOKUP(League[[#This Row],[Memberno]],Allmembers[],7,FALSE)","v":"FV35"},{"$f":"RANK(League[[#This Row],[Total Points]],League[Total Points])","v":125},{"$f":"IF(League[[#This Row],[Gender]]=\"M\",RANK(League[Total Points],mrank),\"\")","v":""},{"$f":"IF(League[[#This Row],[Gender]]=\"F\",RANK(League[Total Points],wrank),\"\")","v":49},{"$f":"SUM(League[[#This Row],[XC]:[Thunder Run]])","v":0},{"$f":"IFERROR(VLOOKUP(League[[#This Row],[Memberno]],XC[[Mem]:[Total Points]],5,0),\"\")","v":""},{"$f":"IFERROR(VLOOKUP(League[[#This Row],[Parkrun '#]],Parkrun[],7,FALSE),\"\")","v":""},{"$f":"IFERROR(VLOOKUP(League[[#This Row],[Memberno]],Club5k[],5,FALSE),\"\")","v":""},{"$f":"IFERROR(VLOOKUP(League[[#This Row],[Memberno]],Halfmarathon[Mem]:Halfmarathon[Points],4,0),\"\")","v":""},{"$f":"IFERROR(VLOOKUP(League[[#This Row],[Memberno]],Marathon[],4,FALSE),\"\")","v":""},{"$f":"IFERROR(VLOOKUP(League[[#This Row],[Memberno]],Table18[],5,FALSE),\"\")","v":""},{"$f":"IFERROR(VLOOKUP(League[[#This Row],[Memberno]],tenK[[Member '#]:[Total Points]],2,FALSE),\"\")","v":""},{"$f":"IFERROR(VLOOKUP(League[[#This Row],[Memberno]],Thunderrun[],3,FALSE),\"\")","v":""}]
[null,"Kate Speirs",{"$f":"IFERROR(VLOOKUP(League[[#This Row],[Name]],members,2,FALSE),\"\")","v":139},214864,{"$f":"COUNT(League[[#This Row],[XC]:[Thunder Run]])","v":0},"F",{"$f":"VLOOKUP(League[[#This Row],[Memberno]],Allmembers[],7,FALSE)","v":"FV35"},{"$f":"RANK(League[[#This Row],[Total Points]],League[Total Points])","v":125},{"$f":"IF(League[[#This Row],[Gender]]=\"M\",RANK(League[Total Points],mrank),\"\")","v":""},{"$f":"IF(League[[#This Row],[Gender]]=\"F\",RANK(League[Total Points],wrank),\"\")","v":49},{"$f":"SUM(League[[#This Row],[XC]:[Thunder Run]])","v":0},{"$f":"IFERROR(VLOOKUP(League[[#This Row],[Memberno]],XC[[Mem]:[Total Points]],5,0),\"\")","v":""},{"$f":"IFERROR(VLOOKUP(League[[#This Row],[Parkrun '#]],Parkrun[],7,FALSE),\"\")","v":""},{"$f":"IFERROR(VLOOKUP(League[[#This Row],[Memberno]],Club5k[],5,FALSE),\"\")","v":""},{"$f":"IFERROR(VLOOKUP(League[[#This Row],[Memberno]],Halfmarathon[Mem]:Halfmarathon[Points],4,0),\"\")","v":""},{"$f":"IFERROR(VLOOKUP(League[[#This Row],[Memberno]],Marathon[],4,FALSE),\"\")","v":""},{"$f":"IFERROR(VLOOKUP(League[[#This Row],[Memberno]],Table18[],5,FALSE),\"\")","v":""},{"$f":"IFERROR(VLOOKUP(League[[#This Row],[Memberno]],tenK[[Member '#]:[Total Points]],2,FALSE),\"\")","v":""},{"$f":"IFERROR(VLOOKUP(League[[#This Row],[Memberno]],Thunderrun[],3,FALSE),\"\")","v":""}]
[null,"Katie Fox",281," ",{"$f":"COUNT(League[[#This Row],[XC]:[Thunder Run]])","v":0},"F",{"$f":"VLOOKUP(League[[#This Row],[Memberno]],Allmembers[],7,FALSE)","v":"FS"},{"$f":"RANK(League[[#This Row],[Total Points]],League[Total Points])","v":125},{"$f":"IF(League[[#This Row],[Gender]]=\"M\",RANK(League[Total Points],mrank),\"\")","v":""},{"$f":"IF(League[[#This Row],[Gender]]=\"F\",RANK(League[Total Points],wrank),\"\")","v":49},{"$f":"SUM(League[[#This Row],[XC]:[Thunder Run]])","v":0},{"$f":"IFERROR(VLOOKUP(League[[#This Row],[Memberno]],XC[[Mem]:[Total Points]],5,0),\"\")","v":""},{"$f":"IFERROR(VLOOKUP(League[[#This Row],[Parkrun '#]],Parkrun[],7,FALSE),\"\")","v":""},{"$f":"IFERROR(VLOOKUP(League[[#This Row],[Memberno]],Club5k[],5,FALSE),\"\")","v":""},{"$f":"IFERROR(VLOOKUP(League[[#This Row],[Memberno]],Halfmarathon[Mem]:Halfmarathon[Points],4,0),\"\")","v":""},{"$f":"IFERROR(VLOOKUP(League[[#This Row],[Memberno]],Marathon[],4,FALSE),\"\")","v":""},{"$f":"IFERROR(VLOOKUP(League[[#This Row],[Memberno]],Table18[],5,FALSE),\"\")","v":""},{"$f":"IFERROR(VLOOKUP(League[[#This Row],[Memberno]],tenK[[Member '#]:[Total Points]],2,FALSE),\"\")","v":""},{"$f":"IFERROR(VLOOKUP(League[[#This Row],[Memberno]],Thunderrun[],3,FALSE),\"\")","v":""}]
[null,"Laura Hicks",319,null,{"$f":"COUNT(League[[#This Row],[XC]:[Thunder Run]])","v":0},"F",{"$f":"VLOOKUP(League[[#This Row],[Memberno]],Allmembers[],7,FALSE)","v":"F"},{"$f":"RANK(League[[#This Row],[Total Points]],League[Total Points])","v":125},{"$f":"IF(League[[#This Row],[Gender]]=\"M\",RANK(League[Total Points],mrank),\"\")","v":""},{"$f":"IF(League[[#This Row],[Gender]]=\"F\",RANK(League[Total Points],wrank),\"\")","v":49},{"$f":"SUM(League[[#This Row],[XC]:[Thunder Run]])","v":0},{"$f":"IFERROR(VLOOKUP(League[[#This Row],[Memberno]],XC[[Mem]:[Total Points]],5,0),\"\")","v":""},{"$f":"IFERROR(VLOOKUP(League[[#This Row],[Parkrun '#]],Parkrun[],7,FALSE),\"\")","v":""},{"$f":"IFERROR(VLOOKUP(League[[#This Row],[Memberno]],Club5k[],5,FALSE),\"\")","v":""},{"$f":"IFERROR(VLOOKUP(League[[#This Row],[Memberno]],Halfmarathon[Mem]:Halfmarathon[Points],4,0),\"\")","v":""},{"$f":"IFERROR(VLOOKUP(League[[#This Row],[Memberno]],Marathon[],4,FALSE),\"\")","v":""},{"$f":"IFERROR(VLOOKUP(League[[#This Row],[Memberno]],Table18[],5,FALSE),\"\")","v":""},{"$f":"IFERROR(VLOOKUP(League[[#This Row],[Memberno]],tenK[[Member '#]:[Total Points]],2,FALSE),\"\")","v":""},{"$f":"IFERROR(VLOOKUP(League[[#This Row],[Memberno]],Thunderrun[],3,FALSE),\"\")","v":""}]
[null,"Lloyd Watson",{"$f":"IFERROR(VLOOKUP(League[[#This Row],[Name]],members,2,FALSE),\"\")","v":175}," ",{"$f":"COUNT(League[[#This Row],[XC]:[Thunder Run]])","v":0},"M",{"$f":"VLOOKUP(League[[#This Row],[Memberno]],Allmembers[],7,FALSE)","v":"MV50"},{"$f":"RANK(League[[#This Row],[Total Points]],League[Total Points])","v":125},{"$f":"IF(League[[#This Row],[Gender]]=\"M\",RANK(League[Total Points],mrank),\"\")","v":77},{"$f":"IF(League[[#This Row],[Gender]]=\"F\",RANK(League[Total Points],wrank),\"\")","v":""},{"$f":"SUM(League[[#This Row],[XC]:[Thunder Run]])","v":0},{"$f":"IFERROR(VLOOKUP(League[[#This Row],[Memberno]],XC[[Mem]:[Total Points]],5,0),\"\")","v":""},{"$f":"IFERROR(VLOOKUP(League[[#This Row],[Parkrun '#]],Parkrun[],7,FALSE),\"\")","v":""},{"$f":"IFERROR(VLOOKUP(League[[#This Row],[Memberno]],Club5k[],5,FALSE),\"\")","v":""},{"$f":"IFERROR(VLOOKUP(League[[#This Row],[Memberno]],Halfmarathon[Mem]:Halfmarathon[Points],4,0),\"\")","v":""},{"$f":"IFERROR(VLOOKUP(League[[#This Row],[Memberno]],Marathon[],4,FALSE),\"\")","v":""},{"$f":"IFERROR(VLOOKUP(League[[#This Row],[Memberno]],Table18[],5,FALSE),\"\")","v":""},{"$f":"IFERROR(VLOOKUP(League[[#This Row],[Memberno]],tenK[[Member '#]:[Total Points]],2,FALSE),\"\")","v":""},{"$f":"IFERROR(VLOOKUP(League[[#This Row],[Memberno]],Thunderrun[],3,FALSE),\"\")","v":""}]
[null,"Maria Niembro",{"$f":"IFERROR(VLOOKUP(League[[#This Row],[Name]],members,2,FALSE),\"\")","v":265}," ",{"$f":"COUNT(League[[#This Row],[XC]:[Thunder Run]])","v":0},"F",{"$f":"VLOOKUP(League[[#This Row],[Memberno]],Allmembers[],7,FALSE)","v":"FS"},{"$f":"RANK(League[[#This Row],[Total Points]],League[Total Points])","v":125},{"$f":"IF(League[[#This Row],[Gender]]=\"M\",RANK(League[Total Points],mrank),\"\")","v":""},{"$f":"IF(League[[#This Row],[Gender]]=\"F\",RANK(League[Total Points],wrank),\"\")","v":49},{"$f":"SUM(League[[#This Row],[XC]:[Thunder Run]])","v":0},{"$f":"IFERROR(VLOOKUP(League[[#This Row],[Memberno]],XC[[Mem]:[Total Points]],5,0),\"\")","v":""},{"$f":"IFERROR(VLOOKUP(League[[#This Row],[Parkrun '#]],Parkrun[],7,FALSE),\"\")","v":""},{"$f":"IFERROR(VLOOKUP(League[[#This Row],[Memberno]],Club5k[],5,FALSE),\"\")","v":""},{"$f":"IFERROR(VLOOKUP(League[[#This Row],[Memberno]],Halfmarathon[Mem]:Halfmarathon[Points],4,0),\"\")","v":""},{"$f":"IFERROR(VLOOKUP(League[[#This Row],[Memberno]],Marathon[],4,FALSE),\"\")","v":""},{"$f":"IFERROR(VLOOKUP(League[[#This Row],[Memberno]],Table18[],5,FALSE),\"\")","v":""},{"$f":"IFERROR(VLOOKUP(League[[#This Row],[Memberno]],tenK[[Member '#]:[Total Points]],2,FALSE),\"\")","v":""},{"$f":"IFERROR(VLOOKUP(League[[#This Row],[Memberno]],Thunderrun[],3,FALSE),\"\")","v":""}]
[null,"Martin Leach",{"$f":"IFERROR(VLOOKUP(League[[#This Row],[Name]],members,2,FALSE),\"\")","v":301},null,{"$f":"COUNT(League[[#This Row],[XC]:[Thunder Run]])","v":0},"M",{"$f":"VLOOKUP(League[[#This Row],[Memberno]],Allmembers[],7,FALSE)","v":"MV40"},{"$f":"RANK(League[[#This Row],[Total Points]],League[Total Points])","v":125},{"$f":"IF(League[[#This Row],[Gender]]=\"M\",RANK(League[Total Points],mrank),\"\")","v":77},{"$f":"IF(League[[#This Row],[Gender]]=\"F\",RANK(League[Total Points],wrank),\"\")","v":""},{"$f":"SUM(League[[#This Row],[XC]:[Thunder Run]])","v":0},{"$f":"IFERROR(VLOOKUP(League[[#This Row],[Memberno]],XC[[Mem]:[Total Points]],5,0),\"\")","v":""},{"$f":"IFERROR(VLOOKUP(League[[#This Row],[Parkrun '#]],Parkrun[],7,FALSE),\"\")","v":""},{"$f":"IFERROR(VLOOKUP(League[[#This Row],[Memberno]],Club5k[],5,FALSE),\"\")","v":""},{"$f":"IFERROR(VLOOKUP(League[[#This Row],[Memberno]],Halfmarathon[Mem]:Halfmarathon[Points],4,0),\"\")","v":""},{"$f":"IFERROR(VLOOKUP(League[[#This Row],[Memberno]],Marathon[],4,FALSE),\"\")","v":""},{"$f":"IFERROR(VLOOKUP(League[[#This Row],[Memberno]],Table18[],5,FALSE),\"\")","v":""},{"$f":"IFERROR(VLOOKUP(League[[#This Row],[Memberno]],tenK[[Member '#]:[Total Points]],2,FALSE),\"\")","v":""},{"$f":"IFERROR(VLOOKUP(League[[#This Row],[Memberno]],Thunderrun[],3,FALSE),\"\")","v":""}]
[null,"Olivia Hessey",278," ",{"$f":"COUNT(League[[#This Row],[XC]:[Thunder Run]])","v":0},"F",{"$f":"VLOOKUP(League[[#This Row],[Memberno]],Allmembers[],7,FALSE)","v":"F"},{"$f":"RANK(League[[#This Row],[Total Points]],League[Total Points])","v":125},{"$f":"IF(League[[#This Row],[Gender]]=\"M\",RANK(League[Total Points],mrank),\"\")","v":""},{"$f":"IF(League[[#This Row],[Gender]]=\"F\",RANK(League[Total Points],wrank),\"\")","v":49},{"$f":"SUM(League[[#This Row],[XC]:[Thunder Run]])","v":0},{"$f":"IFERROR(VLOOKUP(League[[#This Row],[Memberno]],XC[[Mem]:[Total Points]],5,0),\"\")","v":""},{"$f":"IFERROR(VLOOKUP(League[[#This Row],[Parkrun '#]],Parkrun[],7,FALSE),\"\")","v":""},{"$f":"IFERROR(VLOOKUP(League[[#This Row],[Memberno]],Club5k[],5,FALSE),\"\")","v":""},{"$f":"IFERROR(VLOOKUP(League[[#This Row],[Memberno]],Halfmarathon[Mem]:Halfmarathon[Points],4,0),\"\")","v":""},{"$f":"IFERROR(VLOOKUP(League[[#This Row],[Memberno]],Marathon[],4,FALSE),\"\")","v":""},{"$f":"IFERROR(VLOOKUP(League[[#This Row],[Memberno]],Table18[],5,FALSE),\"\")","v":""},{"$f":"IFERROR(VLOOKUP(League[[#This Row],[Memberno]],tenK[[Member '#]:[Total Points]],2,FALSE),\"\")","v":""},{"$f":"IFERROR(VLOOKUP(League[[#This Row],[Memberno]],Thunderrun[],3,FALSE),\"\")","v":""}]
[null,"Oswald Kawache",{"$f":"IFERROR(VLOOKUP(League[[#This Row],[Name]],members,2,FALSE),\"\")","v":296},null,{"$f":"COUNT(League[[#This Row],[XC]:[Thunder Run]])","v":0},"M",{"$f":"VLOOKUP(League[[#This Row],[Memberno]],Allmembers[],7,FALSE)","v":"M"},{"$f":"RANK(League[[#This Row],[Total Points]],League[Total Points])","v":125},{"$f":"IF(League[[#This Row],[Gender]]=\"M\",RANK(League[Total Points],mrank),\"\")","v":77},{"$f":"IF(League[[#This Row],[Gender]]=\"F\",RANK(League[Total Points],wrank),\"\")","v":""},{"$f":"SUM(League[[#This Row],[XC]:[Thunder Run]])","v":0},{"$f":"IFERROR(VLOOKUP(League[[#This Row],[Memberno]],XC[[Mem]:[Total Points]],5,0),\"\")","v":""},{"$f":"IFERROR(VLOOKUP(League[[#This Row],[Parkrun '#]],Parkrun[],7,FALSE),\"\")","v":""},{"$f":"IFERROR(VLOOKUP(League[[#This Row],[Memberno]],Club5k[],5,FALSE),\"\")","v":""},{"$f":"IFERROR(VLOOKUP(League[[#This Row],[Memberno]],Halfmarathon[Mem]:Halfmarathon[Points],4,0),\"\")","v":""},{"$f":"IFERROR(VLOOKUP(League[[#This Row],[Memberno]],Marathon[],4,FALSE),\"\")","v":""},{"$f":"IFERROR(VLOOKUP(League[[#This Row],[Memberno]],Table18[],5,FALSE),\"\")","v":""},{"$f":"IFERROR(VLOOKUP(League[[#This Row],[Memberno]],tenK[[Member '#]:[Total Points]],2,FALSE),\"\")","v":""},{"$f":"IFERROR(VLOOKUP(League[[#This Row],[Memberno]],Thunderrun[],3,FALSE),\"\")","v":""}]
[null,"Ravi Chandarana",{"$f":"IFERROR(VLOOKUP(League[[#This Row],[Name]],members,2,FALSE),\"\")","v":300},null,{"$f":"COUNT(League[[#This Row],[XC]:[Thunder Run]])","v":0},"M",{"$f":"VLOOKUP(League[[#This Row],[Memberno]],Allmembers[],7,FALSE)","v":"M"},{"$f":"RANK(League[[#This Row],[Total Points]],League[Total Points])","v":125},{"$f":"IF(League[[#This Row],[Gender]]=\"M\",RANK(League[Total Points],mrank),\"\")","v":77},{"$f":"IF(League[[#This Row],[Gender]]=\"F\",RANK(League[Total Points],wrank),\"\")","v":""},{"$f":"SUM(League[[#This Row],[XC]:[Thunder Run]])","v":0},{"$f":"IFERROR(VLOOKUP(League[[#This Row],[Memberno]],XC[[Mem]:[Total Points]],5,0),\"\")","v":""},{"$f":"IFERROR(VLOOKUP(League[[#This Row],[Parkrun '#]],Parkrun[],7,FALSE),\"\")","v":""},{"$f":"IFERROR(VLOOKUP(League[[#This Row],[Memberno]],Club5k[],5,FALSE),\"\")","v":""},{"$f":"IFERROR(VLOOKUP(League[[#This Row],[Memberno]],Halfmarathon[Mem]:Halfmarathon[Points],4,0),\"\")","v":""},{"$f":"IFERROR(VLOOKUP(League[[#This Row],[Memberno]],Marathon[],4,FALSE),\"\")","v":""},{"$f":"IFERROR(VLOOKUP(League[[#This Row],[Memberno]],Table18[],5,FALSE),\"\")","v":""},{"$f":"IFERROR(VLOOKUP(League[[#This Row],[Memberno]],tenK[[Member '#]:[Total Points]],2,FALSE),\"\")","v":""},{"$f":"IFERROR(VLOOKUP(League[[#This Row],[Memberno]],Thunderrun[],3,FALSE),\"\")","v":""}]
[null,"Sarah England",{"$f":"IFERROR(VLOOKUP(League[[#This Row],[Name]],members,2,FALSE),\"\")","v":150}," ",{"$f":"COUNT(League[[#This Row],[XC]:[Thunder Run]])","v":0},"F",{"$f":"VLOOKUP(League[[#This Row],[Memberno]],Allmembers[],7,FALSE)","v":"FS"},{"$f":"RANK(League[[#This Row],[Total Points]],League[Total Points])","v":125},{"$f":"IF(League[[#This Row],[Gender]]=\"M\",RANK(League[Total Points],mrank),\"\")","v":""},{"$f":"IF(League[[#This Row],[Gender]]=\"F\",RANK(League[Total Points],wrank),\"\")","v":49},{"$f":"SUM(League[[#This Row],[XC]:[Thunder Run]])","v":0},{"$f":"IFERROR(VLOOKUP(League[[#This Row],[Memberno]],XC[[Mem]:[Total Points]],5,0),\"\")","v":""},{"$f":"IFERROR(VLOOKUP(League[[#This Row],[Parkrun '#]],Parkrun[],7,FALSE),\"\")","v":""},{"$f":"IFERROR(VLOOKUP(League[[#This Row],[Memberno]],Club5k[],5,FALSE),\"\")","v":""},{"$f":"IFERROR(VLOOKUP(League[[#This Row],[Memberno]],Halfmarathon[Mem]:Halfmarathon[Points],4,0),\"\")","v":""},{"$f":"IFERROR(VLOOKUP(League[[#This Row],[Memberno]],Marathon[],4,FALSE),\"\")","v":""},{"$f":"IFERROR(VLOOKUP(League[[#This Row],[Memberno]],Table18[],5,FALSE),\"\")","v":""},{"$f":"IFERROR(VLOOKUP(League[[#This Row],[Memberno]],tenK[[Member '#]:[Total Points]],2,FALSE),\"\")","v":""},{"$f":"IFERROR(VLOOKUP(League[[#This Row],[Memberno]],Thunderrun[],3,FALSE),\"\")","v":""}]
[null,"Tammy Clarkson",{"$f":"IFERROR(VLOOKUP(League[[#This Row],[Name]],members,2,FALSE),\"\")","v":261}," ",{"$f":"COUNT(League[[#This Row],[XC]:[Thunder Run]])","v":0},"F",{"$f":"VLOOKUP(League[[#This Row],[Memberno]],Allmembers[],7,FALSE)","v":"FV35"},{"$f":"RANK(League[[#This Row],[Total Points]],League[Total Points])","v":125},{"$f":"IF(League[[#This Row],[Gender]]=\"M\",RANK(League[Total Points],mrank),\"\")","v":""},{"$f":"IF(League[[#This Row],[Gender]]=\"F\",RANK(League[Total Points],wrank),\"\")","v":49},{"$f":"SUM(League[[#This Row],[XC]:[Thunder Run]])","v":0},{"$f":"IFERROR(VLOOKUP(League[[#This Row],[Memberno]],XC[[Mem]:[Total Points]],5,0),\"\")","v":""},{"$f":"IFERROR(VLOOKUP(League[[#This Row],[Parkrun '#]],Parkrun[],7,FALSE),\"\")","v":""},{"$f":"IFERROR(VLOOKUP(League[[#This Row],[Memberno]],Club5k[],5,FALSE),\"\")","v":""},{"$f":"IFERROR(VLOOKUP(League[[#This Row],[Memberno]],Halfmarathon[Mem]:Halfmarathon[Points],4,0),\"\")","v":""},{"$f":"IFERROR(VLOOKUP(League[[#This Row],[Memberno]],Marathon[],4,FALSE),\"\")","v":""},{"$f":"IFERROR(VLOOKUP(League[[#This Row],[Memberno]],Table18[],5,FALSE),\"\")","v":""},{"$f":"IFERROR(VLOOKUP(League[[#This Row],[Memberno]],tenK[[Member '#]:[Total Points]],2,FALSE),\"\")","v":""},{"$f":"IFERROR(VLOOKUP(League[[#This Row],[Memberno]],Thunderrun[],3,FALSE),\"\")","v":""}]
[null,"Tanya Bruce",317,null,{"$f":"COUNT(League[[#This Row],[XC]:[Thunder Run]])","v":0},"F",{"$f":"VLOOKUP(League[[#This Row],[Memberno]],Allmembers[],7,FALSE)","v":"FV35"},{"$f":"RANK(League[[#This Row],[Total Points]],League[Total Points])","v":125},{"$f":"IF(League[[#This Row],[Gender]]=\"M\",RANK(League[Total Points],mrank),\"\")","v":""},{"$f":"IF(League[[#This Row],[Gender]]=\"F\",RANK(League[Total Points],wrank),\"\")","v":49},{"$f":"SUM(League[[#This Row],[XC]:[Thunder Run]])","v":0},{"$f":"IFERROR(VLOOKUP(League[[#This Row],[Memberno]],XC[[Mem]:[Total Points]],5,0),\"\")","v":""},{"$f":"IFERROR(VLOOKUP(League[[#This Row],[Parkrun '#]],Parkrun[],7,FALSE),\"\")","v":""},{"$f":"IFERROR(VLOOKUP(League[[#This Row],[Memberno]],Club5k[],5,FALSE),\"\")","v":""},{"$f":"IFERROR(VLOOKUP(League[[#This Row],[Memberno]],Halfmarathon[Mem]:Halfmarathon[Points],4,0),\"\")","v":""},{"$f":"IFERROR(VLOOKUP(League[[#This Row],[Memberno]],Marathon[],4,FALSE),\"\")","v":""},{"$f":"IFERROR(VLOOKUP(League[[#This Row],[Memberno]],Table18[],5,FALSE),\"\")","v":""},{"$f":"IFERROR(VLOOKUP(League[[#This Row],[Memberno]],tenK[[Member '#]:[Total Points]],2,FALSE),\"\")","v":""},{"$f":"IFERROR(VLOOKUP(League[[#This Row],[Memberno]],Thunderrun[],3,FALSE),\"\")","v":""}]
[null,"Tracey Devine",312,null,{"$f":"COUNT(League[[#This Row],[XC]:[Thunder Run]])","v":0},"F",{"$f":"VLOOKUP(League[[#This Row],[Memberno]],Allmembers[],7,FALSE)","v":"FV35"},{"$f":"RANK(League[[#This Row],[Total Points]],League[Total Points])","v":125},{"$f":"IF(League[[#This Row],[Gender]]=\"M\",RANK(League[Total Points],mrank),\"\")","v":""},{"$f":"IF(League[[#This Row],[Gender]]=\"F\",RANK(League[Total Points],wrank),\"\")","v":49},{"$f":"SUM(League[[#This Row],[XC]:[Thunder Run]])","v":0},{"$f":"IFERROR(VLOOKUP(League[[#This Row],[Memberno]],XC[[Mem]:[Total Points]],5,0),\"\")","v":""},{"$f":"IFERROR(VLOOKUP(League[[#This Row],[Parkrun '#]],Parkrun[],7,FALSE),\"\")","v":""},{"$f":"IFERROR(VLOOKUP(League[[#This Row],[Memberno]],Club5k[],5,FALSE),\"\")","v":""},{"$f":"IFERROR(VLOOKUP(League[[#This Row],[Memberno]],Halfmarathon[Mem]:Halfmarathon[Points],4,0),\"\")","v":""},{"$f":"IFERROR(VLOOKUP(League[[#This Row],[Memberno]],Marathon[],4,FALSE),\"\")","v":""},{"$f":"IFERROR(VLOOKUP(League[[#This Row],[Memberno]],Table18[],5,FALSE),\"\")","v":""},{"$f":"IFERROR(VLOOKUP(League[[#This Row],[Memberno]],tenK[[Member '#]:[Total Points]],2,FALSE),\"\")","v":""},{"$f":"IFERROR(VLOOKUP(League[[#This Row],[Memberno]],Thunderrun[],3,FALSE),\"\")","v":""}]
[null,"Victoria Blythe",{"$f":"IFERROR(VLOOKUP(League[[#This Row],[Name]],members,2,FALSE),\"\")","v":271}," ",{"$f":"COUNT(League[[#This Row],[XC]:[Thunder Run]])","v":0},"F",{"$f":"VLOOKUP(League[[#This Row],[Memberno]],Allmembers[],7,FALSE)","v":"FS"},{"$f":"RANK(League[[#This Row],[Total Points]],League[Total Points])","v":125},{"$f":"IF(League[[#This Row],[Gender]]=\"M\",RANK(League[Total Points],mrank),\"\")","v":""},{"$f":"IF(League[[#This Row],[Gender]]=\"F\",RANK(League[Total Points],wrank),\"\")","v":49},{"$f":"SUM(League[[#This Row],[XC]:[Thunder Run]])","v":0},{"$f":"IFERROR(VLOOKUP(League[[#This Row],[Memberno]],XC[[Mem]:[Total Points]],5,0),\"\")","v":""},{"$f":"IFERROR(VLOOKUP(League[[#This Row],[Parkrun '#]],Parkrun[],7,FALSE),\"\")","v":""},{"$f":"IFERROR(VLOOKUP(League[[#This Row],[Memberno]],Club5k[],5,FALSE),\"\")","v":""},{"$f":"IFERROR(VLOOKUP(League[[#This Row],[Memberno]],Halfmarathon[Mem]:Halfmarathon[Points],4,0),\"\")","v":""},{"$f":"IFERROR(VLOOKUP(League[[#This Row],[Memberno]],Marathon[],4,FALSE),\"\")","v":""},{"$f":"IFERROR(VLOOKUP(League[[#This Row],[Memberno]],Table18[],5,FALSE),\"\")","v":""},{"$f":"IFERROR(VLOOKUP(League[[#This Row],[Memberno]],tenK[[Member '#]:[Total Points]],2,FALSE),\"\")","v":""},{"$f":"IFERROR(VLOOKUP(League[[#This Row],[Memberno]],Thunderrun[],3,FALSE),\"\")","v":""}]
[null,"Total",{"$f":"SUBTOTAL(103,League[Memberno])","v":150},{"$f":"SUBTOTAL(102,League[Parkrun '#])","v":59},null,{"$f":"SUBTOTAL(103,League[Gender])","v":150},null,{"$f":"SUBTOTAL(103,League[Club Rank])","v":150},null,null,{"$f":"COUNTIF(League[Total Points],'Controls Page'!B1)","v":124},{"$f":"COUNTIF(League[XC],'Controls Page'!B1)","v":62},{"$f":"COUNTIF(League[Parkrun],'Controls Page'!$B$1)","v":50},{"$f":"SUBTOTAL(102,League[Club5K])","v":88},{"$f":"SUBTOTAL(102,League[HalfMarathon])","v":40},{"$f":"SUBTOTAL(102,League[Marathon or Ultra])","v":30},{"$f":"SUBTOTAL(102,League[10 Miles])","v":32},{"$f":"SUBTOTAL(102,League[10K])","v":72},{"$f":"SUBTOTAL(102,League[Thunder Run])","v":7}]

{"sheet":"XC Results","index":1,"n_rows":66,"n_cols":51,"rows_kept":66,"cut":false,"hidden":false,"merged":[]}
[null,null,null,"All XC Results"]
[]
[null,"N1","N2","Name","G","Mem","Gender","Group","# Events","Total Points","Royston Race Position","Royston Time","Royston Seconds","Royston Mens Time","Royston Ladies Times","Royston Mens Points","Royston Ladies Points","Royston Time2","Watford Race Position","WTime","Watford Seconds","Watford Mens Time","Watford  Ladies Time","Watford Mens Points","Waftord Ladies Points","Watford Time","Cheshunt  wtime","Cheshut place","Cheshunt Second","Cheshunt Mens Time","Cheshunt ladies Time","Cheshunt Mens Points","Cheshunt Ladies Point","Watford Challenge Place","Watford Challenge Mens Points","Watford Challenge Ladies Points","Watford Challenge Time","Grovelands place","Grovelands Mens Time","Grovelands Ladies Time","Glands Mens Secs","Gland Ladies Secs","Gland Mens Points","Gland Ladies Points","Trent Park Pos","Trent Park Mens Points","Trent Park Ladies Points","Trent Park Mens Time","Trent Park Ladies Time","TP Mens Secs","TP Ladies Secs"]
[null,"Simon","Kitchener",{"$f":"TRIM(XC[[#This Row],[N1]])&\" \"&TRIM(XC[[#This Row],[N2]])","v":"Simon Kitchener"},null,{"$f":"VLOOKUP(XC[[#This Row],[Name]],members,2,0)","v":9},"M",{"$f":"VLOOKUP(XC[[#This Row],[Mem]],Allmembers[],7,FALSE)","v":"MV60"},{"$f":"COUNT(XC[[#This Row],[Royston Race Position]],XC[[#This Row],[Watford Race Position]],XC[[#This Row],[Cheshut place]],XC[[#This Row],[Watford Challenge Place]],XC[[#This Row],[Grovelands place]],XC[[#This Row],[Trent Park Pos]])","v":2},{"$f":"IF(XC[[#This Row],[Gender]]=\"M\",XC[[#This Row],[Royston Mens Points]]+XC[[#This Row],[Watford Mens Points]]+XC[[#This Row],[Cheshunt Mens Points]]+XC[[#This Row],[Watford Challenge Mens Points]]+XC[[#This Row],[Gland Mens Points]]+XC[[#This Row],[Trent Park Mens Points]],XC[[#This Row],[Royston Ladies Points]]+XC[[#This Row],[Waftord Ladies Points]]+XC[[#This Row],[Cheshunt Ladies Point]]+XC[[#This Row],[Watford Challenge Ladies Points]]+XC[[#This Row],[Gland Ladies Points]]+XC[[#This Row],[Trent Park Ladies Points]])","v":63},171,"46:53",{"$f":"IF(XC[[#This Row],[Royston Time2]]>\" \",(HOUR(XC[[#This Row],[Royston Time2]])*3600)+MINUTE(XC[[#This Row],[Royston Time2]])*60+SECOND(XC[[#This Row],[Royston Time2]]),\"\")","v":2813},{"$f":"IFERROR(IF(FIND(\"M\",XC[[#This Row],[Group]])>0,XC[[#This Row],[Royston Seconds]],\"errorif\"),\"\")","v":2813},{"$f":"IFERROR(IF(FIND(\"F\",XC[[#This Row],[Group]])>0,XC[[#This Row],[Royston Seconds]],\"errorif\"),\"\")","v":""},{"$f":"IF(ISNUMBER(XC[[#This Row],[Royston Mens Time]]),50-(RANK(XC[[#This Row],[Royston Mens Time]],XC[Royston Mens Time],1))+1,0)","v":34},{"$f":"IF(ISNUMBER(XC[[#This Row],[Royston Ladies Times]]),50-(RANK(XC[[#This Row],[Royston Ladies Times]],XC[Royston Ladies Times],1))+1,0)","v":0},{"$f":"Hatime(XC[[#This Row],[Royston Time]])","v":"00:46:53"},null,null,{"$f":"IFERROR((HOUR(XC[[#This Row],[Watford Time]])*3600)+MINUTE(XC[[#This Row],[Watford Time]])*60+SECOND(XC[[#This Row],[Watford Time]]),\"\")","v":""},{"$f":"IFERROR(IF(FIND(\"M\",XC[[#This Row],[Group]])>0,XC[[#This Row],[Watford Seconds]],\"errorif\"),\"\")","v":""},{"$f":"IFERROR(IF(FIND(\"F\",XC[[#This Row],[Group]])>0,XC[[#This Row],[Watford Seconds]],\"errorif\"),\"\")","v":""},{"$f":"IF(ISNUMBER(XC[[#This Row],[Watford Mens Time]]),50-(RANK(XC[[#This Row],[Watford Mens Time]],XC[Watford Mens Time],1))+1,0)","v":0},{"$f":"IF(ISNUMBER(XC[[#This Row],[Watford  Ladies Time]]),50-(RANK(XC[[#This Row],[Watford  Ladies Time]],XC[Watford  Ladies Time],1))+1,0)","v":0},{"$f":"Hatime(XC[[#This Row],[WTime]])","v":""},"00:40:33",211,{"$f":"(HOUR(XC[[#This Row],[Cheshunt  wtime]])*3600)+MINUTE(XC[[#This Row],[Cheshunt  wtime]])*60+SECOND(XC[[#This Row],[Cheshunt  wtime]])","v":2433},{"$f":"IFERROR(IF(FIND(\"M\",XC[[#This Row],[Group]])>0,XC[[#This Row],[Cheshunt Second]],\"errorif\"),\"\")","v":2433},{"$f":"IFERROR(IF(FIND(\"F\",XC[[#This Row],[Group]])>0,XC[[#This Row],[Cheshunt Second]],\"errorif\"),\"\")","v":""},{"$f":"IF(ISNUMBER(XC[[#This Row],[Cheshunt Mens Time]]),50-(RANK(XC[[#This Row],[Cheshunt Mens Time]],XC[Cheshunt Mens Time],1))+1,0)","v":29},{"$f":"IF(ISNUMBER(XC[[#This Row],[Cheshunt ladies Time]]),50-(RANK(XC[[#This Row],[Cheshunt ladies Time]],XC[Cheshunt ladies Time],1))+1,0)","v":0},null,null,null,null,null,null,null," "," ",{"$f":"IF(ISNUMBER(XC[[#This Row],[Glands Mens Secs]]),50-(RANK(XC[[#This Row],[Glands Mens Secs]],XC[Glands Mens Secs],1))+1,0)","v":0},{"$f":"IF(ISNUMBER(XC[[#This Row],[Gland Ladies Secs]]),50-(RANK(XC[[#This Row],[Gland Ladies Secs]],XC[Gland Ladies Secs],1))+1,0)","v":0},"  ",{"$f":"IF(ISNUMBER(XC[[#This Row],[TP Mens Secs]]),50-_xlfn.RANK.EQ(XC[[#This Row],[TP Mens Secs]],XC[TP Mens Secs],1)+1,0)","v":0},{"$f":"IF(ISNUMBER(XC[[#This Row],[TP Ladies Secs]]),50-_xlfn.RANK.EQ(XC[[#This Row],[TP Ladies Secs]],XC[TP Ladies Secs],1)+1,0)","v":0}]
[null,"Georgie","Hamilton",{"$f":"TRIM(XC[[#This Row],[N1]])&\" \"&TRIM(XC[[#This Row],[N2]])","v":"Georgie Hamilton"},1,{"$f":"VLOOKUP(XC[[#This Row],[Name]],members,2,0)","v":12},"W",{"$f":"VLOOKUP(XC[[#This Row],[Mem]],Allmembers[],7,FALSE)","v":"FV65"},{"$f":"COUNT(XC[[#This Row],[Royston Race Position]],XC[[#This Row],[Watford Race Position]],XC[[#This Row],[Cheshut place]],XC[[#This Row],[Watford Challenge Place]],XC[[#This Row],[Grovelands place]],XC[[#This Row],[Trent Park Pos]])","v":4},{"$f":"IF(XC[[#This Row],[Gender]]=\"M\",XC[[#This Row],[Royston Mens Points]]+XC[[#This Row],[Watford Mens Points]]+XC[[#This Row],[Cheshunt Mens Points]]+XC[[#This Row],[Watford Challenge Mens Points]]+XC[[#This Row],[Gland Mens Points]]+XC[[#This Row],[Trent Park Mens Points]],XC[[#This Row],[Royston Ladies Points]]+XC[[#This Row],[Waftord Ladies Points]]+XC[[#This Row],[Cheshunt Ladies Point]]+XC[[#This Row],[Watford Challenge Ladies Points]]+XC[[#This Row],[Gland Ladies Points]]+XC[[#This Row],[Trent Park Ladies Points]])","v":163},304,"60:30",{"$f":"IF(XC[[#This Row],[Royston Time2]]>\" \",(HOUR(XC[[#This Row],[Royston Time2]])*3600)+MINUTE(XC[[#This Row],[Royston Time2]])*60+SECOND(XC[[#This Row],[Royston Time2]]),\"\")","v":3630},{"$f":"IFERROR(IF(FIND(\"M\",XC[[#This Row],[Group]])>0,XC[[#This Row],[Royston Seconds]],\"errorif\"),\"\")","v":""},{"$f":"IFERROR(IF(FIND(\"F\",XC[[#This Row],[Group]])>0,XC[[#This Row],[Royston Seconds]],\"errorif\"),\"\")","v":3630},{"$f":"IF(ISNUMBER(XC[[#This Row],[Royston Mens Time]]),50-(RANK(XC[[#This Row],[Royston Mens Time]],XC[Royston Mens Time],1))+1,0)","v":0},{"$f":"IF(ISNUMBER(XC[[#This Row],[Royston Ladies Times]]),50-(RANK(XC[[#This Row],[Royston Ladies Times]],XC[Royston Ladies Times],1))+1,\"\")","v":40},{"$f":"Hatime(XC[[#This Row],[Royston Time]])","v":"01:00:30"},284,"64:39",{"$f":"IFERROR((HOUR(XC[[#This Row],[Watford Time]])*3600)+MINUTE(XC[[#This Row],[Watford Time]])*60+SECOND(XC[[#This Row],[Watford Time]]),\"\")","v":3879},{"$f":"IFERROR(IF(FIND(\"M\",XC[[#This Row],[Group]])>0,XC[[#This Row],[Watford Seconds]],\"errorif\"),\"\")","v":""},{"$f":"IFERROR(IF(FIND(\"F\",XC[[#This Row],[Group]])>0,XC[[#This Row],[Watford Seconds]],\"errorif\"),\"\")","v":3879},{"$f":"IF(ISNUMBER(XC[[#This Row],[Watford Mens Time]]),50-(RANK(XC[[#This Row],[Watford Mens Time]],XC[Watford Mens Time],1))+1,0)","v":0},{"$f":"IF(ISNUMBER(XC[[#This Row],[Watford  Ladies Time]]),50-(RANK(XC[[#This Row],[Watford  Ladies Time]],XC[Watford  Ladies Time],1))+1,0)","v":42},{"$f":"Hatime(XC[[#This Row],[WTime]])","v":"01:04:39"},null,null," ",{"$f":"IFERROR(IF(FIND(\"M\",XC[[#This Row],[Group]])>0,XC[[#This Row],[Cheshunt Second]],\"errorif\"),\"\")","v":""},{"$f":"IFERROR(IF(FIND(\"F\",XC[[#This Row],[Group]])>0,XC[[#This Row],[Cheshunt Second]],\"errorif\"),\"\")","v":" "},{"$f":"IF(ISNUMBER(XC[[#This Row],[Cheshunt Mens Time]]),50-(RANK(XC[[#This Row],[Cheshunt Mens Time]],XC[Cheshunt Mens Time],1))+1,0)","v":0},{"$f":"IF(ISNUMBER(XC[[#This Row],[Cheshunt ladies Time]]),50-(RANK(XC[[#This Row],[Cheshunt ladies Time]],XC[Cheshunt ladies Time],1))+1,0)","v":0},null,null,null,null,345,null,"00:45:54"," ",{"$f":"(HOUR(XC[[#This Row],[Grovelands Ladies Time]])*3600)+MINUTE(XC[[#This Row],[Grovelands Ladies Time]])*60+SECOND(XC[[#This Row],[Grovelands Ladies Time]])","v":2754},{"$f":"IF(ISNUMBER(XC[[#This Row],[Glands Mens Secs]]),50-(RANK(XC[[#This Row],[Glands Mens Secs]],XC[Glands Mens Secs],1))+1,0)","v":0},{"$f":"IF(ISNUMBER(XC[[#This Row],[Gland Ladies Secs]]),50-(RANK(XC[[#This Row],[Gland Ladies Secs]],XC[Gland Ladies Secs],1))+1,0)","v":42},300,{"$f":"IF(ISNUMBER(XC[[#This Row],[TP Mens Secs]]),50-_xlfn.RANK.EQ(XC[[#This Row],[TP Mens Secs]],XC[TP Mens Secs],1)+1,0)","v":0},{"$f":"IF(ISNUMBER(XC[[#This Row],[TP Ladies Secs]]),50-_xlfn.RANK.EQ(XC[[#This Row],[TP Ladies Secs]],XC[TP Ladies Secs],1)+1,0)","v":39},"","00:43:34","",2614]
[null,"Laura","Nathan",{"$f":"TRIM(XC[[#This Row],[N1]])&\" \"&TRIM(XC[[#This Row],[N2]])","v":"Laura Nathan"},null,{"$f":"VLOOKUP(XC[[#This Row],[Name]],members,2,0)","v":13},"W",{"$f":"VLOOKUP(XC[[#This Row],[Mem]],Allmembers[],7,FALSE)","v":"FV35"},{"$f":"COUNT(XC[[#This Row],[Royston Race Position]],XC[[#This Row],[Watford Race Position]],XC[[#This Row],[Cheshut place]],XC[[#This Row],[Watford Challenge Place]],XC[[#This Row],[Grovelands place]],XC[[#This Row],[Trent Park Pos]])","v":1},{"$f":"IF(XC[[#This Row],[Gender]]=\"M\",XC[[#This Row],[Royston Mens Points]]+XC[[#This Row],[Watford Mens Points]]+XC[[#This Row],[Cheshunt Mens Points]]+XC[[#This Row],[Watford Challenge Mens Points]]+XC[[#This Row],[Gland Mens Points]]+XC[[#This Row],[Trent Park Mens Points]],XC[[#This Row],[Royston Ladies Points]]+XC[[#This Row],[Waftord Ladies Points]]+XC[[#This Row],[Cheshunt Ladies Point]]+XC[[#This Row],[Watford Challenge Ladies Points]]+XC[[#This Row],[Gland Ladies Points]]+XC[[#This Row],[Trent Park Ladies Points]])","v":45},null," ",{"$f":"IF(XC[[#This Row],[Royston Time2]]>\" \",(HOUR(XC[[#This Row],[Royston Time2]])*3600)+MINUTE(XC[[#This Row],[Royston Time2]])*60+SECOND(XC[[#This Row],[Royston Time2]]),\"\")","v":""},null,{"$f":"IFERROR(IF(FIND(\"F\",XC[[#This Row],[Group]])>0,XC[[#This Row],[Royston Seconds]],\"errorif\"),\"\")","v":""},{"$f":"IF(ISNUMBER(XC[[#This Row],[Royston Mens Time]]),50-(RANK(XC[[#This Row],[Royston Mens Time]],XC[Royston Mens Time],1))+1,0)","v":0},{"$f":"IF(ISNUMBER(XC[[#This Row],[Royston Ladies Times]]),50-(RANK(XC[[#This Row],[Royston Ladies Times]],XC[Royston Ladies Times],1))+1,0)","v":0}," ",247,"56:59",{"$f":"IFERROR((HOUR(XC[[#This Row],[Watford Time]])*3600)+MINUTE(XC[[#This Row],[Watford Time]])*60+SECOND(XC[[#This Row],[Watford Time]]),\"\")","v":3419},{"$f":"IFERROR(IF(FIND(\"M\",XC[[#This Row],[Group]])>0,XC[[#This Row],[Watford Seconds]],\"errorif\"),\"\")","v":""},{"$f":"IFERROR(IF(FIND(\"F\",XC[[#This Row],[Group]])>0,XC[[#This Row],[Watford Seconds]],\"errorif\"),\"\")","v":3419},{"$f":"IF(ISNUMBER(XC[[#This Row],[Watford Mens Time]]),50-(RANK(XC[[#This Row],[Watford Mens Time]],XC[Watford Mens Time],1))+1,0)","v":0},{"$f":"IF(ISNUMBER(XC[[#This Row],[Watford  Ladies Time]]),50-(RANK(XC[[#This Row],[Watford  Ladies Time]],XC[Watford  Ladies Time],1))+1,0)","v":45},{"$f":"Hatime(XC[[#This Row],[WTime]])","v":"00:56:59"},null,null,null,{"$f":"IFERROR(IF(FIND(\"M\",XC[[#This Row],[Group]])>0,XC[[#This Row],[Cheshunt Second]],\"errorif\"),\"\")","v":""}," ",{"$f":"IF(ISNUMBER(XC[[#This Row],[Cheshunt Mens Time]]),50-(RANK(XC[[#This Row],[Cheshunt Mens Time]],XC[Cheshunt Mens Time],1))+1,0)","v":0},{"$f":"IF(ISNUMBER(XC[[#This Row],[Cheshunt ladies Time]]),50-(RANK(XC[[#This Row],[Cheshunt ladies Time]],XC[Cheshunt ladies Time],1))+1,0)","v":0},null,null,null,null,null,null,null," "," ",{"$f":"IF(ISNUMBER(XC[[#This Row],[Glands Mens Secs]]),50-(RANK(XC[[#This Row],[Glands Mens Secs]],XC[Glands Mens Secs],1))+1,0)","v":0},{"$f":"IF(ISNUMBER(XC[[#This Row],[Gland Ladies Secs]]),50-(RANK(XC[[#This Row],[Gland Ladies Secs]],XC[Gland Ladies Secs],1))+1,0)","v":0},"  ",{"$f":"IF(ISNUMBER(XC[[#This Row],[TP Mens Secs]]),50-_xlfn.RANK.EQ(XC[[#This Row],[TP Mens Secs]],XC[TP Mens Secs],1)+1,0)","v":0},{"$f":"IF(ISNUMBER(XC[[#This Row],[TP Ladies Secs]]),50-_xlfn.RANK.EQ(XC[[#This Row],[TP Ladies Secs]],XC[TP Ladies Secs],1)+1,0)","v":0}]
[null,"Darren","McGrath",{"$f":"TRIM(XC[[#This Row],[N1]])&\" \"&TRIM(XC[[#This Row],[N2]])","v":"Darren McGrath"},1,{"$f":"VLOOKUP(XC[[#This Row],[Name]],members,2,0)","v":28},"M",{"$f":"VLOOKUP(XC[[#This Row],[Mem]],Allmembers[],7,FALSE)","v":"MV40"},{"$f":"COUNT(XC[[#This Row],[Royston Race Position]],XC[[#This Row],[Watford Race Position]],XC[[#This Row],[Cheshut place]],XC[[#This Row],[Watford Challenge Place]],XC[[#This Row],[Grovelands place]],XC[[#This Row],[Trent Park Pos]])","v":4},{"$f":"IF(XC[[#This Row],[Gender]]=\"M\",XC[[#This Row],[Royston Mens Points]]+XC[[#This Row],[Watford Mens Points]]+XC[[#This Row],[Cheshunt Mens Points]]+XC[[#This Row],[Watford Challenge Mens Points]]+XC[[#This Row],[Gland Mens Points]]+XC[[#This Row],[Trent Park Mens Points]],XC[[#This Row],[Royston Ladies Points]]+XC[[#This Row],[Waftord Ladies Points]]+XC[[#This Row],[Cheshunt Ladies Point]]+XC[[#This Row],[Watford Challenge Ladies Points]]+XC[[#This Row],[Gland Ladies Points]]+XC[[#This Row],[Trent Park Ladies Points]])","v":177},null," ",{"$f":"IF(XC[[#This Row],[Royston Time2]]>\" \",(HOUR(XC[[#This Row],[Royston Time2]])*3600)+MINUTE(XC[[#This Row],[Royston Time2]])*60+SECOND(XC[[#This Row],[Royston Time2]]),\"\")","v":""},null,{"$f":"IFERROR(IF(FIND(\"F\",XC[[#This Row],[Group]])>0,XC[[#This Row],[Royston Seconds]],\"errorif\"),\"\")","v":""},{"$f":"IF(ISNUMBER(XC[[#This Row],[Royston Mens Time]]),50-(RANK(XC[[#This Row],[Royston Mens Time]],XC[Royston Mens Time],1))+1,0)","v":0},{"$f":"IF(ISNUMBER(XC[[#This Row],[Royston Ladies Times]]),50-(RANK(XC[[#This Row],[Royston Ladies Times]],XC[Royston Ladies Times],1))+1,0)","v":0}," ",90,"44:14",{"$f":"IFERROR((HOUR(XC[[#This Row],[Watford Time]])*3600)+MINUTE(XC[[#This Row],[Watford Time]])*60+SECOND(XC[[#This Row],[Watford Time]]),\"\")","v":2654},{"$f":"IFERROR(IF(FIND(\"M\",XC[[#This Row],[Group]])>0,XC[[#This Row],[Watford Seconds]],\"errorif\"),\"\")","v":2654},{"$f":"IFERROR(IF(FIND(\"F\",XC[[#This Row],[Group]])>0,XC[[#This Row],[Watford Seconds]],\"errorif\"),\"\")","v":""},{"$f":"IF(ISNUMBER(XC[[#This Row],[Watford Mens Time]]),50-(RANK(XC[[#This Row],[Watford Mens Time]],XC[Watford Mens Time],1))+1,0)","v":44},{"$f":"IF(ISNUMBER(XC[[#This Row],[Watford  Ladies Time]]),50-(RANK(XC[[#This Row],[Watford  Ladies Time]],XC[Watford  Ladies Time],1))+1,0)","v":0},{"$f":"Hatime(XC[[#This Row],[WTime]])","v":"00:44:14"},"00:33:22",49,{"$f":"(HOUR(XC[[#This Row],[Cheshunt  wtime]])*3600)+MINUTE(XC[[#This Row],[Cheshunt  wtime]])*60+SECOND(XC[[#This Row],[Cheshunt  wtime]])","v":2002},{"$f":"IFERROR(IF(FIND(\"M\",XC[[#This Row],[Group]])>0,XC[[#This Row],[Cheshunt Second]],\"errorif\"),\"\")","v":2002},{"$f":"IFERROR(IF(FIND(\"F\",XC[[#This Row],[Group]])>0,XC[[#This Row],[Cheshunt Second]],\"errorif\"),\"\")","v":""},{"$f":"IF(ISNUMBER(XC[[#This Row],[Cheshunt Mens Time]]),50-(RANK(XC[[#This Row],[Cheshunt Mens Time]],XC[Cheshunt Mens Time],1))+1,0)","v":45},{"$f":"IF(ISNUMBER(XC[[#This Row],[Cheshunt ladies Time]]),50-(RANK(XC[[#This Row],[Cheshunt ladies Time]],XC[Cheshunt ladies Time],1))+1,0)","v":0},null,null,null,null,66,"00:32:08",null,{"$f":"(HOUR(XC[[#This Row],[Grovelands Mens Time]])*3600)+MINUTE(XC[[#This Row],[Grovelands Mens Time]])*60+SECOND(XC[[#This Row],[Grovelands Mens Time]])","v":1928}," ",{"$f":"IF(ISNUMBER(XC[[#This Row],[Glands Mens Secs]]),50-(RANK(XC[[#This Row],[Glands Mens Secs]],XC[Glands Mens Secs],1))+1,0)","v":44},{"$f":"IF(ISNUMBER(XC[[#This Row],[Gland Ladies Secs]]),50-(RANK(XC[[#This Row],[Gland Ladies Secs]],XC[Gland Ladies Secs],1))+1,0)","v":0},41,{"$f":"IF(ISNUMBER(XC[[#This Row],[TP Mens Secs]]),50-_xlfn.RANK.EQ(XC[[#This Row],[TP Mens Secs]],XC[TP Mens Secs],1)+1,0)","v":44},{"$f":"IF(ISNUMBER(XC[[#This Row],[TP Ladies Secs]]),50-_xlfn.RANK.EQ(XC[[#This Row],[TP Ladies Secs]],XC[TP Ladies Secs],1)+1,0)","v":0},"00:31:59","",1919,""]
[null,"Michael","Hessey",{"$f":"TRIM(XC[[#This Row],[N1]])&\" \"&TRIM(XC[[#This Row],[N2]])","v":"Michael Hessey"},null,{"$f":"VLOOKUP(XC[[#This Row],[Name]],members,2,0)","v":32},"M",{"$f":"VLOOKUP(XC[[#This Row],[Mem]],Allmembers[],7,FALSE)","v":"MV40"},{"$f":"COUNT(XC[[#This Row],[Royston Race Position]],XC[[#This Row],[Watford Race Position]],XC[[#This Row],[Cheshut place]],XC[[#This Row],[Watford Challenge Place]],XC[[#This Row],[Grovelands place]],XC[[#This Row],[Trent Park Pos]])","v":1},{"$f":"IF(XC[[#This Row],[Gender]]=\"M\",XC[[#This Row],[Royston Mens Points]]+XC[[#This Row],[Watford Mens Points]]+XC[[#This Row],[Cheshunt Mens Points]]+XC[[#This Row],[Watford Challenge Mens Points]]+XC[[#This Row],[Gland Mens Points]]+XC[[#This Row],[Trent Park Mens Points]],XC[[#This Row],[Royston Ladies Points]]+XC[[#This Row],[Waftord Ladies Points]]+XC[[#This Row],[Cheshunt Ladies Point]]+XC[[#This Row],[Watford Challenge Ladies Points]]+XC[[#This Row],[Gland Ladies Points]]+XC[[#This Row],[Trent Park Ladies Points]])","v":32},null," ",{"$f":"IF(XC[[#This Row],[Royston Time2]]>\" \",(HOUR(XC[[#This Row],[Royston Time2]])*3600)+MINUTE(XC[[#This Row],[Royston Time2]])*60+SECOND(XC[[#This Row],[Royston Time2]]),\"\")","v":""},{"$f":"IFERROR(IF(FIND(\"M\",XC[[#This Row],[Group]])>0,XC[[#This Row],[Royston Seconds]],\"errorif\"),\"\")","v":""},{"$f":"IFERROR(IF(FIND(\"F\",XC[[#This Row],[Group]])>0,XC[[#This Row],[Royston Seconds]],\"errorif\"),\"\")","v":""},0,{"$f":"IF(ISNUMBER(XC[[#This Row],[Royston Ladies Times]]),50-(RANK(XC[[#This Row],[Royston Ladies Times]],XC[Royston Ladies Times],1))+1,0)","v":0}," ",null,null,{"$f":"IFERROR((HOUR(XC[[#This Row],[Watford Time]])*3600)+MINUTE(XC[[#This Row],[Watford Time]])*60+SECOND(XC[[#This Row],[Watford Time]]),\"\")","v":""},{"$f":"IFERROR(IF(FIND(\"M\",XC[[#This Row],[Group]])>0,XC[[#This Row],[Watford Seconds]],\"errorif\"),\"\")","v":""},{"$f":"IFERROR(IF(FIND(\"F\",XC[[#This Row],[Group]])>0,XC[[#This Row],[Watford Seconds]],\"errorif\"),\"\")","v":""},{"$f":"IF(ISNUMBER(XC[[#This Row],[Watford Mens Time]]),50-(RANK(XC[[#This Row],[Watford Mens Time]],XC[Watford Mens Time],1))+1,0)","v":0},null,{"$f":"Hatime(XC[[#This Row],[WTime]])","v":""},"00:38:30",168,{"$f":"(HOUR(XC[[#This Row],[Cheshunt  wtime]])*3600)+MINUTE(XC[[#This Row],[Cheshunt  wtime]])*60+SECOND(XC[[#This Row],[Cheshunt  wtime]])","v":2310},{"$f":"IFERROR(IF(FIND(\"M\",XC[[#This Row],[Group]])>0,XC[[#This Row],[Cheshunt Second]],\"errorif\"),\"\")","v":2310},{"$f":"IFERROR(IF(FIND(\"F\",XC[[#This Row],[Group]])>0,XC[[#This Row],[Cheshunt Second]],\"errorif\"),\"\")","v":""},{"$f":"IF(ISNUMBER(XC[[#This Row],[Cheshunt Mens Time]]),50-(RANK(XC[[#This Row],[Cheshunt Mens Time]],XC[Cheshunt Mens Time],1))+1,0)","v":32},{"$f":"IF(ISNUMBER(XC[[#This Row],[Cheshunt ladies Time]]),50-(RANK(XC[[#This Row],[Cheshunt ladies Time]],XC[Cheshunt ladies Time],1))+1,0)","v":0},null,null,null,null,null,null,null," "," ",{"$f":"IF(ISNUMBER(XC[[#This Row],[Glands Mens Secs]]),50-(RANK(XC[[#This Row],[Glands Mens Secs]],XC[Glands Mens Secs],1))+1,0)","v":0},{"$f":"IF(ISNUMBER(XC[[#This Row],[Gland Ladies Secs]]),50-(RANK(XC[[#This Row],[Gland Ladies Secs]],XC[Gland Ladies Secs],1))+1,0)","v":0},"  ",{"$f":"IF(ISNUMBER(XC[[#This Row],[TP Mens Secs]]),50-_xlfn.RANK.EQ(XC[[#This Row],[TP Mens Secs]],XC[TP Mens Secs],1)+1,0)","v":0},{"$f":"IF(ISNUMBER(XC[[#This Row],[TP Ladies Secs]]),50-_xlfn.RANK.EQ(XC[[#This Row],[TP Ladies Secs]],XC[TP Ladies Secs],1)+1,0)","v":0}]
[null,"Graham","Harper",{"$f":"TRIM(XC[[#This Row],[N1]])&\" \"&TRIM(XC[[#This Row],[N2]])","v":"Graham Harper"},1,{"$f":"VLOOKUP(XC[[#This Row],[Name]],members,2,0)","v":39},"M",{"$f":"VLOOKUP(XC[[#This Row],[Mem]],Allmembers[],7,FALSE)","v":"MV50"},{"$f":"COUNT(XC[[#This Row],[Royston Race Position]],XC[[#This Row],[Watford Race Position]],XC[[#This Row],[Cheshut place]],XC[[#This Row],[Watford Challenge Place]],XC[[#This Row],[Grovelands place]],XC[[#This Row],[Trent Park Pos]])","v":4},{"$f":"IF(XC[[#This Row],[Gender]]=\"M\",XC[[#This Row],[Royston Mens Points]]+XC[[#This Row],[Watford Mens Points]]+XC[[#This Row],[Cheshunt Mens Points]]+XC[[#This Row],[Watford Challenge Mens Points]]+XC[[#This Row],[Gland Mens Points]]+XC[[#This Row],[Trent Park Mens Points]],XC[[#This Row],[Royston Ladies Points]]+XC[[#This Row],[Waftord Ladies Points]]+XC[[#This Row],[Cheshunt Ladies Point]]+XC[[#This Row],[Watford Challenge Ladies Points]]+XC[[#This Row],[Gland Ladies Points]]+XC[[#This Row],[Trent Park Ladies Points]])","v":127},null," ",{"$f":"IF(XC[[#This Row],[Royston Time2]]>\" \",(HOUR(XC[[#This Row],[Royston Time2]])*3600)+MINUTE(XC[[#This Row],[Royston Time2]])*60+SECOND(XC[[#This Row],[Royston Time2]]),\"\")","v":""},{"$f":"IFERROR(IF(FIND(\"M\",XC[[#This Row],[Group]])>0,XC[[#This Row],[Royston Seconds]],\"errorif\"),\"\")","v":""},{"$f":"IFERROR(IF(FIND(\"F\",XC[[#This Row],[Group]])>0,XC[[#This Row],[Royston Seconds]],\"errorif\"),\"\")","v":""},{"$f":"IF(ISNUMBER(XC[[#This Row],[Royston Mens Time]]),50-(RANK(XC[[#This Row],[Royston Mens Time]],XC[Royston Mens Time],1))+1,0)","v":0},{"$f":"IF(ISNUMBER(XC[[#This Row],[Royston Ladies Times]]),50-(RANK(XC[[#This Row],[Royston Ladies Times]],XC[Royston Ladies Times],1))+1,0)","v":0}," ",227,"54:58",{"$f":"IFERROR((HOUR(XC[[#This Row],[Watford Time]])*3600)+MINUTE(XC[[#This Row],[Watford Time]])*60+SECOND(XC[[#This Row],[Watford Time]]),\"\")","v":3298},{"$f":"IFERROR(IF(FIND(\"M\",XC[[#This Row],[Group]])>0,XC[[#This Row],[Watford Seconds]],\"errorif\"),\"\")","v":3298},{"$f":"IFERROR(IF(FIND(\"F\",XC[[#This Row],[Group]])>0,XC[[#This Row],[Watford Seconds]],\"errorif\"),\"\")","v":""},{"$f":"IF(ISNUMBER(XC[[#This Row],[Watford Mens Time]]),50-(RANK(XC[[#This Row],[Watford Mens Time]],XC[Watford Mens Time],1))+1,0)","v":34},{"$f":"IF(ISNUMBER(XC[[#This Row],[Watford  Ladies Time]]),50-(RANK(XC[[#This Row],[Watford  Ladies Time]],XC[Watford  Ladies Time],1))+1,0)","v":0},{"$f":"Hatime(XC[[#This Row],[WTime]])","v":"00:54:58"},"00:40:34",212,{"$f":"(HOUR(XC[[#This Row],[Cheshunt  wtime]])*3600)+MINUTE(XC[[#This Row],[Cheshunt  wtime]])*60+SECOND(XC[[#This Row],[Cheshunt  wtime]])","v":2434},{"$f":"IFERROR(IF(FIND(\"M\",XC[[#This Row],[Group]])>0,XC[[#This Row],[Cheshunt Second]],\"errorif\"),\"\")","v":2434},{"$f":"IFERROR(IF(FIND(\"F\",XC[[#This Row],[Group]])>0,XC[[#This Row],[Cheshunt Second]],\"errorif\"),\"\")","v":""},{"$f":"IF(ISNUMBER(XC[[#This Row],[Cheshunt Mens Time]]),50-(RANK(XC[[#This Row],[Cheshunt Mens Time]],XC[Cheshunt Mens Time],1))+1,0)","v":28},{"$f":"IF(ISNUMBER(XC[[#This Row],[Cheshunt ladies Time]]),50-(RANK(XC[[#This Row],[Cheshunt ladies Time]],XC[Cheshunt ladies Time],1))+1,0)","v":0},null,null,null,null,241,"00:39:33",null,{"$f":"(HOUR(XC[[#This Row],[Grovelands Mens Time]])*3600)+MINUTE(XC[[#This Row],[Grovelands Mens Time]])*60+SECOND(XC[[#This Row],[Grovelands Mens Time]])","v":2373}," ",{"$f":"IF(ISNUMBER(XC[[#This Row],[Glands Mens Secs]]),50-(RANK(XC[[#This Row],[Glands Mens Secs]],XC[Glands Mens Secs],1))+1,0)","v":30},{"$f":"IF(ISNUMBER(XC[[#This Row],[Gland Ladies Secs]]),50-(RANK(XC[[#This Row],[Gland Ladies Secs]],XC[Gland Ladies Secs],1))+1,0)","v":0},204,{"$f":"IF(ISNUMBER(XC[[#This Row],[TP Mens Secs]]),50-_xlfn.RANK.EQ(XC[[#This Row],[TP Mens Secs]],XC[TP Mens Secs],1)+1,0)","v":35},{"$f":"IF(ISNUMBER(XC[[#This Row],[TP Ladies Secs]]),50-_xlfn.RANK.EQ(XC[[#This Row],[TP Ladies Secs]],XC[TP Ladies Secs],1)+1,0)","v":0},"00:39:45","",2385,""]
[null,"Jillian","Russell","Jillian Russell",1,{"$f":"VLOOKUP(XC[[#This Row],[Name]],members,2,0)","v":44},"W",{"$f":"VLOOKUP(XC[[#This Row],[Mem]],Allmembers[],7,FALSE)","v":"FV45"},{"$f":"COUNT(XC[[#This Row],[Royston Race Position]],XC[[#This Row],[Watford Race Position]],XC[[#This Row],[Cheshut place]],XC[[#This Row],[Watford Challenge Place]],XC[[#This Row],[Grovelands place]],XC[[#This Row],[Trent Park Pos]])","v":1},{"$f":"IF(XC[[#This Row],[Gender]]=\"M\",XC[[#This Row],[Royston Mens Points]]+XC[[#This Row],[Watford Mens Points]]+XC[[#This Row],[Cheshunt Mens Points]]+XC[[#This Row],[Watford Challenge Mens Points]]+XC[[#This Row],[Gland Mens Points]]+XC[[#This Row],[Trent Park Mens Points]],XC[[#This Row],[Royston Ladies Points]]+XC[[#This Row],[Waftord Ladies Points]]+XC[[#This Row],[Cheshunt Ladies Point]]+XC[[#This Row],[Watford Challenge Ladies Points]]+XC[[#This Row],[Gland Ladies Points]]+XC[[#This Row],[Trent Park Ladies Points]])","v":44},null,"  ",{"$f":"IF(XC[[#This Row],[Royston Time2]]>\" \",(HOUR(XC[[#This Row],[Royston Time2]])*3600)+MINUTE(XC[[#This Row],[Royston Time2]])*60+SECOND(XC[[#This Row],[Royston Time2]]),\"\")","v":""},{"$f":"IFERROR(IF(FIND(\"M\",XC[[#This Row],[Group]])>0,XC[[#This Row],[Royston Seconds]],\"errorif\"),\"\")","v":""},{"$f":"IFERROR(IF(FIND(\"F\",XC[[#This Row],[Group]])>0,XC[[#This Row],[Royston Seconds]],\"errorif\"),\"\")","v":""},{"$f":"IF(ISNUMBER(XC[[#This Row],[Royston Mens Time]]),50-(RANK(XC[[#This Row],[Royston Mens Time]],XC[Royston Mens Time],1))+1,0)","v":0},{"$f":"IF(ISNUMBER(XC[[#This Row],[Royston Ladies Times]]),50-(RANK(XC[[#This Row],[Royston Ladies Times]],XC[Royston Ladies Times],1))+1,0)","v":0}," ",null,null,{"$f":"IFERROR((HOUR(XC[[#This Row],[Watford Time]])*3600)+MINUTE(XC[[#This Row],[Watford Time]])*60+SECOND(XC[[#This Row],[Watford Time]]),\"\")","v":""},{"$f":"IFERROR(IF(FIND(\"M\",XC[[#This Row],[Group]])>0,XC[[#This Row],[Watford Seconds]],\"errorif\"),\"\")","v":""},{"$f":"IFERROR(IF(FIND(\"F\",XC[[#This Row],[Group]])>0,XC[[#This Row],[Watford Seconds]],\"errorif\"),\"\")","v":""},{"$f":"IF(ISNUMBER(XC[[#This Row],[Watford Mens Time]]),50-(RANK(XC[[#This Row],[Watford Mens Time]],XC[Watford Mens Time],1))+1,0)","v":0},null,{"$f":"Hatime(XC[[#This Row],[WTime]])","v":""},null,null," ",{"$f":"IFERROR(IF(FIND(\"M\",XC[[#This Row],[Group]])>0,XC[[#This Row],[Cheshunt Second]],\"errorif\"),\"\")","v":""},{"$f":"IFERROR(IF(FIND(\"F\",XC[[#This Row],[Group]])>0,XC[[#This Row],[Cheshunt Second]],\"errorif\"),\"\")","v":" "},{"$f":"IF(ISNUMBER(XC[[#This Row],[Cheshunt Mens Time]]),50-(RANK(XC[[#This Row],[Cheshunt Mens Time]],XC[Cheshunt Mens Time],1))+1,0)","v":0},{"$f":"IF(ISNUMBER(XC[[#This Row],[Cheshunt ladies Time]]),50-(RANK(XC[[#This Row],[Cheshunt ladies Time]],XC[Cheshunt ladies Time],1))+1,0)","v":0},null,null,null,null,322,null,"00:44:02"," ",{"$f":"(HOUR(XC[[#This Row],[Grovelands Ladies Time]])*3600)+MINUTE(XC[[#This Row],[Grovelands Ladies Time]])*60+SECOND(XC[[#This Row],[Grovelands Ladies Time]])","v":2642},{"$f":"IF(ISNUMBER(XC[[#This Row],[Glands Mens Secs]]),50-(RANK(XC[[#This Row],[Glands Mens Secs]],XC[Glands Mens Secs],1))+1,0)","v":0},{"$f":"IF(ISNUMBER(XC[[#This Row],[Gland Ladies Secs]]),50-(RANK(XC[[#This Row],[Gland Ladies Secs]],XC[Gland Ladies Secs],1))+1,0)","v":44},"  ",{"$f":"IF(ISNUMBER(XC[[#This Row],[TP Mens Secs]]),50-_xlfn.RANK.EQ(XC[[#This Row],[TP Mens Secs]],XC[TP Mens Secs],1)+1,0)","v":0},{"$f":"IF(ISNUMBER(XC[[#This Row],[TP Ladies Secs]]),50-_xlfn.RANK.EQ(XC[[#This Row],[TP Ladies Secs]],XC[TP Ladies Secs],1)+1,0)","v":0}]
[null,"Simon","Speirs",{"$f":"TRIM(XC[[#This Row],[N1]])&\" \"&TRIM(XC[[#This Row],[N2]])","v":"Simon Speirs"},1,{"$f":"VLOOKUP(XC[[#This Row],[Name]],members,2,0)","v":53},"M",{"$f":"VLOOKUP(XC[[#This Row],[Mem]],Allmembers[],7,FALSE)","v":"MV40"},{"$f":"COUNT(XC[[#This Row],[Royston Race Position]],XC[[#This Row],[Watford Race Position]],XC[[#This Row],[Cheshut place]],XC[[#This Row],[Watford Challenge Place]],XC[[#This Row],[Grovelands place]],XC[[#This Row],[Trent Park Pos]])","v":5},{"$f":"IF(XC[[#This Row],[Gender]]=\"M\",XC[[#This Row],[Royston Mens Points]]+XC[[#This Row],[Watford Mens Points]]+XC[[#This Row],[Cheshunt Mens Points]]+XC[[#This Row],[Watford Challenge Mens Points]]+XC[[#This Row],[Gland Mens Points]]+XC[[#This Row],[Trent Park Mens Points]],XC[[#This Row],[Royston Ladies Points]]+XC[[#This Row],[Waftord Ladies Points]]+XC[[#This Row],[Cheshunt Ladies Point]]+XC[[#This Row],[Watford Challenge Ladies Points]]+XC[[#This Row],[Gland Ladies Points]]+XC[[#This Row],[Trent Park Ladies Points]])","v":249},10,"34:04",{"$f":"IF(XC[[#This Row],[Royston Time2]]>\" \",(HOUR(XC[[#This Row],[Royston Time2]])*3600)+MINUTE(XC[[#This Row],[Royston Time2]])*60+SECOND(XC[[#This Row],[Royston Time2]]),\"\")","v":2044},{"$f":"IFERROR(IF(FIND(\"M\",XC[[#This Row],[Group]])>0,XC[[#This Row],[Royston Seconds]],\"errorif\"),\"\")","v":2044},{"$f":"IFERROR(IF(FIND(\"F\",XC[[#This Row],[Group]])>0,XC[[#This Row],[Royston Seconds]],\"errorif\"),\"\")","v":""},{"$f":"IF(ISNUMBER(XC[[#This Row],[Royston Mens Time]]),50-(RANK(XC[[#This Row],[Royston Mens Time]],XC[Royston Mens Time],1))+1,0)","v":50},{"$f":"IF(ISNUMBER(XC[[#This Row],[Royston Ladies Times]]),50-(RANK(XC[[#This Row],[Royston Ladies Times]],XC[Royston Ladies Times],1))+1,0)","v":0},{"$f":"Hatime(XC[[#This Row],[Royston Time]])","v":"00:34:04"},null,null,{"$f":"IFERROR((HOUR(XC[[#This Row],[Watford Time]])*3600)+MINUTE(XC[[#This Row],[Watford Time]])*60+SECOND(XC[[#This Row],[Watford Time]]),\"\")","v":""},{"$f":"IFERROR(IF(FIND(\"M\",XC[[#This Row],[Group]])>0,XC[[#This Row],[Watford Seconds]],\"errorif\"),\"\")","v":""},{"$f":"IFERROR(IF(FIND(\"F\",XC[[#This Row],[Group]])>0,XC[[#This Row],[Watford Seconds]],\"errorif\"),\"\")","v":""},{"$f":"IF(ISNUMBER(XC[[#This Row],[Watford Mens Time]]),50-(RANK(XC[[#This Row],[Watford Mens Time]],XC[Watford Mens Time],1))+1,0)","v":0},{"$f":"IF(ISNUMBER(XC[[#This Row],[Watford  Ladies Time]]),50-(RANK(XC[[#This Row],[Watford  Ladies Time]],XC[Watford  Ladies Time],1))+1,0)","v":0},{"$f":"Hatime(XC[[#This Row],[WTime]])","v":""},"00:31:28",24,{"$f":"(HOUR(XC[[#This Row],[Cheshunt  wtime]])*3600)+MINUTE(XC[[#This Row],[Cheshunt  wtime]])*60+SECOND(XC[[#This Row],[Cheshunt  wtime]])","v":1888},{"$f":"IFERROR(IF(FIND(\"M\",XC[[#This Row],[Group]])>0,XC[[#This Row],[Cheshunt Second]],\"errorif\"),\"\")","v":1888},{"$f":"IFERROR(IF(FIND(\"F\",XC[[#This Row],[Group]])>0,XC[[#This Row],[Cheshunt Second]],\"errorif\"),\"\")","v":""},{"$f":"IF(ISNUMBER(XC[[#This Row],[Cheshunt Mens Time]]),50-(RANK(XC[[#This Row],[Cheshunt Mens Time]],XC[Cheshunt Mens Time],1))+1,0)","v":50},{"$f":"IF(ISNUMBER(XC[[#This Row],[Cheshunt ladies Time]]),50-(RANK(XC[[#This Row],[Cheshunt ladies Time]],XC[Cheshunt ladies Time],1))+1,0)","v":0},6,50,null,2.1828703703703701E-2,26,"00:30:10",null,{"$f":"(HOUR(XC[[#This Row],[Grovelands Mens Time]])*3600)+MINUTE(XC[[#This Row],[Grovelands Mens Time]])*60+SECOND(XC[[#This Row],[Grovelands Mens Time]])","v":1810}," ",{"$f":"IF(ISNUMBER(XC[[#This Row],[Glands Mens Secs]]),50-(RANK(XC[[#This Row],[Glands Mens Secs]],XC[Glands Mens Secs],1))+1,0)","v":50},{"$f":"IF(ISNUMBER(XC[[#This Row],[Gland Ladies Secs]]),50-(RANK(XC[[#This Row],[Gland Ladies Secs]],XC[Gland Ladies Secs],1))+1,0)","v":0},21,{"$f":"IF(ISNUMBER(XC[[#This Row],[TP Mens Secs]]),50-_xlfn.RANK.EQ(XC[[#This Row],[TP Mens Secs]],XC[TP Mens Secs],1)+1,0)","v":49},{"$f":"IF(ISNUMBER(XC[[#This Row],[TP Ladies Secs]]),50-_xlfn.RANK.EQ(XC[[#This Row],[TP Ladies Secs]],XC[TP Ladies Secs],1)+1,0)","v":0},"00:30:35","",1835,""]
[null,"Hannah","Turner",{"$f":"TRIM(XC[[#This Row],[N1]])&\" \"&TRIM(XC[[#This Row],[N2]])","v":"Hannah Turner"},1,{"$f":"VLOOKUP(XC[[#This Row],[Name]],members,2,0)","v":54},"W",{"$f":"VLOOKUP(XC[[#This Row],[Mem]],Allmembers[],7,FALSE)","v":"FV35"},{"$f":"COUNT(XC[[#This Row],[Royston Race Position]],XC[[#This Row],[Watford Race Position]],XC[[#This Row],[Cheshut place]],XC[[#This Row],[Watford Challenge Place]],XC[[#This Row],[Grovelands place]],XC[[#This Row],[Trent Park Pos]])","v":5},{"$f":"IF(XC[[#This Row],[Gender]]=\"M\",XC[[#This Row],[Royston Mens Points]]+XC[[#This Row],[Watford Mens Points]]+XC[[#This Row],[Cheshunt Mens Points]]+XC[[#This Row],[Watford Challenge Mens Points]]+XC[[#This Row],[Gland Mens Points]]+XC[[#This Row],[Trent Park Mens Points]],XC[[#This Row],[Royston Ladies Points]]+XC[[#This Row],[Waftord Ladies Points]]+XC[[#This Row],[Cheshunt Ladies Point]]+XC[[#This Row],[Watford Challenge Ladies Points]]+XC[[#This Row],[Gland Ladies Points]]+XC[[#This Row],[Trent Park Ladies Points]])","v":249},70,"40:27",{"$f":"IF(XC[[#This Row],[Royston Time2]]>\" \",(HOUR(XC[[#This Row],[Royston Time2]])*3600)+MINUTE(XC[[#This Row],[Royston Time2]])*60+SECOND(XC[[#This Row],[Royston Time2]]),\"\")","v":2427},{"$f":"IFERROR(IF(FIND(\"M\",XC[[#This Row],[Group]])>0,XC[[#This Row],[Royston Seconds]],\"errorif\"),\"\")","v":""},{"$f":"IFERROR(IF(FIND(\"F\",XC[[#This Row],[Group]])>0,XC[[#This Row],[Royston Seconds]],\"errorif\"),\"\")","v":2427},{"$f":"IF(ISNUMBER(XC[[#This Row],[Royston Mens Time]]),50-(RANK(XC[[#This Row],[Royston Mens Time]],XC[Royston Mens Time],1))+1,0)","v":0},{"$f":"IF(ISNUMBER(XC[[#This Row],[Royston Ladies Times]]),50-(RANK(XC[[#This Row],[Royston Ladies Times]],XC[Royston Ladies Times],1))+1,\"\")","v":49},{"$f":"Hatime(XC[[#This Row],[Royston Time]])","v":"00:40:27"},69,"42:58",{"$f":"IFERROR((HOUR(XC[[#This Row],[Watford Time]])*3600)+MINUTE(XC[[#This Row],[Watford Time]])*60+SECOND(XC[[#This Row],[Watford Time]]),\"\")","v":2578},{"$f":"IFERROR(IF(FIND(\"M\",XC[[#This Row],[Group]])>0,XC[[#This Row],[Watford Seconds]],\"errorif\"),\"\")","v":""},{"$f":"IFERROR(IF(FIND(\"F\",XC[[#This Row],[Group]])>0,XC[[#This Row],[Watford Seconds]],\"errorif\"),\"\")","v":2578},{"$f":"IF(ISNUMBER(XC[[#This Row],[Watford Mens Time]]),50-(RANK(XC[[#This Row],[Watford Mens Time]],XC[Watford Mens Time],1))+1,0)","v":0},{"$f":"IF(ISNUMBER(XC[[#This Row],[Watford  Ladies Time]]),50-(RANK(XC[[#This Row],[Watford  Ladies Time]],XC[Watford  Ladies Time],1))+1,0)","v":50},{"$f":"Hatime(XC[[#This Row],[WTime]])","v":"00:42:58"},"00:35:14",95,{"$f":"(HOUR(XC[[#This Row],[Cheshunt  wtime]])*3600)+MINUTE(XC[[#This Row],[Cheshunt  wtime]])*60+SECOND(XC[[#This Row],[Cheshunt  wtime]])","v":2114},{"$f":"IFERROR(IF(FIND(\"M\",XC[[#This Row],[Group]])>0,XC[[#This Row],[Cheshunt Second]],\"errorif\"),\"\")","v":""},{"$f":"IFERROR(IF(FIND(\"F\",XC[[#This Row],[Group]])>0,XC[[#This Row],[Cheshunt Second]],\"errorif\"),\"\")","v":2114},{"$f":"IF(ISNUMBER(XC[[#This Row],[Cheshunt Mens Time]]),50-(RANK(XC[[#This Row],[Cheshunt Mens Time]],XC[Cheshunt Mens Time],1))+1,0)","v":0},{"$f":"IF(ISNUMBER(XC[[#This Row],[Cheshunt ladies Time]]),50-(RANK(XC[[#This Row],[Cheshunt ladies Time]],XC[Cheshunt ladies Time],1))+1,0)","v":50},null,null,null,null,85,null,"00:33:09"," ",{"$f":"(HOUR(XC[[#This Row],[Grovelands Ladies Time]])*3600)+MINUTE(XC[[#This Row],[Grovelands Ladies Time]])*60+SECOND(XC[[#This Row],[Grovelands Ladies Time]])","v":1989},{"$f":"IF(ISNUMBER(XC[[#This Row],[Glands Mens Secs]]),50-(RANK(XC[[#This Row],[Glands Mens Secs]],XC[Glands Mens Secs],1))+1,0)","v":0},{"$f":"IF(ISNUMBER(XC[[#This Row],[Gland Ladies Secs]]),50-(RANK(XC[[#This Row],[Gland Ladies Secs]],XC[Gland Ladies Secs],1))+1,0)","v":50},62,{"$f":"IF(ISNUMBER(XC[[#This Row],[TP Mens Secs]]),50-_xlfn.RANK.EQ(XC[[#This Row],[TP Mens Secs]],XC[TP Mens Secs],1)+1,0)","v":0},{"$f":"IF(ISNUMBER(XC[[#This Row],[TP Ladies Secs]]),50-_xlfn.RANK.EQ(XC[[#This Row],[TP Ladies Secs]],XC[TP Ladies Secs],1)+1,0)","v":50},"","00:32:57","",1977]
[null,"Lee","Scott",{"$f":"TRIM(XC[[#This Row],[N1]])&\" \"&TRIM(XC[[#This Row],[N2]])","v":"Lee Scott"},1,{"$f":"VLOOKUP(XC[[#This Row],[Name]],members,2,0)","v":57},"M",{"$f":"VLOOKUP(XC[[#This Row],[Mem]],Allmembers[],7,FALSE)","v":"MV40"},{"$f":"COUNT(XC[[#This Row],[Royston Race Position]],XC[[#This Row],[Watford Race Position]],XC[[#This Row],[Cheshut place]],XC[[#This Row],[Watford Challenge Place]],XC[[#This Row],[Grovelands place]],XC[[#This Row],[Trent Park Pos]])","v":3},{"$f":"IF(XC[[#This Row],[Gender]]=\"M\",XC[[#This Row],[Royston Mens Points]]+XC[[#This Row],[Watford Mens Points]]+XC[[#This Row],[Cheshunt Mens Points]]+XC[[#This Row],[Watford Challenge Mens Points]]+XC[[#This Row],[Gland Mens Points]]+XC[[#This Row],[Trent Park Mens Points]],XC[[#This Row],[Royston Ladies Points]]+XC[[#This Row],[Waftord Ladies Points]]+XC[[#This Row],[Cheshunt Ladies Point]]+XC[[#This Row],[Watford Challenge Ladies Points]]+XC[[#This Row],[Gland Ladies Points]]+XC[[#This Row],[Trent Park Ladies Points]])","v":133},65,"40:18",{"$f":"IF(XC[[#This Row],[Royston Time2]]>\" \",(HOUR(XC[[#This Row],[Royston Time2]])*3600)+MINUTE(XC[[#This Row],[Royston Time2]])*60+SECOND(XC[[#This Row],[Royston Time2]]),\"\")","v":2418},{"$f":"IFERROR(IF(FIND(\"M\",XC[[#This Row],[Group]])>0,XC[[#This Row],[Royston Seconds]],\"errorif\"),\"\")","v":2418},{"$f":"IFERROR(IF(FIND(\"F\",XC[[#This Row],[Group]])>0,XC[[#This Row],[Royston Seconds]],\"errorif\"),\"\")","v":""},{"$f":"IF(ISNUMBER(XC[[#This Row],[Royston Mens Time]]),50-(RANK(XC[[#This Row],[Royston Mens Time]],XC[Royston Mens Time],1))+1,0)","v":41},{"$f":"IF(ISNUMBER(XC[[#This Row],[Royston Ladies Times]]),50-(RANK(XC[[#This Row],[Royston Ladies Times]],XC[Royston Ladies Times],1))+1,0)","v":0},{"$f":"Hatime(XC[[#This Row],[Royston Time]])","v":"00:40:18"},null,null,{"$f":"IFERROR((HOUR(XC[[#This Row],[Watford Time]])*3600)+MINUTE(XC[[#This Row],[Watford Time]])*60+SECOND(XC[[#This Row],[Watford Time]]),\"\")","v":""},{"$f":"IFERROR(IF(FIND(\"M\",XC[[#This Row],[Group]])>0,XC[[#This Row],[Watford Seconds]],\"errorif\"),\"\")","v":""},{"$f":"IFERROR(IF(FIND(\"F\",XC[[#This Row],[Group]])>0,XC[[#This Row],[Watford Seconds]],\"errorif\"),\"\")","v":""},{"$f":"IF(ISNUMBER(XC[[#This Row],[Watford Mens Time]]),50-(RANK(XC[[#This Row],[Watford Mens Time]],XC[Watford Mens Time],1))+1,0)","v":0},{"$f":"IF(ISNUMBER(XC[[#This Row],[Watford  Ladies Time]]),50-(RANK(XC[[#This Row],[Watford  Ladies Time]],XC[Watford  Ladies Time],1))+1,0)","v":0},{"$f":"Hatime(XC[[#This Row],[WTime]])","v":""},"00:32:29",37,{"$f":"(HOUR(XC[[#This Row],[Cheshunt  wtime]])*3600)+MINUTE(XC[[#This Row],[Cheshunt  wtime]])*60+SECOND(XC[[#This Row],[Cheshunt  wtime]])","v":1949},{"$f":"IFERROR(IF(FIND(\"M\",XC[[#This Row],[Group]])>0,XC[[#This Row],[Cheshunt Second]],\"errorif\"),\"\")","v":1949},{"$f":"IFERROR(IF(FIND(\"F\",XC[[#This Row],[Group]])>0,XC[[#This Row],[Cheshunt Second]],\"errorif\"),\"\")","v":""},{"$f":"IF(ISNUMBER(XC[[#This Row],[Cheshunt Mens Time]]),50-(RANK(XC[[#This Row],[Cheshunt Mens Time]],XC[Cheshunt Mens Time],1))+1,0)","v":49},{"$f":"IF(ISNUMBER(XC[[#This Row],[Cheshunt ladies Time]]),50-(RANK(XC[[#This Row],[Cheshunt ladies Time]],XC[Cheshunt ladies Time],1))+1,0)","v":0},null,null,null,null,70,"00:32:14",null,{"$f":"(HOUR(XC[[#This Row],[Grovelands Mens Time]])*3600)+MINUTE(XC[[#This Row],[Grovelands Mens Time]])*60+SECOND(XC[[#This Row],[Grovelands Mens Time]])","v":1934}," ",{"$f":"IF(ISNUMBER(XC[[#This Row],[Glands Mens Secs]]),50-(RANK(XC[[#This Row],[Glands Mens Secs]],XC[Glands Mens Secs],1))+1,0)","v":43},{"$f":"IF(ISNUMBER(XC[[#This Row],[Gland Ladies Secs]]),50-(RANK(XC[[#This Row],[Gland Ladies Secs]],XC[Gland Ladies Secs],1))+1,0)","v":0},"  ",{"$f":"IF(ISNUMBER(XC[[#This Row],[TP Mens Secs]]),50-_xlfn.RANK.EQ(XC[[#This Row],[TP Mens Secs]],XC[TP Mens Secs],1)+1,0)","v":0},{"$f":"IF(ISNUMBER(XC[[#This Row],[TP Ladies Secs]]),50-_xlfn.RANK.EQ(XC[[#This Row],[TP Ladies Secs]],XC[TP Ladies Secs],1)+1,0)","v":0}]
[null,"Ron","Chakraverty",{"$f":"TRIM(XC[[#This Row],[N1]])&\" \"&TRIM(XC[[#This Row],[N2]])","v":"Ron Chakraverty"},1,{"$f":"VLOOKUP(XC[[#This Row],[Name]],members,2,0)","v":72},"M",{"$f":"VLOOKUP(XC[[#This Row],[Mem]],Allmembers[],7,FALSE)","v":"MV40"},{"$f":"COUNT(XC[[#This Row],[Royston Race Position]],XC[[#This Row],[Watford Race Position]],XC[[#This Row],[Cheshut place]],XC[[#This Row],[Watford Challenge Place]],XC[[#This Row],[Grovelands place]],XC[[#This Row],[Trent Park Pos]])","v":2},{"$f":"IF(XC[[#This Row],[Gender]]=\"M\",XC[[#This Row],[Royston Mens Points]]+XC[[#This Row],[Watford Mens Points]]+XC[[#This Row],[Cheshunt Mens Points]]+XC[[#This Row],[Watford Challenge Mens Points]]+XC[[#This Row],[Gland Mens Points]]+XC[[#This Row],[Trent Park Mens Points]],XC[[#This Row],[Royston Ladies Points]]+XC[[#This Row],[Waftord Ladies Points]]+XC[[#This Row],[Cheshunt Ladies Point]]+XC[[#This Row],[Watford Challenge Ladies Points]]+XC[[#This Row],[Gland Ladies Points]]+XC[[#This Row],[Trent Park Ladies Points]])","v":69},null," ",{"$f":"IF(XC[[#This Row],[Royston Time2]]>\" \",(HOUR(XC[[#This Row],[Royston Time2]])*3600)+MINUTE(XC[[#This Row],[Royston Time2]])*60+SECOND(XC[[#This Row],[Royston Time2]]),\"\")","v":""},{"$f":"IFERROR(IF(FIND(\"M\",XC[[#This Row],[Group]])>0,XC[[#This Row],[Royston Seconds]],\"errorif\"),\"\")","v":""},{"$f":"IFERROR(IF(FIND(\"F\",XC[[#This Row],[Group]])>0,XC[[#This Row],[Royston Seconds]],\"errorif\"),\"\")","v":""},0,{"$f":"IF(ISNUMBER(XC[[#This Row],[Royston Ladies Times]]),50-(RANK(XC[[#This Row],[Royston Ladies Times]],XC[Royston Ladies Times],1))+1,0)","v":0}," ",null,null,{"$f":"IFERROR((HOUR(XC[[#This Row],[Watford Time]])*3600)+MINUTE(XC[[#This Row],[Watford Time]])*60+SECOND(XC[[#This Row],[Watford Time]]),\"\")","v":""},{"$f":"IFERROR(IF(FIND(\"M\",XC[[#This Row],[Group]])>0,XC[[#This Row],[Watford Seconds]],\"errorif\"),\"\")","v":""},{"$f":"IFERROR(IF(FIND(\"F\",XC[[#This Row],[Group]])>0,XC[[#This Row],[Watford Seconds]],\"errorif\"),\"\")","v":""},{"$f":"IF(ISNUMBER(XC[[#This Row],[Watford Mens Time]]),50-(RANK(XC[[#This Row],[Watford Mens Time]],XC[Watford Mens Time],1))+1,0)","v":0},null,{"$f":"Hatime(XC[[#This Row],[WTime]])","v":""},"00:36:35",123,{"$f":"(HOUR(XC[[#This Row],[Cheshunt  wtime]])*3600)+MINUTE(XC[[#This Row],[Cheshunt  wtime]])*60+SECOND(XC[[#This Row],[Cheshunt  wtime]])","v":2195},{"$f":"IFERROR(IF(FIND(\"M\",XC[[#This Row],[Group]])>0,XC[[#This Row],[Cheshunt Second]],\"errorif\"),\"\")","v":2195},{"$f":"IFERROR(IF(FIND(\"F\",XC[[#This Row],[Group]])>0,XC[[#This Row],[Cheshunt Second]],\"errorif\"),\"\")","v":""},{"$f":"IF(ISNUMBER(XC[[#This Row],[Cheshunt Mens Time]]),50-(RANK(XC[[#This Row],[Cheshunt Mens Time]],XC[Cheshunt Mens Time],1))+1,0)","v":35},{"$f":"IF(ISNUMBER(XC[[#This Row],[Cheshunt ladies Time]]),50-(RANK(XC[[#This Row],[Cheshunt ladies Time]],XC[Cheshunt ladies Time],1))+1,0)","v":0},null,null,null,null,150,"00:35:45",null,{"$f":"(HOUR(XC[[#This Row],[Grovelands Mens Time]])*3600)+MINUTE(XC[[#This Row],[Grovelands Mens Time]])*60+SECOND(XC[[#This Row],[Grovelands Mens Time]])","v":2145}," ",{"$f":"IF(ISNUMBER(XC[[#This Row],[Glands Mens Secs]]),50-(RANK(XC[[#This Row],[Glands Mens Secs]],XC[Glands Mens Secs],1))+1,0)","v":34},{"$f":"IF(ISNUMBER(XC[[#This Row],[Gland Ladies Secs]]),50-(RANK(XC[[#This Row],[Gland Ladies Secs]],XC[Gland Ladies Secs],1))+1,0)","v":0},"  ",{"$f":"IF(ISNUMBER(XC[[#This Row],[TP Mens Secs]]),50-_xlfn.RANK.EQ(XC[[#This Row],[TP Mens Secs]],XC[TP Mens Secs],1)+1,0)","v":0},{"$f":"IF(ISNUMBER(XC[[#This Row],[TP Ladies Secs]]),50-_xlfn.RANK.EQ(XC[[#This Row],[TP Ladies Secs]],XC[TP Ladies Secs],1)+1,0)","v":0}]
[null,"David","Green",{"$f":"TRIM(XC[[#This Row],[N1]])&\" \"&TRIM(XC[[#This Row],[N2]])","v":"David Green"},1,{"$f":"VLOOKUP(XC[[#This Row],[Name]],members,2,0)","v":73},"M",{"$f":"VLOOKUP(XC[[#This Row],[Mem]],Allmembers[],7,FALSE)","v":"MV50"},{"$f":"COUNT(XC[[#This Row],[Royston Race Position]],XC[[#This Row],[Watford Race Position]],XC[[#This Row],[Cheshut place]],XC[[#This Row],[Watford Challenge Place]],XC[[#This Row],[Grovelands place]],XC[[#This Row],[Trent Park Pos]])","v":4},{"$f":"IF(XC[[#This Row],[Gender]]=\"M\",XC[[#This Row],[Royston Mens Points]]+XC[[#This Row],[Watford Mens Points]]+XC[[#This Row],[Cheshunt Mens Points]]+XC[[#This Row],[Watford Challenge Mens Points]]+XC[[#This Row],[Gland Mens Points]]+XC[[#This Row],[Trent Park Mens Points]],XC[[#This Row],[Royston Ladies Points]]+XC[[#This Row],[Waftord Ladies Points]]+XC[[#This Row],[Cheshunt Ladies Point]]+XC[[#This Row],[Watford Challenge Ladies Points]]+XC[[#This Row],[Gland Ladies Points]]+XC[[#This Row],[Trent Park Ladies Points]])","v":194},15,"35:28",{"$f":"IF(XC[[#This Row],[Royston Time2]]>\" \",(HOUR(XC[[#This Row],[Royston Time2]])*3600)+MINUTE(XC[[#This Row],[Royston Time2]])*60+SECOND(XC[[#This Row],[Royston Time2]]),\"\")","v":2128},{"$f":"IFERROR(IF(FIND(\"M\",XC[[#This Row],[Group]])>0,XC[[#This Row],[Royston Seconds]],\"errorif\"),\"\")","v":2128},{"$f":"IFERROR(IF(FIND(\"F\",XC[[#This Row],[Group]])>0,XC[[#This Row],[Royston Seconds]],\"errorif\"),\"\")","v":""},{"$f":"IF(ISNUMBER(XC[[#This Row],[Royston Mens Time]]),50-(RANK(XC[[#This Row],[Royston Mens Time]],XC[Royston Mens Time],1))+1,0)","v":49},{"$f":"IF(ISNUMBER(XC[[#This Row],[Royston Ladies Times]]),50-(RANK(XC[[#This Row],[Royston Ladies Times]],XC[Royston Ladies Times],1))+1,0)","v":0},{"$f":"Hatime(XC[[#This Row],[Royston Time]])","v":"00:35:28"},null,null,{"$f":"IFERROR((HOUR(XC[[#This Row],[Watford Time]])*3600)+MINUTE(XC[[#This Row],[Watford Time]])*60+SECOND(XC[[#This Row],[Watford Time]]),\"\")","v":""},{"$f":"IFERROR(IF(FIND(\"M\",XC[[#This Row],[Group]])>0,XC[[#This Row],[Watford Seconds]],\"errorif\"),\"\")","v":""},{"$f":"IFERROR(IF(FIND(\"F\",XC[[#This Row],[Group]])>0,XC[[#This Row],[Watford Seconds]],\"errorif\"),\"\")","v":""},{"$f":"IF(ISNUMBER(XC[[#This Row],[Watford Mens Time]]),50-(RANK(XC[[#This Row],[Watford Mens Time]],XC[Watford Mens Time],1))+1,0)","v":0},{"$f":"IF(ISNUMBER(XC[[#This Row],[Watford  Ladies Time]]),50-(RANK(XC[[#This Row],[Watford  Ladies Time]],XC[Watford  Ladies Time],1))+1,0)","v":0},{"$f":"Hatime(XC[[#This Row],[WTime]])","v":""},"00:32:41",40,{"$f":"(HOUR(XC[[#This Row],[Cheshunt  wtime]])*3600)+MINUTE(XC[[#This Row],[Cheshunt  wtime]])*60+SECOND(XC[[#This Row],[Cheshunt  wtime]])","v":1961},{"$f":"IFERROR(IF(FIND(\"M\",XC[[#This Row],[Group]])>0,XC[[#This Row],[Cheshunt Second]],\"errorif\"),\"\")","v":1961},{"$f":"IFERROR(IF(FIND(\"F\",XC[[#This Row],[Group]])>0,XC[[#This Row],[Cheshunt Second]],\"errorif\"),\"\")","v":""},{"$f":"IF(ISNUMBER(XC[[#This Row],[Cheshunt Mens Time]]),50-(RANK(XC[[#This Row],[Cheshunt Mens Time]],XC[Cheshunt Mens Time],1))+1,0)","v":48},{"$f":"IF(ISNUMBER(XC[[#This Row],[Cheshunt ladies Time]]),50-(RANK(XC[[#This Row],[Cheshunt ladies Time]],XC[Cheshunt ladies Time],1))+1,0)","v":0},null,null,null,null,34,"00:30:35",null,{"$f":"(HOUR(XC[[#This Row],[Grovelands Mens Time]])*3600)+MINUTE(XC[[#This Row],[Grovelands Mens Time]])*60+SECOND(XC[[#This Row],[Grovelands Mens Time]])","v":1835}," ",{"$f":"IF(ISNUMBER(XC[[#This Row],[Glands Mens Secs]]),50-(RANK(XC[[#This Row],[Glands Mens Secs]],XC[Glands Mens Secs],1))+1,0)","v":49},{"$f":"IF(ISNUMBER(XC[[#This Row],[Gland Ladies Secs]]),50-(RANK(XC[[#This Row],[Gland Ladies Secs]],XC[Gland Ladies Secs],1))+1,0)","v":0},31,{"$f":"IF(ISNUMBER(XC[[#This Row],[TP Mens Secs]]),50-_xlfn.RANK.EQ(XC[[#This Row],[TP Mens Secs]],XC[TP Mens Secs],1)+1,0)","v":48},{"$f":"IF(ISNUMBER(XC[[#This Row],[TP Ladies Secs]]),50-_xlfn.RANK.EQ(XC[[#This Row],[TP Ladies Secs]],XC[TP Ladies Secs],1)+1,0)","v":0},"00:31:13","",1873,""]
[null,"Camilla","Davidson",{"$f":"TRIM(XC[[#This Row],[N1]])&\" \"&TRIM(XC[[#This Row],[N2]])","v":"Camilla Davidson"},null,{"$f":"VLOOKUP(XC[[#This Row],[Name]],members,2,0)","v":74},"W",{"$f":"VLOOKUP(XC[[#This Row],[Mem]],Allmembers[],7,FALSE)","v":"FS"},{"$f":"COUNT(XC[[#This Row],[Royston Race Position]],XC[[#This Row],[Watford Race Position]],XC[[#This Row],[Cheshut place]],XC[[#This Row],[Watford Challenge Place]],XC[[#This Row],[Grovelands place]],XC[[#This Row],[Trent Park Pos]])","v":1},{"$f":"IF(XC[[#This Row],[Gender]]=\"M\",XC[[#This Row],[Royston Mens Points]]+XC[[#This Row],[Watford Mens Points]]+XC[[#This Row],[Cheshunt Mens Points]]+XC[[#This Row],[Watford Challenge Mens Points]]+XC[[#This Row],[Gland Mens Points]]+XC[[#This Row],[Trent Park Mens Points]],XC[[#This Row],[Royston Ladies Points]]+XC[[#This Row],[Waftord Ladies Points]]+XC[[#This Row],[Cheshunt Ladies Point]]+XC[[#This Row],[Watford Challenge Ladies Points]]+XC[[#This Row],[Gland Ladies Points]]+XC[[#This Row],[Trent Park Ladies Points]])","v":50},null," ",{"$f":"IF(XC[[#This Row],[Royston Time2]]>\" \",(HOUR(XC[[#This Row],[Royston Time2]])*3600)+MINUTE(XC[[#This Row],[Royston Time2]])*60+SECOND(XC[[#This Row],[Royston Time2]]),\"\")","v":""},{"$f":"IFERROR(IF(FIND(\"M\",XC[[#This Row],[Group]])>0,XC[[#This Row],[Royston Seconds]],\"errorif\"),\"\")","v":""},{"$f":"IFERROR(IF(FIND(\"F\",XC[[#This Row],[Group]])>0,XC[[#This Row],[Royston Seconds]],\"errorif\"),\"\")","v":""},{"$f":"IF(ISNUMBER(XC[[#This Row],[Royston Mens Time]]),50-(RANK(XC[[#This Row],[Royston Mens Time]],XC[Royston Mens Time],1))+1,0)","v":0},{"$f":"IF(ISNUMBER(XC[[#This Row],[Royston Ladies Times]]),50-(RANK(XC[[#This Row],[Royston Ladies Times]],XC[Royston Ladies Times],1))+1,0)","v":0}," ",null,null,{"$f":"IFERROR((HOUR(XC[[#This Row],[Watford Time]])*3600)+MINUTE(XC[[#This Row],[Watford Time]])*60+SECOND(XC[[#This Row],[Watford Time]]),\"\")","v":""},{"$f":"IFERROR(IF(FIND(\"M\",XC[[#This Row],[Group]])>0,XC[[#This Row],[Watford Seconds]],\"errorif\"),\"\")","v":""},{"$f":"IFERROR(IF(FIND(\"F\",XC[[#This Row],[Group]])>0,XC[[#This Row],[Watford Seconds]],\"errorif\"),\"\")","v":""},{"$f":"IF(ISNUMBER(XC[[#This Row],[Watford Mens Time]]),50-(RANK(XC[[#This Row],[Watford Mens Time]],XC[Watford Mens Time],1))+1,0)","v":0},0,{"$f":"Hatime(XC[[#This Row],[WTime]])","v":""},null,null," ",{"$f":"IFERROR(IF(FIND(\"M\",XC[[#This Row],[Group]])>0,XC[[#This Row],[Cheshunt Second]],\"errorif\"),\"\")","v":""},{"$f":"IFERROR(IF(FIND(\"F\",XC[[#This Row],[Group]])>0,XC[[#This Row],[Cheshunt Second]],\"errorif\"),\"\")","v":" "},{"$f":"IF(ISNUMBER(XC[[#This Row],[Cheshunt Mens Time]]),50-(RANK(XC[[#This Row],[Cheshunt Mens Time]],XC[Cheshunt Mens Time],1))+1,0)","v":0},{"$f":"IF(ISNUMBER(XC[[#This Row],[Cheshunt ladies Time]]),50-(RANK(XC[[#This Row],[Cheshunt ladies Time]],XC[Cheshunt ladies Time],1))+1,0)","v":0},12,null,50,2.3229166666666665E-2,null,null,null," "," ",{"$f":"IF(ISNUMBER(XC[[#This Row],[Glands Mens Secs]]),50-(RANK(XC[[#This Row],[Glands Mens Secs]],XC[Glands Mens Secs],1))+1,0)","v":0},{"$f":"IF(ISNUMBER(XC[[#This Row],[Gland Ladies Secs]]),50-(RANK(XC[[#This Row],[Gland Ladies Secs]],XC[Gland Ladies Secs],1))+1,0)","v":0},"  ",{"$f":"IF(ISNUMBER(XC[[#This Row],[TP Mens Secs]]),50-_xlfn.RANK.EQ(XC[[#This Row],[TP Mens Secs]],XC[TP Mens Secs],1)+1,0)","v":0},{"$f":"IF(ISNUMBER(XC[[#This Row],[TP Ladies Secs]]),50-_xlfn.RANK.EQ(XC[[#This Row],[TP Ladies Secs]],XC[TP Ladies Secs],1)+1,0)","v":0}]
[null,"Sarah","Dumbrill",{"$f":"TRIM(XC[[#This Row],[N1]])&\" \"&TRIM(XC[[#This Row],[N2]])","v":"Sarah Dumbrill"},null,{"$f":"VLOOKUP(XC[[#This Row],[Name]],members,2,0)","v":77},"W",{"$f":"VLOOKUP(XC[[#This Row],[Mem]],Allmembers[],7,FALSE)","v":"FV35"},{"$f":"COUNT(XC[[#This Row],[Royston Race Position]],XC[[#This Row],[Watford Race Position]],XC[[#This Row],[Cheshut place]],XC[[#This Row],[Watford Challenge Place]],XC[[#This Row],[Grovelands place]],XC[[#This Row],[Trent Park Pos]])","v":2},{"$f":"IF(XC[[#This Row],[Gender]]=\"M\",XC[[#This Row],[Royston Mens Points]]+XC[[#This Row],[Watford Mens Points]]+XC[[#This Row],[Cheshunt Mens Points]]+XC[[#This Row],[Watford Challenge Mens Points]]+XC[[#This Row],[Gland Mens Points]]+XC[[#This Row],[Trent Park Mens Points]],XC[[#This Row],[Royston Ladies Points]]+XC[[#This Row],[Waftord Ladies Points]]+XC[[#This Row],[Cheshunt Ladies Point]]+XC[[#This Row],[Watford Challenge Ladies Points]]+XC[[#This Row],[Gland Ladies Points]]+XC[[#This Row],[Trent Park Ladies Points]])","v":95},null," ",{"$f":"IF(XC[[#This Row],[Royston Time2]]>\" \",(HOUR(XC[[#This Row],[Royston Time2]])*3600)+MINUTE(XC[[#This Row],[Royston Time2]])*60+SECOND(XC[[#This Row],[Royston Time2]]),\"\")","v":""},{"$f":"IFERROR(IF(FIND(\"M\",XC[[#This Row],[Group]])>0,XC[[#This Row],[Royston Seconds]],\"errorif\"),\"\")","v":""},{"$f":"IFERROR(IF(FIND(\"F\",XC[[#This Row],[Group]])>0,XC[[#This Row],[Royston Seconds]],\"errorif\"),\"\")","v":""},{"$f":"IF(ISNUMBER(XC[[#This Row],[Royston Mens Time]]),50-(RANK(XC[[#This Row],[Royston Mens Time]],XC[Royston Mens Time],1))+1,0)","v":0},{"$f":"IF(ISNUMBER(XC[[#This Row],[Royston Ladies Times]]),50-(RANK(XC[[#This Row],[Royston Ladies Times]],XC[Royston Ladies Times],1))+1,0)","v":0}," ",null,null,{"$f":"IFERROR((HOUR(XC[[#This Row],[Watford Time]])*3600)+MINUTE(XC[[#This Row],[Watford Time]])*60+SECOND(XC[[#This Row],[Watford Time]]),\"\")","v":""},{"$f":"IFERROR(IF(FIND(\"M\",XC[[#This Row],[Group]])>0,XC[[#This Row],[Watford Seconds]],\"errorif\"),\"\")","v":""},{"$f":"IFERROR(IF(FIND(\"F\",XC[[#This Row],[Group]])>0,XC[[#This Row],[Watford Seconds]],\"errorif\"),\"\")","v":""},{"$f":"IF(ISNUMBER(XC[[#This Row],[Watford Mens Time]]),50-(RANK(XC[[#This Row],[Watford Mens Time]],XC[Watford Mens Time],1))+1,0)","v":0},null,{"$f":"Hatime(XC[[#This Row],[WTime]])","v":""},"00:41:52",245,{"$f":"(HOUR(XC[[#This Row],[Cheshunt  wtime]])*3600)+MINUTE(XC[[#This Row],[Cheshunt  wtime]])*60+SECOND(XC[[#This Row],[Cheshunt  wtime]])","v":2512},{"$f":"IFERROR(IF(FIND(\"M\",XC[[#This Row],[Group]])>0,XC[[#This Row],[Cheshunt Second]],\"errorif\"),\"\")","v":""},{"$f":"IFERROR(IF(FIND(\"F\",XC[[#This Row],[Group]])>0,XC[[#This Row],[Cheshunt Second]],\"errorif\"),\"\")","v":2512},{"$f":"IF(ISNUMBER(XC[[#This Row],[Cheshunt Mens Time]]),50-(RANK(XC[[#This Row],[Cheshunt Mens Time]],XC[Cheshunt Mens Time],1))+1,0)","v":0},{"$f":"IF(ISNUMBER(XC[[#This Row],[Cheshunt ladies Time]]),50-(RANK(XC[[#This Row],[Cheshunt ladies Time]],XC[Cheshunt ladies Time],1))+1,0)","v":47},null,null,null,null,null,null,null," "," ",{"$f":"IF(ISNUMBER(XC[[#This Row],[Glands Mens Secs]]),50-(RANK(XC[[#This Row],[Glands Mens Secs]],XC[Glands Mens Secs],1))+1,0)","v":0},{"$f":"IF(ISNUMBER(XC[[#This Row],[Gland Ladies Secs]]),50-(RANK(XC[[#This Row],[Gland Ladies Secs]],XC[Gland Ladies Secs],1))+1,0)","v":0},165,{"$f":"IF(ISNUMBER(XC[[#This Row],[TP Mens Secs]]),50-_xlfn.RANK.EQ(XC[[#This Row],[TP Mens Secs]],XC[TP Mens Secs],1)+1,0)","v":0},{"$f":"IF(ISNUMBER(XC[[#This Row],[TP Ladies Secs]]),50-_xlfn.RANK.EQ(XC[[#This Row],[TP Ladies Secs]],XC[TP Ladies Secs],1)+1,0)","v":48},"","00:37:41","",2261]
[null,"Norman","Whitwood",{"$f":"TRIM(XC[[#This Row],[N1]])&\" \"&TRIM(XC[[#This Row],[N2]])","v":"Norman Whitwood"},1,{"$f":"VLOOKUP(XC[[#This Row],[Name]],members,2,0)","v":93},"M",{"$f":"VLOOKUP(XC[[#This Row],[Mem]],Allmembers[],7,FALSE)","v":"MV60"},{"$f":"COUNT(XC[[#This Row],[Royston Race Position]],XC[[#This Row],[Watford Race Position]],XC[[#This Row],[Cheshut place]],XC[[#This Row],[Watford Challenge Place]],XC[[#This Row],[Grovelands place]],XC[[#This Row],[Trent Park Pos]])","v":2},{"$f":"IF(XC[[#This Row],[Gender]]=\"M\",XC[[#This Row],[Royston Mens Points]]+XC[[#This Row],[Watford Mens Points]]+XC[[#This Row],[Cheshunt Mens Points]]+XC[[#This Row],[Watford Challenge Mens Points]]+XC[[#This Row],[Gland Mens Points]]+XC[[#This Row],[Trent Park Mens Points]],XC[[#This Row],[Royston Ladies Points]]+XC[[#This Row],[Waftord Ladies Points]]+XC[[#This Row],[Cheshunt Ladies Point]]+XC[[#This Row],[Watford Challenge Ladies Points]]+XC[[#This Row],[Gland Ladies Points]]+XC[[#This Row],[Trent Park Ladies Points]])","v":51},null," ",{"$f":"IF(XC[[#This Row],[Royston Time2]]>\" \",(HOUR(XC[[#This Row],[Royston Time2]])*3600)+MINUTE(XC[[#This Row],[Royston Time2]])*60+SECOND(XC[[#This Row],[Royston Time2]]),\"\")","v":""},{"$f":"IFERROR(IF(FIND(\"M\",XC[[#This Row],[Group]])>0,XC[[#This Row],[Royston Seconds]],\"errorif\"),\"\")","v":""},{"$f":"IFERROR(IF(FIND(\"F\",XC[[#This Row],[Group]])>0,XC[[#This Row],[Royston Seconds]],\"errorif\"),\"\")","v":""},0,{"$f":"IF(ISNUMBER(XC[[#This Row],[Royston Ladies Times]]),50-(RANK(XC[[#This Row],[Royston Ladies Times]],XC[Royston Ladies Times],1))+1,0)","v":0}," ",null,null,{"$f":"IFERROR((HOUR(XC[[#This Row],[Watford Time]])*3600)+MINUTE(XC[[#This Row],[Watford Time]])*60+SECOND(XC[[#This Row],[Watford Time]]),\"\")","v":""},{"$f":"IFERROR(IF(FIND(\"M\",XC[[#This Row],[Group]])>0,XC[[#This Row],[Watford Seconds]],\"errorif\"),\"\")","v":""},{"$f":"IFERROR(IF(FIND(\"F\",XC[[#This Row],[Group]])>0,XC[[#This Row],[Watford Seconds]],\"errorif\"),\"\")","v":""},{"$f":"IF(ISNUMBER(XC[[#This Row],[Watford Mens Time]]),50-(RANK(XC[[#This Row],[Watford Mens Time]],XC[Watford Mens Time],1))+1,0)","v":0},null,{"$f":"Hatime(XC[[#This Row],[WTime]])","v":""},"00:55:00",378,{"$f":"(HOUR(XC[[#This Row],[Cheshunt  wtime]])*3600)+MINUTE(XC[[#This Row],[Cheshunt  wtime]])*60+SECOND(XC[[#This Row],[Cheshunt  wtime]])","v":3300},{"$f":"IFERROR(IF(FIND(\"M\",XC[[#This Row],[Group]])>0,XC[[#This Row],[Cheshunt Second]],\"errorif\"),\"\")","v":3300},{"$f":"IFERROR(IF(FIND(\"F\",XC[[#This Row],[Group]])>0,XC[[#This Row],[Cheshunt Second]],\"errorif\"),\"\")","v":""},{"$f":"IF(ISNUMBER(XC[[#This Row],[Cheshunt Mens Time]]),50-(RANK(XC[[#This Row],[Cheshunt Mens Time]],XC[Cheshunt Mens Time],1))+1,0)","v":25},{"$f":"IF(ISNUMBER(XC[[#This Row],[Cheshunt ladies Time]]),50-(RANK(XC[[#This Row],[Cheshunt ladies Time]],XC[Cheshunt ladies Time],1))+1,0)","v":0},null,null,null,null,384,"00:50:24",null,{"$f":"(HOUR(XC[[#This Row],[Grovelands Mens Time]])*3600)+MINUTE(XC[[#This Row],[Grovelands Mens Time]])*60+SECOND(XC[[#This Row],[Grovelands Mens Time]])","v":3024}," ",{"$f":"IF(ISNUMBER(XC[[#This Row],[Glands Mens Secs]]),50-(RANK(XC[[#This Row],[Glands Mens Secs]],XC[Glands Mens Secs],1))+1,0)","v":26},{"$f":"IF(ISNUMBER(XC[[#This Row],[Gland Ladies Secs]]),50-(RANK(XC[[#This Row],[Gland Ladies Secs]],XC[Gland Ladies Secs],1))+1,0)","v":0},"  ",{"$f":"IF(ISNUMBER(XC[[#This Row],[TP Mens Secs]]),50-_xlfn.RANK.EQ(XC[[#This Row],[TP Mens Secs]],XC[TP Mens Secs],1)+1,0)","v":0},{"$f":"IF(ISNUMBER(XC[[#This Row],[TP Ladies Secs]]),50-_xlfn.RANK.EQ(XC[[#This Row],[TP Ladies Secs]],XC[TP Ladies Secs],1)+1,0)","v":0}]
[null,"Jenny","Birch",{"$f":"TRIM(XC[[#This Row],[N1]])&\" \"&TRIM(XC[[#This Row],[N2]])","v":"Jenny Birch"},null,{"$f":"VLOOKUP(XC[[#This Row],[Name]],members,2,0)","v":94},"W",{"$f":"VLOOKUP(XC[[#This Row],[Mem]],Allmembers[],7,FALSE)","v":"FV35"},{"$f":"COUNT(XC[[#This Row],[Royston Race Position]],XC[[#This Row],[Watford Race Position]],XC[[#This Row],[Cheshut place]],XC[[#This Row],[Watford Challenge Place]],XC[[#This Row],[Grovelands place]],XC[[#This Row],[Trent Park Pos]])","v":1},{"$f":"IF(XC[[#This Row],[Gender]]=\"M\",XC[[#This Row],[Royston Mens Points]]+XC[[#This Row],[Watford Mens Points]]+XC[[#This Row],[Cheshunt Mens Points]]+XC[[#This Row],[Watford Challenge Mens Points]]+XC[[#This Row],[Gland Mens Points]]+XC[[#This Row],[Trent Park Mens Points]],XC[[#This Row],[Royston Ladies Points]]+XC[[#This Row],[Waftord Ladies Points]]+XC[[#This Row],[Cheshunt Ladies Point]]+XC[[#This Row],[Watford Challenge Ladies Points]]+XC[[#This Row],[Gland Ladies Points]]+XC[[#This Row],[Trent Park Ladies Points]])","v":41},292,"58:31",{"$f":"IF(XC[[#This Row],[Royston Time2]]>\" \",(HOUR(XC[[#This Row],[Royston Time2]])*3600)+MINUTE(XC[[#This Row],[Royston Time2]])*60+SECOND(XC[[#This Row],[Royston Time2]]),\"\")","v":3511},{"$f":"IFERROR(IF(FIND(\"M\",XC[[#This Row],[Group]])>0,XC[[#This Row],[Royston Seconds]],\"errorif\"),\"\")","v":""},{"$f":"IFERROR(IF(FIND(\"F\",XC[[#This Row],[Group]])>0,XC[[#This Row],[Royston Seconds]],\"errorif\"),\"\")","v":3511},{"$f":"IF(ISNUMBER(XC[[#This Row],[Royston Mens Time]]),50-(RANK(XC[[#This Row],[Royston Mens Time]],XC[Royston Mens Time],1))+1,0)","v":0},{"$f":"IF(ISNUMBER(XC[[#This Row],[Royston Ladies Times]]),50-(RANK(XC[[#This Row],[Royston Ladies Times]],XC[Royston Ladies Times],1))+1,\"\")","v":41},{"$f":"Hatime(XC[[#This Row],[Royston Time]])","v":"00:58:31"},null,null,{"$f":"IFERROR((HOUR(XC[[#This Row],[Watford Time]])*3600)+MINUTE(XC[[#This Row],[Watford Time]])*60+SECOND(XC[[#This Row],[Watford Time]]),\"\")","v":""},{"$f":"IFERROR(IF(FIND(\"M\",XC[[#This Row],[Group]])>0,XC[[#This Row],[Watford Seconds]],\"errorif\"),\"\")","v":""},{"$f":"IFERROR(IF(FIND(\"F\",XC[[#This Row],[Group]])>0,XC[[#This Row],[Watford Seconds]],\"errorif\"),\"\")","v":""},{"$f":"IF(ISNUMBER(XC[[#This Row],[Watford Mens Time]]),50-(RANK(XC[[#This Row],[Watford Mens Time]],XC[Watford Mens Time],1))+1,0)","v":0},{"$f":"IF(ISNUMBER(XC[[#This Row],[Watford  Ladies Time]]),50-(RANK(XC[[#This Row],[Watford  Ladies Time]],XC[Watford  Ladies Time],1))+1,0)","v":0},{"$f":"Hatime(XC[[#This Row],[WTime]])","v":""},null,null," ",{"$f":"IFERROR(IF(FIND(\"M\",XC[[#This Row],[Group]])>0,XC[[#This Row],[Cheshunt Second]],\"errorif\"),\"\")","v":""},{"$f":"IFERROR(IF(FIND(\"F\",XC[[#This Row],[Group]])>0,XC[[#This Row],[Cheshunt Second]],\"errorif\"),\"\")","v":" "},{"$f":"IF(ISNUMBER(XC[[#This Row],[Cheshunt Mens Time]]),50-(RANK(XC[[#This Row],[Cheshunt Mens Time]],XC[Cheshunt Mens Time],1))+1,0)","v":0},{"$f":"IF(ISNUMBER(XC[[#This Row],[Cheshunt ladies Time]]),50-(RANK(XC[[#This Row],[Cheshunt ladies Time]],XC[Cheshunt ladies Time],1))+1,0)","v":0},null,null,null,null,null,null,null," "," ",{"$f":"IF(ISNUMBER(XC[[#This Row],[Glands Mens Secs]]),50-(RANK(XC[[#This Row],[Glands Mens Secs]],XC[Glands Mens Secs],1))+1,0)","v":0},{"$f":"IF(ISNUMBER(XC[[#This Row],[Gland Ladies Secs]]),50-(RANK(XC[[#This Row],[Gland Ladies Secs]],XC[Gland Ladies Secs],1))+1,0)","v":0},"  ",{"$f":"IF(ISNUMBER(XC[[#This Row],[TP Mens Secs]]),50-_xlfn.RANK.EQ(XC[[#This Row],[TP Mens Secs]],XC[TP Mens Secs],1)+1,0)","v":0},{"$f":"IF(ISNUMBER(XC[[#This Row],[TP Ladies Secs]]),50-_xlfn.RANK.EQ(XC[[#This Row],[TP Ladies Secs]],XC[TP Ladies Secs],1)+1,0)","v":0}]
[null,"Jennifer","Finlay",{"$f":"TRIM(XC[[#This Row],[N1]])&\" \"&TRIM(XC[[#This Row],[N2]])","v":"Jennifer Finlay"},1,{"$f":"VLOOKUP(XC[[#This Row],[Name]],members,2,0)","v":97},"W",{"$f":"VLOOKUP(XC[[#This Row],[Mem]],Allmembers[],7,FALSE)","v":"FV35"},{"$f":"COUNT(XC[[#This Row],[Royston Race Position]],XC[[#This Row],[Watford Race Position]],XC[[#This Row],[Cheshut place]],XC[[#This Row],[Watford Challenge Place]],XC[[#This Row],[Grovelands place]],XC[[#This Row],[Trent Park Pos]])","v":5},{"$f":"IF(XC[[#This Row],[Gender]]=\"M\",XC[[#This Row],[Royston Mens Points]]+XC[[#This Row],[Watford Mens Points]]+XC[[#This Row],[Cheshunt Mens Points]]+XC[[#This Row],[Watford Challenge Mens Points]]+XC[[#This Row],[Gland Mens Points]]+XC[[#This Row],[Trent Park Mens Points]],XC[[#This Row],[Royston Ladies Points]]+XC[[#This Row],[Waftord Ladies Points]]+XC[[#This Row],[Cheshunt Ladies Point]]+XC[[#This Row],[Watford Challenge Ladies Points]]+XC[[#This Row],[Gland Ladies Points]]+XC[[#This Row],[Trent Park Ladies Points]])","v":241},152,"45:51",{"$f":"IF(XC[[#This Row],[Royston Time2]]>\" \",(HOUR(XC[[#This Row],[Royston Time2]])*3600)+MINUTE(XC[[#This Row],[Royston Time2]])*60+SECOND(XC[[#This Row],[Royston Time2]]),\"\")","v":2751},{"$f":"IFERROR(IF(FIND(\"M\",XC[[#This Row],[Group]])>0,XC[[#This Row],[Royston Seconds]],\"errorif\"),\"\")","v":""},{"$f":"IFERROR(IF(FIND(\"F\",XC[[#This Row],[Group]])>0,XC[[#This Row],[Royston Seconds]],\"errorif\"),\"\")","v":2751},{"$f":"IF(ISNUMBER(XC[[#This Row],[Royston Mens Time]]),50-(RANK(XC[[#This Row],[Royston Mens Time]],XC[Royston Mens Time],1))+1,0)","v":0},{"$f":"IF(ISNUMBER(XC[[#This Row],[Royston Ladies Times]]),50-(RANK(XC[[#This Row],[Royston Ladies Times]],XC[Royston Ladies Times],1))+1,\"\")","v":48},{"$f":"Hatime(XC[[#This Row],[Royston Time]])","v":"00:45:51"},157,"48:32",{"$f":"IFERROR((HOUR(XC[[#This Row],[Watford Time]])*3600)+MINUTE(XC[[#This Row],[Watford Time]])*60+SECOND(XC[[#This Row],[Watford Time]]),\"\")","v":2912},{"$f":"IFERROR(IF(FIND(\"M\",XC[[#This Row],[Group]])>0,XC[[#This Row],[Watford Seconds]],\"errorif\"),\"\")","v":""},{"$f":"IFERROR(IF(FIND(\"F\",XC[[#This Row],[Group]])>0,XC[[#This Row],[Watford Seconds]],\"errorif\"),\"\")","v":2912},{"$f":"IF(ISNUMBER(XC[[#This Row],[Watford Mens Time]]),50-(RANK(XC[[#This Row],[Watford Mens Time]],XC[Watford Mens Time],1))+1,0)","v":0},{"$f":"IF(ISNUMBER(XC[[#This Row],[Watford  Ladies Time]]),50-(RANK(XC[[#This Row],[Watford  Ladies Time]],XC[Watford  Ladies Time],1))+1,0)","v":47},{"$f":"Hatime(XC[[#This Row],[WTime]])","v":"00:48:32"},"00:39:31",191,{"$f":"(HOUR(XC[[#This Row],[Cheshunt  wtime]])*3600)+MINUTE(XC[[#This Row],[Cheshunt  wtime]])*60+SECOND(XC[[#This Row],[Cheshunt  wtime]])","v":2371},{"$f":"IFERROR(IF(FIND(\"M\",XC[[#This Row],[Group]])>0,XC[[#This Row],[Cheshunt Second]],\"errorif\"),\"\")","v":""},{"$f":"IFERROR(IF(FIND(\"F\",XC[[#This Row],[Group]])>0,XC[[#This Row],[Cheshunt Second]],\"errorif\"),\"\")","v":2371},{"$f":"IF(ISNUMBER(XC[[#This Row],[Cheshunt Mens Time]]),50-(RANK(XC[[#This Row],[Cheshunt Mens Time]],XC[Cheshunt Mens Time],1))+1,0)","v":0},{"$f":"IF(ISNUMBER(XC[[#This Row],[Cheshunt ladies Time]]),50-(RANK(XC[[#This Row],[Cheshunt ladies Time]],XC[Cheshunt ladies Time],1))+1,0)","v":48},null,null,null,null,173,null,"00:36:50"," ",{"$f":"(HOUR(XC[[#This Row],[Grovelands Ladies Time]])*3600)+MINUTE(XC[[#This Row],[Grovelands Ladies Time]])*60+SECOND(XC[[#This Row],[Grovelands Ladies Time]])","v":2210},{"$f":"IF(ISNUMBER(XC[[#This Row],[Glands Mens Secs]]),50-(RANK(XC[[#This Row],[Glands Mens Secs]],XC[Glands Mens Secs],1))+1,0)","v":0},{"$f":"IF(ISNUMBER(XC[[#This Row],[Gland Ladies Secs]]),50-(RANK(XC[[#This Row],[Gland Ladies Secs]],XC[Gland Ladies Secs],1))+1,0)","v":49},143,{"$f":"IF(ISNUMBER(XC[[#This Row],[TP Mens Secs]]),50-_xlfn.RANK.EQ(XC[[#This Row],[TP Mens Secs]],XC[TP Mens Secs],1)+1,0)","v":0},{"$f":"IF(ISNUMBER(XC[[#This Row],[TP Ladies Secs]]),50-_xlfn.RANK.EQ(XC[[#This Row],[TP Ladies Secs]],XC[TP Ladies Secs],1)+1,0)","v":49},"","00:36:54","",2214]
[null,"Phil","Jacobs",{"$f":"TRIM(XC[[#This Row],[N1]])&\" \"&TRIM(XC[[#This Row],[N2]])","v":"Phil Jacobs"},1,{"$f":"VLOOKUP(XC[[#This Row],[Name]],members,2,0)","v":100},"M",{"$f":"VLOOKUP(XC[[#This Row],[Mem]],Allmembers[],7,FALSE)","v":"MV40"},{"$f":"COUNT(XC[[#This Row],[Royston Race Position]],XC[[#This Row],[Watford Race Position]],XC[[#This Row],[Cheshut place]],XC[[#This Row],[Watford Challenge Place]],XC[[#This Row],[Grovelands place]],XC[[#This Row],[Trent Park Pos]])","v":5},{"$f":"IF(XC[[#This Row],[Gender]]=\"M\",XC[[#This Row],[Royston Mens Points]]+XC[[#This Row],[Watford Mens Points]]+XC[[#This Row],[Cheshunt Mens Points]]+XC[[#This Row],[Watford Challenge Mens Points]]+XC[[#This Row],[Gland Mens Points]]+XC[[#This Row],[Trent Park Mens Points]],XC[[#This Row],[Royston Ladies Points]]+XC[[#This Row],[Waftord Ladies Points]]+XC[[#This Row],[Cheshunt Ladies Point]]+XC[[#This Row],[Watford Challenge Ladies Points]]+XC[[#This Row],[Gland Ladies Points]]+XC[[#This Row],[Trent Park Ladies Points]])","v":213},47,"39:16",{"$f":"IF(XC[[#This Row],[Royston Time2]]>\" \",(HOUR(XC[[#This Row],[Royston Time2]])*3600)+MINUTE(XC[[#This Row],[Royston Time2]])*60+SECOND(XC[[#This Row],[Royston Time2]]),\"\")","v":2356},{"$f":"IFERROR(IF(FIND(\"M\",XC[[#This Row],[Group]])>0,XC[[#This Row],[Royston Seconds]],\"errorif\"),\"\")","v":2356},{"$f":"IFERROR(IF(FIND(\"F\",XC[[#This Row],[Group]])>0,XC[[#This Row],[Royston Seconds]],\"errorif\"),\"\")","v":""},{"$f":"IF(ISNUMBER(XC[[#This Row],[Royston Mens Time]]),50-(RANK(XC[[#This Row],[Royston Mens Time]],XC[Royston Mens Time],1))+1,0)","v":46},{"$f":"IF(ISNUMBER(XC[[#This Row],[Royston Ladies Times]]),50-(RANK(XC[[#This Row],[Royston Ladies Times]],XC[Royston Ladies Times],1))+1,0)","v":0},{"$f":"Hatime(XC[[#This Row],[Royston Time]])","v":"00:39:16"},53,"41:58",{"$f":"IFERROR((HOUR(XC[[#This Row],[Watford Time]])*3600)+MINUTE(XC[[#This Row],[Watford Time]])*60+SECOND(XC[[#This Row],[Watford Time]]),\"\")","v":2518},{"$f":"IFERROR(IF(FIND(\"M\",XC[[#This Row],[Group]])>0,XC[[#This Row],[Watford Seconds]],\"errorif\"),\"\")","v":2518},{"$f":"IFERROR(IF(FIND(\"F\",XC[[#This Row],[Group]])>0,XC[[#This Row],[Watford Seconds]],\"errorif\"),\"\")","v":""},{"$f":"IF(ISNUMBER(XC[[#This Row],[Watford Mens Time]]),50-(RANK(XC[[#This Row],[Watford Mens Time]],XC[Watford Mens Time],1))+1,0)","v":49},{"$f":"IF(ISNUMBER(XC[[#This Row],[Watford  Ladies Time]]),50-(RANK(XC[[#This Row],[Watford  Ladies Time]],XC[Watford  Ladies Time],1))+1,0)","v":0},{"$f":"Hatime(XC[[#This Row],[WTime]])","v":"00:41:58"},"00:35:28",98,{"$f":"(HOUR(XC[[#This Row],[Cheshunt  wtime]])*3600)+MINUTE(XC[[#This Row],[Cheshunt  wtime]])*60+SECOND(XC[[#This Row],[Cheshunt  wtime]])","v":2128},{"$f":"IFERROR(IF(FIND(\"M\",XC[[#This Row],[Group]])>0,XC[[#This Row],[Cheshunt Second]],\"errorif\"),\"\")","v":2128},{"$f":"IFERROR(IF(FIND(\"F\",XC[[#This Row],[Group]])>0,XC[[#This Row],[Cheshunt Second]],\"errorif\"),\"\")","v":""},{"$f":"IF(ISNUMBER(XC[[#This Row],[Cheshunt Mens Time]]),50-(RANK(XC[[#This Row],[Cheshunt Mens Time]],XC[Cheshunt Mens Time],1))+1,0)","v":38},{"$f":"IF(ISNUMBER(XC[[#This Row],[Cheshunt ladies Time]]),50-(RANK(XC[[#This Row],[Cheshunt ladies Time]],XC[Cheshunt ladies Time],1))+1,0)","v":0},13,49,null,2.3402777777777783E-2,178,"00:37:00",null,{"$f":"(HOUR(XC[[#This Row],[Grovelands Mens Time]])*3600)+MINUTE(XC[[#This Row],[Grovelands Mens Time]])*60+SECOND(XC[[#This Row],[Grovelands Mens Time]])","v":2220}," ",{"$f":"IF(ISNUMBER(XC[[#This Row],[Glands Mens Secs]]),50-(RANK(XC[[#This Row],[Glands Mens Secs]],XC[Glands Mens Secs],1))+1,0)","v":31},{"$f":"IF(ISNUMBER(XC[[#This Row],[Gland Ladies Secs]]),50-(RANK(XC[[#This Row],[Gland Ladies Secs]],XC[Gland Ladies Secs],1))+1,0)","v":0},"  ",{"$f":"IF(ISNUMBER(XC[[#This Row],[TP Mens Secs]]),50-_xlfn.RANK.EQ(XC[[#This Row],[TP Mens Secs]],XC[TP Mens Secs],1)+1,0)","v":0},{"$f":"IF(ISNUMBER(XC[[#This Row],[TP Ladies Secs]]),50-_xlfn.RANK.EQ(XC[[#This Row],[TP Ladies Secs]],XC[TP Ladies Secs],1)+1,0)","v":0}]
[null,"Tim","Mauchline",{"$f":"TRIM(XC[[#This Row],[N1]])&\" \"&TRIM(XC[[#This Row],[N2]])","v":"Tim Mauchline"},null,{"$f":"VLOOKUP(XC[[#This Row],[Name]],members,2,0)","v":103},"M",{"$f":"VLOOKUP(XC[[#This Row],[Mem]],Allmembers[],7,FALSE)","v":"MS"},{"$f":"COUNT(XC[[#This Row],[Royston Race Position]],XC[[#This Row],[Watford Race Position]],XC[[#This Row],[Cheshut place]],XC[[#This Row],[Watford Challenge Place]],XC[[#This Row],[Grovelands place]],XC[[#This Row],[Trent Park Pos]])","v":1},{"$f":"IF(XC[[#This Row],[Gender]]=\"M\",XC[[#This Row],[Royston Mens Points]]+XC[[#This Row],[Watford Mens Points]]+XC[[#This Row],[Cheshunt Mens Points]]+XC[[#This Row],[Watford Challenge Mens Points]]+XC[[#This Row],[Gland Mens Points]]+XC[[#This Row],[Trent Park Mens Points]],XC[[#This Row],[Royston Ladies Points]]+XC[[#This Row],[Waftord Ladies Points]]+XC[[#This Row],[Cheshunt Ladies Point]]+XC[[#This Row],[Watford Challenge Ladies Points]]+XC[[#This Row],[Gland Ladies Points]]+XC[[#This Row],[Trent Park Ladies Points]])","v":50},null," ",{"$f":"IF(XC[[#This Row],[Royston Time2]]>\" \",(HOUR(XC[[#This Row],[Royston Time2]])*3600)+MINUTE(XC[[#This Row],[Royston Time2]])*60+SECOND(XC[[#This Row],[Royston Time2]]),\"\")","v":""},{"$f":"IFERROR(IF(FIND(\"M\",XC[[#This Row],[Group]])>0,XC[[#This Row],[Royston Seconds]],\"errorif\"),\"\")","v":""},{"$f":"IFERROR(IF(FIND(\"F\",XC[[#This Row],[Group]])>0,XC[[#This Row],[Royston Seconds]],\"errorif\"),\"\")","v":""},{"$f":"IF(ISNUMBER(XC[[#This Row],[Royston Mens Time]]),50-(RANK(XC[[#This Row],[Royston Mens Time]],XC[Royston Mens Time],1))+1,0)","v":0},{"$f":"IF(ISNUMBER(XC[[#This Row],[Royston Ladies Times]]),50-(RANK(XC[[#This Row],[Royston Ladies Times]],XC[Royston Ladies Times],1))+1,0)","v":0}," ",null,null,{"$f":"IFERROR((HOUR(XC[[#This Row],[Watford Time]])*3600)+MINUTE(XC[[#This Row],[Watford Time]])*60+SECOND(XC[[#This Row],[Watford Time]]),\"\")","v":""},{"$f":"IFERROR(IF(FIND(\"M\",XC[[#This Row],[Group]])>0,XC[[#This Row],[Watford Seconds]],\"errorif\"),\"\")","v":""},{"$f":"IFERROR(IF(FIND(\"F\",XC[[#This Row],[Group]])>0,XC[[#This Row],[Watford Seconds]],\"errorif\"),\"\")","v":""},{"$f":"IF(ISNUMBER(XC[[#This Row],[Watford Mens Time]]),50-(RANK(XC[[#This Row],[Watford Mens Time]],XC[Watford Mens Time],1))+1,0)","v":0},0,{"$f":"Hatime(XC[[#This Row],[WTime]])","v":""},null,null," "," ",{"$f":"IFERROR(IF(FIND(\"F\",XC[[#This Row],[Group]])>0,XC[[#This Row],[Cheshunt Second]],\"errorif\"),\"\")","v":""},{"$f":"IF(ISNUMBER(XC[[#This Row],[Cheshunt Mens Time]]),50-(RANK(XC[[#This Row],[Cheshunt Mens Time]],XC[Cheshunt Mens Time],1))+1,0)","v":0},{"$f":"IF(ISNUMBER(XC[[#This Row],[Cheshunt ladies Time]]),50-(RANK(XC[[#This Row],[Cheshunt ladies Time]],XC[Cheshunt ladies Time],1))+1,0)","v":0},null,null,null,null,null,null,null," "," ",{"$f":"IF(ISNUMBER(XC[[#This Row],[Glands Mens Secs]]),50-(RANK(XC[[#This Row],[Glands Mens Secs]],XC[Glands Mens Secs],1))+1,0)","v":0},{"$f":"IF(ISNUMBER(XC[[#This Row],[Gland Ladies Secs]]),50-(RANK(XC[[#This Row],[Gland Ladies Secs]],XC[Gland Ladies Secs],1))+1,0)","v":0},18,{"$f":"IF(ISNUMBER(XC[[#This Row],[TP Mens Secs]]),50-_xlfn.RANK.EQ(XC[[#This Row],[TP Mens Secs]],XC[TP Mens Secs],1)+1,0)","v":50},{"$f":"IF(ISNUMBER(XC[[#This Row],[TP Ladies Secs]]),50-_xlfn.RANK.EQ(XC[[#This Row],[TP Ladies Secs]],XC[TP Ladies Secs],1)+1,0)","v":0},"00:30:05","",1805,""]
[null,"Elliott","Lamb",{"$f":"TRIM(XC[[#This Row],[N1]])&\" \"&TRIM(XC[[#This Row],[N2]])","v":"Elliott Lamb"},1,{"$f":"VLOOKUP(XC[[#This Row],[Name]],members,2,0)","v":110},"M",{"$f":"VLOOKUP(XC[[#This Row],[Mem]],Allmembers[],7,FALSE)","v":"MV50"},{"$f":"COUNT(XC[[#This Row],[Royston Race Position]],XC[[#This Row],[Watford Race Position]],XC[[#This Row],[Cheshut place]],XC[[#This Row],[Watford Challenge Place]],XC[[#This Row],[Grovelands place]],XC[[#This Row],[Trent Park Pos]])","v":5},{"$f":"IF(XC[[#This Row],[Gender]]=\"M\",XC[[#This Row],[Royston Mens Points]]+XC[[#This Row],[Watford Mens Points]]+XC[[#This Row],[Cheshunt Mens Points]]+XC[[#This Row],[Watford Challenge Mens Points]]+XC[[#This Row],[Gland Mens Points]]+XC[[#This Row],[Trent Park Mens Points]],XC[[#This Row],[Royston Ladies Points]]+XC[[#This Row],[Waftord Ladies Points]]+XC[[#This Row],[Cheshunt Ladies Point]]+XC[[#This Row],[Watford Challenge Ladies Points]]+XC[[#This Row],[Gland Ladies Points]]+XC[[#This Row],[Trent Park Ladies Points]])","v":202},68,"40:24",{"$f":"IF(XC[[#This Row],[Royston Time2]]>\" \",(HOUR(XC[[#This Row],[Royston Time2]])*3600)+MINUTE(XC[[#This Row],[Royston Time2]])*60+SECOND(XC[[#This Row],[Royston Time2]]),\"\")","v":2424},{"$f":"IFERROR(IF(FIND(\"M\",XC[[#This Row],[Group]])>0,XC[[#This Row],[Royston Seconds]],\"errorif\"),\"\")","v":2424},{"$f":"IFERROR(IF(FIND(\"F\",XC[[#This Row],[Group]])>0,XC[[#This Row],[Royston Seconds]],\"errorif\"),\"\")","v":""},{"$f":"IF(ISNUMBER(XC[[#This Row],[Royston Mens Time]]),50-(RANK(XC[[#This Row],[Royston Mens Time]],XC[Royston Mens Time],1))+1,0)","v":40},{"$f":"IF(ISNUMBER(XC[[#This Row],[Royston Ladies Times]]),50-(RANK(XC[[#This Row],[Royston Ladies Times]],XC[Royston Ladies Times],1))+1,0)","v":0},{"$f":"Hatime(XC[[#This Row],[Royston Time]])","v":"00:40:24"},66,"42:46",{"$f":"IFERROR((HOUR(XC[[#This Row],[Watford Time]])*3600)+MINUTE(XC[[#This Row],[Watford Time]])*60+SECOND(XC[[#This Row],[Watford Time]]),\"\")","v":2566},{"$f":"IFERROR(IF(FIND(\"M\",XC[[#This Row],[Group]])>0,XC[[#This Row],[Watford Seconds]],\"errorif\"),\"\")","v":2566},{"$f":"IFERROR(IF(FIND(\"F\",XC[[#This Row],[Group]])>0,XC[[#This Row],[Watford Seconds]],\"errorif\"),\"\")","v":""},{"$f":"IF(ISNUMBER(XC[[#This Row],[Watford Mens Time]]),50-(RANK(XC[[#This Row],[Watford Mens Time]],XC[Watford Mens Time],1))+1,0)","v":47},{"$f":"IF(ISNUMBER(XC[[#This Row],[Watford  Ladies Time]]),50-(RANK(XC[[#This Row],[Watford  Ladies Time]],XC[Watford  Ladies Time],1))+1,0)","v":0},{"$f":"Hatime(XC[[#This Row],[WTime]])","v":"00:42:46"},"00:35:49",107,{"$f":"(HOUR(XC[[#This Row],[Cheshunt  wtime]])*3600)+MINUTE(XC[[#This Row],[Cheshunt  wtime]])*60+SECOND(XC[[#This Row],[Cheshunt  wtime]])","v":2149},{"$f":"IFERROR(IF(FIND(\"M\",XC[[#This Row],[Group]])>0,XC[[#This Row],[Cheshunt Second]],\"errorif\"),\"\")","v":2149},{"$f":"IFERROR(IF(FIND(\"F\",XC[[#This Row],[Group]])>0,XC[[#This Row],[Cheshunt Second]],\"errorif\"),\"\")","v":""},{"$f":"IF(ISNUMBER(XC[[#This Row],[Cheshunt Mens Time]]),50-(RANK(XC[[#This Row],[Cheshunt Mens Time]],XC[Cheshunt Mens Time],1))+1,0)","v":36},{"$f":"IF(ISNUMBER(XC[[#This Row],[Cheshunt ladies Time]]),50-(RANK(XC[[#This Row],[Cheshunt ladies Time]],XC[Cheshunt ladies Time],1))+1,0)","v":0},null,null,null,null,98,"00:33:30",null,{"$f":"(HOUR(XC[[#This Row],[Grovelands Mens Time]])*3600)+MINUTE(XC[[#This Row],[Grovelands Mens Time]])*60+SECOND(XC[[#This Row],[Grovelands Mens Time]])","v":2010}," ",{"$f":"IF(ISNUMBER(XC[[#This Row],[Glands Mens Secs]]),50-(RANK(XC[[#This Row],[Glands Mens Secs]],XC[Glands Mens Secs],1))+1,0)","v":39},{"$f":"IF(ISNUMBER(XC[[#This Row],[Gland Ladies Secs]]),50-(RANK(XC[[#This Row],[Gland Ladies Secs]],XC[Gland Ladies Secs],1))+1,0)","v":0},75,{"$f":"IF(ISNUMBER(XC[[#This Row],[TP Mens Secs]]),50-_xlfn.RANK.EQ(XC[[#This Row],[TP Mens Secs]],XC[TP Mens Secs],1)+1,0)","v":40},{"$f":"IF(ISNUMBER(XC[[#This Row],[TP Ladies Secs]]),50-_xlfn.RANK.EQ(XC[[#This Row],[TP Ladies Secs]],XC[TP Ladies Secs],1)+1,0)","v":0},"00:33:42","",2022,""]
[null,"Craig","Harper",{"$f":"TRIM(XC[[#This Row],[N1]])&\" \"&TRIM(XC[[#This Row],[N2]])","v":"Craig Harper"},1,{"$f":"VLOOKUP(XC[[#This Row],[Name]],members,2,0)","v":114},"M",{"$f":"VLOOKUP(XC[[#This Row],[Mem]],Allmembers[],7,FALSE)","v":"MS"},{"$f":"COUNT(XC[[#This Row],[Royston Race Position]],XC[[#This Row],[Watford Race Position]],XC[[#This Row],[Cheshut place]],XC[[#This Row],[Watford Challenge Place]],XC[[#This Row],[Grovelands place]],XC[[#This Row],[Trent Park Pos]])","v":2},{"$f":"IF(XC[[#This Row],[Gender]]=\"M\",XC[[#This Row],[Royston Mens Points]]+XC[[#This Row],[Watford Mens Points]]+XC[[#This Row],[Cheshunt Mens Points]]+XC[[#This Row],[Watford Challenge Mens Points]]+XC[[#This Row],[Gland Mens Points]]+XC[[#This Row],[Trent Park Mens Points]],XC[[#This Row],[Royston Ladies Points]]+XC[[#This Row],[Waftord Ladies Points]]+XC[[#This Row],[Cheshunt Ladies Point]]+XC[[#This Row],[Watford Challenge Ladies Points]]+XC[[#This Row],[Gland Ladies Points]]+XC[[#This Row],[Trent Park Ladies Points]])","v":78},null," ",{"$f":"IF(XC[[#This Row],[Royston Time2]]>\" \",(HOUR(XC[[#This Row],[Royston Time2]])*3600)+MINUTE(XC[[#This Row],[Royston Time2]])*60+SECOND(XC[[#This Row],[Royston Time2]]),\"\")","v":""},{"$f":"IFERROR(IF(FIND(\"M\",XC[[#This Row],[Group]])>0,XC[[#This Row],[Royston Seconds]],\"errorif\"),\"\")","v":""},{"$f":"IFERROR(IF(FIND(\"F\",XC[[#This Row],[Group]])>0,XC[[#This Row],[Royston Seconds]],\"errorif\"),\"\")","v":""},0,{"$f":"IF(ISNUMBER(XC[[#This Row],[Royston Ladies Times]]),50-(RANK(XC[[#This Row],[Royston Ladies Times]],XC[Royston Ladies Times],1))+1,0)","v":0}," ",null,null,{"$f":"IFERROR((HOUR(XC[[#This Row],[Watford Time]])*3600)+MINUTE(XC[[#This Row],[Watford Time]])*60+SECOND(XC[[#This Row],[Watford Time]]),\"\")","v":""},{"$f":"IFERROR(IF(FIND(\"M\",XC[[#This Row],[Group]])>0,XC[[#This Row],[Watford Seconds]],\"errorif\"),\"\")","v":""},{"$f":"IFERROR(IF(FIND(\"F\",XC[[#This Row],[Group]])>0,XC[[#This Row],[Watford Seconds]],\"errorif\"),\"\")","v":""},{"$f":"IF(ISNUMBER(XC[[#This Row],[Watford Mens Time]]),50-(RANK(XC[[#This Row],[Watford Mens Time]],XC[Watford Mens Time],1))+1,0)","v":0},null,{"$f":"Hatime(XC[[#This Row],[WTime]])","v":""},"00:34:30",75,{"$f":"(HOUR(XC[[#This Row],[Cheshunt  wtime]])*3600)+MINUTE(XC[[#This Row],[Cheshunt  wtime]])*60+SECOND(XC[[#This Row],[Cheshunt  wtime]])","v":2070},{"$f":"IFERROR(IF(FIND(\"M\",XC[[#This Row],[Group]])>0,XC[[#This Row],[Cheshunt Second]],\"errorif\"),\"\")","v":2070},{"$f":"IFERROR(IF(FIND(\"F\",XC[[#This Row],[Group]])>0,XC[[#This Row],[Cheshunt Second]],\"errorif\"),\"\")","v":""},{"$f":"IF(ISNUMBER(XC[[#This Row],[Cheshunt Mens Time]]),50-(RANK(XC[[#This Row],[Cheshunt Mens Time]],XC[Cheshunt Mens Time],1))+1,0)","v":42},{"$f":"IF(ISNUMBER(XC[[#This Row],[Cheshunt ladies Time]]),50-(RANK(XC[[#This Row],[Cheshunt ladies Time]],XC[Cheshunt ladies Time],1))+1,0)","v":0},null,null,null,null,105,"00:34:00",null,{"$f":"(HOUR(XC[[#This Row],[Grovelands Mens Time]])*3600)+MINUTE(XC[[#This Row],[Grovelands Mens Time]])*60+SECOND(XC[[#This Row],[Grovelands Mens Time]])","v":2040}," ",{"$f":"IF(ISNUMBER(XC[[#This Row],[Glands Mens Secs]]),50-(RANK(XC[[#This Row],[Glands Mens Secs]],XC[Glands Mens Secs],1))+1,0)","v":36},{"$f":"IF(ISNUMBER(XC[[#This Row],[Gland Ladies Secs]]),50-(RANK(XC[[#This Row],[Gland Ladies Secs]],XC[Gland Ladies Secs],1))+1,0)","v":0},"  ",{"$f":"IF(ISNUMBER(XC[[#This Row],[TP Mens Secs]]),50-_xlfn.RANK.EQ(XC[[#This Row],[TP Mens Secs]],XC[TP Mens Secs],1)+1,0)","v":0},{"$f":"IF(ISNUMBER(XC[[#This Row],[TP Ladies Secs]]),50-_xlfn.RANK.EQ(XC[[#This Row],[TP Ladies Secs]],XC[TP Ladies Secs],1)+1,0)","v":0}]
[null,"Karen","Wilkins",{"$f":"TRIM(XC[[#This Row],[N1]])&\" \"&TRIM(XC[[#This Row],[N2]])","v":"Karen Wilkins"},null,{"$f":"VLOOKUP(XC[[#This Row],[Name]],members,2,0)","v":116},"W",{"$f":"VLOOKUP(XC[[#This Row],[Mem]],Allmembers[],7,FALSE)","v":"FV35"},{"$f":"COUNT(XC[[#This Row],[Royston Race Position]],XC[[#This Row],[Watford Race Position]],XC[[#This Row],[Cheshut place]],XC[[#This Row],[Watford Challenge Place]],XC[[#This Row],[Grovelands place]],XC[[#This Row],[Trent Park Pos]])","v":1},{"$f":"IF(XC[[#This Row],[Gender]]=\"M\",XC[[#This Row],[Royston Mens Points]]+XC[[#This Row],[Watford Mens Points]]+XC[[#This Row],[Cheshunt Mens Points]]+XC[[#This Row],[Watford Challenge Mens Points]]+XC[[#This Row],[Gland Mens Points]]+XC[[#This Row],[Trent Park Mens Points]],XC[[#This Row],[Royston Ladies Points]]+XC[[#This Row],[Waftord Ladies Points]]+XC[[#This Row],[Cheshunt Ladies Point]]+XC[[#This Row],[Watford Challenge Ladies Points]]+XC[[#This Row],[Gland Ladies Points]]+XC[[#This Row],[Trent Park Ladies Points]])","v":48},null," ",{"$f":"IF(XC[[#This Row],[Royston Time2]]>\" \",(HOUR(XC[[#This Row],[Royston Time2]])*3600)+MINUTE(XC[[#This Row],[Royston Time2]])*60+SECOND(XC[[#This Row],[Royston Time2]]),\"\")","v":""},null,{"$f":"IFERROR(IF(FIND(\"F\",XC[[#This Row],[Group]])>0,XC[[#This Row],[Royston Seconds]],\"errorif\"),\"\")","v":""},{"$f":"IF(ISNUMBER(XC[[#This Row],[Royston Mens Time]]),50-(RANK(XC[[#This Row],[Royston Mens Time]],XC[Royston Mens Time],1))+1,0)","v":0},{"$f":"IF(ISNUMBER(XC[[#This Row],[Royston Ladies Times]]),50-(RANK(XC[[#This Row],[Royston Ladies Times]],XC[Royston Ladies Times],1))+1,0)","v":0}," ",147,"48:03",{"$f":"IFERROR((HOUR(XC[[#This Row],[Watford Time]])*3600)+MINUTE(XC[[#This Row],[Watford Time]])*60+SECOND(XC[[#This Row],[Watford Time]]),\"\")","v":2883},{"$f":"IFERROR(IF(FIND(\"M\",XC[[#This Row],[Group]])>0,XC[[#This Row],[Watford Seconds]],\"errorif\"),\"\")","v":""},{"$f":"IFERROR(IF(FIND(\"F\",XC[[#This Row],[Group]])>0,XC[[#This Row],[Watford Seconds]],\"errorif\"),\"\")","v":2883},{"$f":"IF(ISNUMBER(XC[[#This Row],[Watford Mens Time]]),50-(RANK(XC[[#This Row],[Watford Mens Time]],XC[Watford Mens Time],1))+1,0)","v":0},{"$f":"IF(ISNUMBER(XC[[#This Row],[Watford  Ladies Time]]),50-(RANK(XC[[#This Row],[Watford  Ladies Time]],XC[Watford  Ladies Time],1))+1,0)","v":48},{"$f":"Hatime(XC[[#This Row],[WTime]])","v":"00:48:03"},null,null," ",{"$f":"IFERROR(IF(FIND(\"M\",XC[[#This Row],[Group]])>0,XC[[#This Row],[Cheshunt Second]],\"errorif\"),\"\")","v":""},{"$f":"IFERROR(IF(FIND(\"F\",XC[[#This Row],[Group]])>0,XC[[#This Row],[Cheshunt Second]],\"errorif\"),\"\")","v":" "},{"$f":"IF(ISNUMBER(XC[[#This Row],[Cheshunt Mens Time]]),50-(RANK(XC[[#This Row],[Cheshunt Mens Time]],XC[Cheshunt Mens Time],1))+1,0)","v":0},{"$f":"IF(ISNUMBER(XC[[#This Row],[Cheshunt ladies Time]]),50-(RANK(XC[[#This Row],[Cheshunt ladies Time]],XC[Cheshunt ladies Time],1))+1,0)","v":0},null,null,null,null,null,null,null," "," ",{"$f":"IF(ISNUMBER(XC[[#This Row],[Glands Mens Secs]]),50-(RANK(XC[[#This Row],[Glands Mens Secs]],XC[Glands Mens Secs],1))+1,0)","v":0},{"$f":"IF(ISNUMBER(XC[[#This Row],[Gland Ladies Secs]]),50-(RANK(XC[[#This Row],[Gland Ladies Secs]],XC[Gland Ladies Secs],1))+1,0)","v":0},"  ",{"$f":"IF(ISNUMBER(XC[[#This Row],[TP Mens Secs]]),50-_xlfn.RANK.EQ(XC[[#This Row],[TP Mens Secs]],XC[TP Mens Secs],1)+1,0)","v":0},{"$f":"IF(ISNUMBER(XC[[#This Row],[TP Ladies Secs]]),50-_xlfn.RANK.EQ(XC[[#This Row],[TP Ladies Secs]],XC[TP Ladies Secs],1)+1,0)","v":0}]
[null,"Louise","Crosby",{"$f":"TRIM(XC[[#This Row],[N1]])&\" \"&TRIM(XC[[#This Row],[N2]])","v":"Louise Crosby"},1,{"$f":"VLOOKUP(XC[[#This Row],[Name]],members,2,0)","v":119},"W",{"$f":"VLOOKUP(XC[[#This Row],[Mem]],Allmembers[],7,FALSE)","v":"FV45"},{"$f":"COUNT(XC[[#This Row],[Royston Race Position]],XC[[#This Row],[Watford Race Position]],XC[[#This Row],[Cheshut place]],XC[[#This Row],[Watford Challenge Place]],XC[[#This Row],[Grovelands place]],XC[[#This Row],[Trent Park Pos]])","v":4},{"$f":"IF(XC[[#This Row],[Gender]]=\"M\",XC[[#This Row],[Royston Mens Points]]+XC[[#This Row],[Watford Mens Points]]+XC[[#This Row],[Cheshunt Mens Points]]+XC[[#This Row],[Watford Challenge Mens Points]]+XC[[#This Row],[Gland Mens Points]]+XC[[#This Row],[Trent Park Mens Points]],XC[[#This Row],[Royston Ladies Points]]+XC[[#This Row],[Waftord Ladies Points]]+XC[[#This Row],[Cheshunt Ladies Point]]+XC[[#This Row],[Watford Challenge Ladies Points]]+XC[[#This Row],[Gland Ladies Points]]+XC[[#This Row],[Trent Park Ladies Points]])","v":181},165,"46:30",{"$f":"IF(XC[[#This Row],[Royston Time2]]>\" \",(HOUR(XC[[#This Row],[Royston Time2]])*3600)+MINUTE(XC[[#This Row],[Royston Time2]])*60+SECOND(XC[[#This Row],[Royston Time2]]),\"\")","v":2790},{"$f":"IFERROR(IF(FIND(\"M\",XC[[#This Row],[Group]])>0,XC[[#This Row],[Royston Seconds]],\"errorif\"),\"\")","v":""},{"$f":"IFERROR(IF(FIND(\"F\",XC[[#This Row],[Group]])>0,XC[[#This Row],[Royston Seconds]],\"errorif\"),\"\")","v":2790},{"$f":"IF(ISNUMBER(XC[[#This Row],[Royston Mens Time]]),50-(RANK(XC[[#This Row],[Royston Mens Time]],XC[Royston Mens Time],1))+1,0)","v":0},{"$f":"IF(ISNUMBER(XC[[#This Row],[Royston Ladies Times]]),50-(RANK(XC[[#This Row],[Royston Ladies Times]],XC[Royston Ladies Times],1))+1,\"\")","v":47},{"$f":"Hatime(XC[[#This Row],[Royston Time]])","v":"00:46:30"},null,null,{"$f":"IFERROR((HOUR(XC[[#This Row],[Watford Time]])*3600)+MINUTE(XC[[#This Row],[Watford Time]])*60+SECOND(XC[[#This Row],[Watford Time]]),\"\")","v":""},{"$f":"IFERROR(IF(FIND(\"M\",XC[[#This Row],[Group]])>0,XC[[#This Row],[Watford Seconds]],\"errorif\"),\"\")","v":""},{"$f":"IFERROR(IF(FIND(\"F\",XC[[#This Row],[Group]])>0,XC[[#This Row],[Watford Seconds]],\"errorif\"),\"\")","v":""},{"$f":"IF(ISNUMBER(XC[[#This Row],[Watford Mens Time]]),50-(RANK(XC[[#This Row],[Watford Mens Time]],XC[Watford Mens Time],1))+1,0)","v":0},{"$f":"IF(ISNUMBER(XC[[#This Row],[Watford  Ladies Time]]),50-(RANK(XC[[#This Row],[Watford  Ladies Time]],XC[Watford  Ladies Time],1))+1,0)","v":0},{"$f":"Hatime(XC[[#This Row],[WTime]])","v":""},"00:43:15",270,{"$f":"(HOUR(XC[[#This Row],[Cheshunt  wtime]])*3600)+MINUTE(XC[[#This Row],[Cheshunt  wtime]])*60+SECOND(XC[[#This Row],[Cheshunt  wtime]])","v":2595},{"$f":"IFERROR(IF(FIND(\"M\",XC[[#This Row],[Group]])>0,XC[[#This Row],[Cheshunt Second]],\"errorif\"),\"\")","v":""},{"$f":"IFERROR(IF(FIND(\"F\",XC[[#This Row],[Group]])>0,XC[[#This Row],[Cheshunt Second]],\"errorif\"),\"\")","v":2595},{"$f":"IF(ISNUMBER(XC[[#This Row],[Cheshunt Mens Time]]),50-(RANK(XC[[#This Row],[Cheshunt Mens Time]],XC[Cheshunt Mens Time],1))+1,0)","v":0},{"$f":"IF(ISNUMBER(XC[[#This Row],[Cheshunt ladies Time]]),50-(RANK(XC[[#This Row],[Cheshunt ladies Time]],XC[Cheshunt ladies Time],1))+1,0)","v":46},null,null,null,null,270,null,"00:41:05"," ",{"$f":"(HOUR(XC[[#This Row],[Grovelands Ladies Time]])*3600)+MINUTE(XC[[#This Row],[Grovelands Ladies Time]])*60+SECOND(XC[[#This Row],[Grovelands Ladies Time]])","v":2465},{"$f":"IF(ISNUMBER(XC[[#This Row],[Glands Mens Secs]]),50-(RANK(XC[[#This Row],[Glands Mens Secs]],XC[Glands Mens Secs],1))+1,0)","v":0},{"$f":"IF(ISNUMBER(XC[[#This Row],[Gland Ladies Secs]]),50-(RANK(XC[[#This Row],[Gland Ladies Secs]],XC[Gland Ladies Secs],1))+1,0)","v":46},231,{"$f":"IF(ISNUMBER(XC[[#This Row],[TP Mens Secs]]),50-_xlfn.RANK.EQ(XC[[#This Row],[TP Mens Secs]],XC[TP Mens Secs],1)+1,0)","v":0},{"$f":"IF(ISNUMBER(XC[[#This Row],[TP Ladies Secs]]),50-_xlfn.RANK.EQ(XC[[#This Row],[TP Ladies Secs]],XC[TP Ladies Secs],1)+1,0)","v":42},"","00:41:05","",2465]
[null,"Brian","Yates",{"$f":"TRIM(XC[[#This Row],[N1]])&\" \"&TRIM(XC[[#This Row],[N2]])","v":"Brian Yates"},1,{"$f":"VLOOKUP(XC[[#This Row],[Name]],members,2,0)","v":120},"M",{"$f":"VLOOKUP(XC[[#This Row],[Mem]],Allmembers[],7,FALSE)","v":"MV60"},{"$f":"COUNT(XC[[#This Row],[Royston Race Position]],XC[[#This Row],[Watford Race Position]],XC[[#This Row],[Cheshut place]],XC[[#This Row],[Watford Challenge Place]],XC[[#This Row],[Grovelands place]],XC[[#This Row],[Trent Park Pos]])","v":6},{"$f":"IF(XC[[#This Row],[Gender]]=\"M\",XC[[#This Row],[Royston Mens Points]]+XC[[#This Row],[Watford Mens Points]]+XC[[#This Row],[Cheshunt Mens Points]]+XC[[#This Row],[Watford Challenge Mens Points]]+XC[[#This Row],[Gland Mens Points]]+XC[[#This Row],[Trent Park Mens Points]],XC[[#This Row],[Royston Ladies Points]]+XC[[#This Row],[Waftord Ladies Points]]+XC[[#This Row],[Cheshunt Ladies Point]]+XC[[#This Row],[Watford Challenge Ladies Points]]+XC[[#This Row],[Gland Ladies Points]]+XC[[#This Row],[Trent Park Ladies Points]])","v":196},314,"63:47",{"$f":"IF(XC[[#This Row],[Royston Time2]]>\" \",(HOUR(XC[[#This Row],[Royston Time2]])*3600)+MINUTE(XC[[#This Row],[Royston Time2]])*60+SECOND(XC[[#This Row],[Royston Time2]]),\"\")","v":3827},{"$f":"IFERROR(IF(FIND(\"M\",XC[[#This Row],[Group]])>0,XC[[#This Row],[Royston Seconds]],\"errorif\"),\"\")","v":3827},{"$f":"IFERROR(IF(FIND(\"F\",XC[[#This Row],[Group]])>0,XC[[#This Row],[Royston Seconds]],\"errorif\"),\"\")","v":""},{"$f":"IF(ISNUMBER(XC[[#This Row],[Royston Mens Time]]),50-(RANK(XC[[#This Row],[Royston Mens Time]],XC[Royston Mens Time],1))+1,0)","v":32},{"$f":"IF(ISNUMBER(XC[[#This Row],[Royston Ladies Times]]),50-(RANK(XC[[#This Row],[Royston Ladies Times]],XC[Royston Ladies Times],1))+1,0)","v":0},{"$f":"Hatime(XC[[#This Row],[Royston Time]])","v":"01:03:47"},289,"65:51",{"$f":"IFERROR((HOUR(XC[[#This Row],[Watford Time]])*3600)+MINUTE(XC[[#This Row],[Watford Time]])*60+SECOND(XC[[#This Row],[Watford Time]]),\"\")","v":3951},{"$f":"IFERROR(IF(FIND(\"M\",XC[[#This Row],[Group]])>0,XC[[#This Row],[Watford Seconds]],\"errorif\"),\"\")","v":3951},{"$f":"IFERROR(IF(FIND(\"F\",XC[[#This Row],[Group]])>0,XC[[#This Row],[Watford Seconds]],\"errorif\"),\"\")","v":""},{"$f":"IF(ISNUMBER(XC[[#This Row],[Watford Mens Time]]),50-(RANK(XC[[#This Row],[Watford Mens Time]],XC[Watford Mens Time],1))+1,0)","v":32},{"$f":"IF(ISNUMBER(XC[[#This Row],[Watford  Ladies Time]]),50-(RANK(XC[[#This Row],[Watford  Ladies Time]],XC[Watford  Ladies Time],1))+1,0)","v":0},{"$f":"Hatime(XC[[#This Row],[WTime]])","v":"01:05:51"},"00:53:04",371,{"$f":"(HOUR(XC[[#This Row],[Cheshunt  wtime]])*3600)+MINUTE(XC[[#This Row],[Cheshunt  wtime]])*60+SECOND(XC[[#This Row],[Cheshunt  wtime]])","v":3184},{"$f":"IFERROR(IF(FIND(\"M\",XC[[#This Row],[Group]])>0,XC[[#This Row],[Cheshunt Second]],\"errorif\"),\"\")","v":3184},{"$f":"IFERROR(IF(FIND(\"F\",XC[[#This Row],[Group]])>0,XC[[#This Row],[Cheshunt Second]],\"errorif\"),\"\")","v":""},{"$f":"IF(ISNUMBER(XC[[#This Row],[Cheshunt Mens Time]]),50-(RANK(XC[[#This Row],[Cheshunt Mens Time]],XC[Cheshunt Mens Time],1))+1,0)","v":26},{"$f":"IF(ISNUMBER(XC[[#This Row],[Cheshunt ladies Time]]),50-(RANK(XC[[#This Row],[Cheshunt ladies Time]],XC[Cheshunt ladies Time],1))+1,0)","v":0},101,46,null,3.4456018518518518E-2,365,"00:47:59",null,{"$f":"(HOUR(XC[[#This Row],[Grovelands Mens Time]])*3600)+MINUTE(XC[[#This Row],[Grovelands Mens Time]])*60+SECOND(XC[[#This Row],[Grovelands Mens Time]])","v":2879}," ",{"$f":"IF(ISNUMBER(XC[[#This Row],[Glands Mens Secs]]),50-(RANK(XC[[#This Row],[Glands Mens Secs]],XC[Glands Mens Secs],1))+1,0)","v":27},{"$f":"IF(ISNUMBER(XC[[#This Row],[Gland Ladies Secs]]),50-(RANK(XC[[#This Row],[Gland Ladies Secs]],XC[Gland Ladies Secs],1))+1,0)","v":0},326,{"$f":"IF(ISNUMBER(XC[[#This Row],[TP Mens Secs]]),50-_xlfn.RANK.EQ(XC[[#This Row],[TP Mens Secs]],XC[TP Mens Secs],1)+1,0)","v":33},{"$f":"IF(ISNUMBER(XC[[#This Row],[TP Ladies Secs]]),50-_xlfn.RANK.EQ(XC[[#This Row],[TP Ladies Secs]],XC[TP Ladies Secs],1)+1,0)","v":0},"00:50:29","",3029,""]
[null,"Richard ","Johnstone",{"$f":"TRIM(XC[[#This Row],[N1]])&\" \"&TRIM(XC[[#This Row],[N2]])","v":"Richard Johnstone"},1,{"$f":"VLOOKUP(XC[[#This Row],[Name]],members,2,0)","v":122},"M",{"$f":"VLOOKUP(XC[[#This Row],[Mem]],Allmembers[],7,FALSE)","v":"MV40"},{"$f":"COUNT(XC[[#This Row],[Royston Race Position]],XC[[#This Row],[Watford Race Position]],XC[[#This Row],[Cheshut place]],XC[[#This Row],[Watford Challenge Place]],XC[[#This Row],[Grovelands place]],XC[[#This Row],[Trent Park Pos]])","v":5},{"$f":"IF(XC[[#This Row],[Gender]]=\"M\",XC[[#This Row],[Royston Mens Points]]+XC[[#This Row],[Watford Mens Points]]+XC[[#This Row],[Cheshunt Mens Points]]+XC[[#This Row],[Watford Challenge Mens Points]]+XC[[#This Row],[Gland Mens Points]]+XC[[#This Row],[Trent Park Mens Points]],XC[[#This Row],[Royston Ladies Points]]+XC[[#This Row],[Waftord Ladies Points]]+XC[[#This Row],[Cheshunt Ladies Point]]+XC[[#This Row],[Watford Challenge Ladies Points]]+XC[[#This Row],[Gland Ladies Points]]+XC[[#This Row],[Trent Park Ladies Points]])","v":195},78,"40:49",{"$f":"IF(XC[[#This Row],[Royston Time2]]>\" \",(HOUR(XC[[#This Row],[Royston Time2]])*3600)+MINUTE(XC[[#This Row],[Royston Time2]])*60+SECOND(XC[[#This Row],[Royston Time2]]),\"\")","v":2449},{"$f":"IFERROR(IF(FIND(\"M\",XC[[#This Row],[Group]])>0,XC[[#This Row],[Royston Seconds]],\"errorif\"),\"\")","v":2449},{"$f":"IFERROR(IF(FIND(\"F\",XC[[#This Row],[Group]])>0,XC[[#This Row],[Royston Seconds]],\"errorif\"),\"\")","v":""},{"$f":"IF(ISNUMBER(XC[[#This Row],[Royston Mens Time]]),50-(RANK(XC[[#This Row],[Royston Mens Time]],XC[Royston Mens Time],1))+1,0)","v":39},{"$f":"IF(ISNUMBER(XC[[#This Row],[Royston Ladies Times]]),50-(RANK(XC[[#This Row],[Royston Ladies Times]],XC[Royston Ladies Times],1))+1,0)","v":0},{"$f":"Hatime(XC[[#This Row],[Royston Time]])","v":"00:40:49"},91,"44:16",{"$f":"IFERROR((HOUR(XC[[#This Row],[Watford Time]])*3600)+MINUTE(XC[[#This Row],[Watford Time]])*60+SECOND(XC[[#This Row],[Watford Time]]),\"\")","v":2656},{"$f":"IFERROR(IF(FIND(\"M\",XC[[#This Row],[Group]])>0,XC[[#This Row],[Watford Seconds]],\"errorif\"),\"\")","v":2656},{"$f":"IFERROR(IF(FIND(\"F\",XC[[#This Row],[Group]])>0,XC[[#This Row],[Watford Seconds]],\"errorif\"),\"\")","v":""},{"$f":"IF(ISNUMBER(XC[[#This Row],[Watford Mens Time]]),50-(RANK(XC[[#This Row],[Watford Mens Time]],XC[Watford Mens Time],1))+1,0)","v":43},{"$f":"IF(ISNUMBER(XC[[#This Row],[Watford  Ladies Time]]),50-(RANK(XC[[#This Row],[Watford  Ladies Time]],XC[Watford  Ladies Time],1))+1,0)","v":0},{"$f":"Hatime(XC[[#This Row],[WTime]])","v":"00:44:16"},"00:35:40",104,{"$f":"(HOUR(XC[[#This Row],[Cheshunt  wtime]])*3600)+MINUTE(XC[[#This Row],[Cheshunt  wtime]])*60+SECOND(XC[[#This Row],[Cheshunt  wtime]])","v":2140},{"$f":"IFERROR(IF(FIND(\"M\",XC[[#This Row],[Group]])>0,XC[[#This Row],[Cheshunt Second]],\"errorif\"),\"\")","v":2140},{"$f":"IFERROR(IF(FIND(\"F\",XC[[#This Row],[Group]])>0,XC[[#This Row],[Cheshunt Second]],\"errorif\"),\"\")","v":""},{"$f":"IF(ISNUMBER(XC[[#This Row],[Cheshunt Mens Time]]),50-(RANK(XC[[#This Row],[Cheshunt Mens Time]],XC[Cheshunt Mens Time],1))+1,0)","v":37},{"$f":"IF(ISNUMBER(XC[[#This Row],[Cheshunt ladies Time]]),50-(RANK(XC[[#This Row],[Cheshunt ladies Time]],XC[Cheshunt ladies Time],1))+1,0)","v":0},null,null,null,null,101,"00:33:36",null,{"$f":"(HOUR(XC[[#This Row],[Grovelands Mens Time]])*3600)+MINUTE(XC[[#This Row],[Grovelands Mens Time]])*60+SECOND(XC[[#This Row],[Grovelands Mens Time]])","v":2016}," ",{"$f":"IF(ISNUMBER(XC[[#This Row],[Glands Mens Secs]]),50-(RANK(XC[[#This Row],[Glands Mens Secs]],XC[Glands Mens Secs],1))+1,0)","v":37},{"$f":"IF(ISNUMBER(XC[[#This Row],[Gland Ladies Secs]]),50-(RANK(XC[[#This Row],[Gland Ladies Secs]],XC[Gland Ladies Secs],1))+1,0)","v":0},77,{"$f":"IF(ISNUMBER(XC[[#This Row],[TP Mens Secs]]),50-_xlfn.RANK.EQ(XC[[#This Row],[TP Mens Secs]],XC[TP Mens Secs],1)+1,0)","v":39},{"$f":"IF(ISNUMBER(XC[[#This Row],[TP Ladies Secs]]),50-_xlfn.RANK.EQ(XC[[#This Row],[TP Ladies Secs]],XC[TP Ladies Secs],1)+1,0)","v":0},"00:33:46","",2026,""]
[null,"Emily","Hooper",{"$f":"TRIM(XC[[#This Row],[N1]])&\" \"&TRIM(XC[[#This Row],[N2]])","v":"Emily Hooper"},null,{"$f":"VLOOKUP(XC[[#This Row],[Name]],members,2,0)","v":138},"W",{"$f":"VLOOKUP(XC[[#This Row],[Mem]],Allmembers[],7,FALSE)","v":"FV35"},{"$f":"COUNT(XC[[#This Row],[Royston Race Position]],XC[[#This Row],[Watford Race Position]],XC[[#This Row],[Cheshut place]],XC[[#This Row],[Watford Challenge Place]],XC[[#This Row],[Grovelands place]],XC[[#This Row],[Trent Park Pos]])","v":1},{"$f":"IF(XC[[#This Row],[Gender]]=\"M\",XC[[#This Row],[Royston Mens Points]]+XC[[#This Row],[Watford Mens Points]]+XC[[#This Row],[Cheshunt Mens Points]]+XC[[#This Row],[Watford Challenge Mens Points]]+XC[[#This Row],[Gland Mens Points]]+XC[[#This Row],[Trent Park Mens Points]],XC[[#This Row],[Royston Ladies Points]]+XC[[#This Row],[Waftord Ladies Points]]+XC[[#This Row],[Cheshunt Ladies Point]]+XC[[#This Row],[Watford Challenge Ladies Points]]+XC[[#This Row],[Gland Ladies Points]]+XC[[#This Row],[Trent Park Ladies Points]])","v":45},null,"  ",{"$f":"IF(XC[[#This Row],[Royston Time2]]>\" \",(HOUR(XC[[#This Row],[Royston Time2]])*3600)+MINUTE(XC[[#This Row],[Royston Time2]])*60+SECOND(XC[[#This Row],[Royston Time2]]),\"\")","v":""},{"$f":"IFERROR(IF(FIND(\"M\",XC[[#This Row],[Group]])>0,XC[[#This Row],[Royston Seconds]],\"errorif\"),\"\")","v":""},{"$f":"IFERROR(IF(FIND(\"F\",XC[[#This Row],[Group]])>0,XC[[#This Row],[Royston Seconds]],\"errorif\"),\"\")","v":""},{"$f":"IF(ISNUMBER(XC[[#This Row],[Royston Mens Time]]),50-(RANK(XC[[#This Row],[Royston Mens Time]],XC[Royston Mens Time],1))+1,0)","v":0},{"$f":"IF(ISNUMBER(XC[[#This Row],[Royston Ladies Times]]),50-(RANK(XC[[#This Row],[Royston Ladies Times]],XC[Royston Ladies Times],1))+1,0)","v":0}," ",null,null,{"$f":"IFERROR((HOUR(XC[[#This Row],[Watford Time]])*3600)+MINUTE(XC[[#This Row],[Watford Time]])*60+SECOND(XC[[#This Row],[Watford Time]]),\"\")","v":""},{"$f":"IFERROR(IF(FIND(\"M\",XC[[#This Row],[Group]])>0,XC[[#This Row],[Watford Seconds]],\"errorif\"),\"\")","v":""},{"$f":"IFERROR(IF(FIND(\"F\",XC[[#This Row],[Group]])>0,XC[[#This Row],[Watford Seconds]],\"errorif\"),\"\")","v":""},{"$f":"IF(ISNUMBER(XC[[#This Row],[Watford Mens Time]]),50-(RANK(XC[[#This Row],[Watford Mens Time]],XC[Watford Mens Time],1))+1,0)","v":0},0,{"$f":"Hatime(XC[[#This Row],[WTime]])","v":""},null,null," ",{"$f":"IFERROR(IF(FIND(\"M\",XC[[#This Row],[Group]])>0,XC[[#This Row],[Cheshunt Second]],\"errorif\"),\"\")","v":""},{"$f":"IFERROR(IF(FIND(\"F\",XC[[#This Row],[Group]])>0,XC[[#This Row],[Cheshunt Second]],\"errorif\"),\"\")","v":" "},{"$f":"IF(ISNUMBER(XC[[#This Row],[Cheshunt Mens Time]]),50-(RANK(XC[[#This Row],[Cheshunt Mens Time]],XC[Cheshunt Mens Time],1))+1,0)","v":0},{"$f":"IF(ISNUMBER(XC[[#This Row],[Cheshunt ladies Time]]),50-(RANK(XC[[#This Row],[Cheshunt ladies Time]],XC[Cheshunt ladies Time],1))+1,0)","v":0},null,null,null,null," "," ",0," "," ",{"$f":"IF(ISNUMBER(XC[[#This Row],[Glands Mens Secs]]),50-(RANK(XC[[#This Row],[Glands Mens Secs]],XC[Glands Mens Secs],1))+1,0)","v":0},{"$f":"IF(ISNUMBER(XC[[#This Row],[Gland Ladies Secs]]),50-(RANK(XC[[#This Row],[Gland Ladies Secs]],XC[Gland Ladies Secs],1))+1,0)","v":0},190,{"$f":"IF(ISNUMBER(XC[[#This Row],[TP Mens Secs]]),50-_xlfn.RANK.EQ(XC[[#This Row],[TP Mens Secs]],XC[TP Mens Secs],1)+1,0)","v":0},{"$f":"IF(ISNUMBER(XC[[#This Row],[TP Ladies Secs]]),50-_xlfn.RANK.EQ(XC[[#This Row],[TP Ladies Secs]],XC[TP Ladies Secs],1)+1,0)","v":45},"","00:38:30","",2310]
[null,"Dawn","Burr",{"$f":"TRIM(XC[[#This Row],[N1]])&\" \"&TRIM(XC[[#This Row],[N2]])","v":"Dawn Burr"},null,{"$f":"VLOOKUP(XC[[#This Row],[Name]],members,2,0)","v":140},"W",{"$f":"VLOOKUP(XC[[#This Row],[Mem]],Allmembers[],7,FALSE)","v":"FV35"},{"$f":"COUNT(XC[[#This Row],[Royston Race Position]],XC[[#This Row],[Watford Race Position]],XC[[#This Row],[Cheshut place]],XC[[#This Row],[Watford Challenge Place]],XC[[#This Row],[Grovelands place]],XC[[#This Row],[Trent Park Pos]])","v":1},{"$f":"IF(XC[[#This Row],[Gender]]=\"M\",XC[[#This Row],[Royston Mens Points]]+XC[[#This Row],[Watford Mens Points]]+XC[[#This Row],[Cheshunt Mens Points]]+XC[[#This Row],[Watford Challenge Mens Points]]+XC[[#This Row],[Gland Mens Points]]+XC[[#This Row],[Trent Park Mens Points]],XC[[#This Row],[Royston Ladies Points]]+XC[[#This Row],[Waftord Ladies Points]]+XC[[#This Row],[Cheshunt Ladies Point]]+XC[[#This Row],[Watford Challenge Ladies Points]]+XC[[#This Row],[Gland Ladies Points]]+XC[[#This Row],[Trent Park Ladies Points]])","v":46},null,"  ",{"$f":"IF(XC[[#This Row],[Royston Time2]]>\" \",(HOUR(XC[[#This Row],[Royston Time2]])*3600)+MINUTE(XC[[#This Row],[Royston Time2]])*60+SECOND(XC[[#This Row],[Royston Time2]]),\"\")","v":""},{"$f":"IFERROR(IF(FIND(\"M\",XC[[#This Row],[Group]])>0,XC[[#This Row],[Royston Seconds]],\"errorif\"),\"\")","v":""},{"$f":"IFERROR(IF(FIND(\"F\",XC[[#This Row],[Group]])>0,XC[[#This Row],[Royston Seconds]],\"errorif\"),\"\")","v":""},{"$f":"IF(ISNUMBER(XC[[#This Row],[Royston Mens Time]]),50-(RANK(XC[[#This Row],[Royston Mens Time]],XC[Royston Mens Time],1))+1,0)","v":0},{"$f":"IF(ISNUMBER(XC[[#This Row],[Royston Ladies Times]]),50-(RANK(XC[[#This Row],[Royston Ladies Times]],XC[Royston Ladies Times],1))+1,0)","v":0}," ",null,null,{"$f":"IFERROR((HOUR(XC[[#This Row],[Watford Time]])*3600)+MINUTE(XC[[#This Row],[Watford Time]])*60+SECOND(XC[[#This Row],[Watford Time]]),\"\")","v":""},{"$f":"IFERROR(IF(FIND(\"M\",XC[[#This Row],[Group]])>0,XC[[#This Row],[Watford Seconds]],\"errorif\"),\"\")","v":""},{"$f":"IFERROR(IF(FIND(\"F\",XC[[#This Row],[Group]])>0,XC[[#This Row],[Watford Seconds]],\"errorif\"),\"\")","v":""},{"$f":"IF(ISNUMBER(XC[[#This Row],[Watford Mens Time]]),50-(RANK(XC[[#This Row],[Watford Mens Time]],XC[Watford Mens Time],1))+1,0)","v":0},0,{"$f":"Hatime(XC[[#This Row],[WTime]])","v":""},null,null," ",{"$f":"IFERROR(IF(FIND(\"M\",XC[[#This Row],[Group]])>0,XC[[#This Row],[Cheshunt Second]],\"errorif\"),\"\")","v":""},{"$f":"IFERROR(IF(FIND(\"F\",XC[[#This Row],[Group]])>0,XC[[#This Row],[Cheshunt Second]],\"errorif\"),\"\")","v":" "},{"$f":"IF(ISNUMBER(XC[[#This Row],[Cheshunt Mens Time]]),50-(RANK(XC[[#This Row],[Cheshunt Mens Time]],XC[Cheshunt Mens Time],1))+1,0)","v":0},{"$f":"IF(ISNUMBER(XC[[#This Row],[Cheshunt ladies Time]]),50-(RANK(XC[[#This Row],[Cheshunt ladies Time]],XC[Cheshunt ladies Time],1))+1,0)","v":0},null,null,null,null,null," ",0," "," ",{"$f":"IF(ISNUMBER(XC[[#This Row],[Glands Mens Secs]]),50-(RANK(XC[[#This Row],[Glands Mens Secs]],XC[Glands Mens Secs],1))+1,0)","v":0},{"$f":"IF(ISNUMBER(XC[[#This Row],[Gland Ladies Secs]]),50-(RANK(XC[[#This Row],[Gland Ladies Secs]],XC[Gland Ladies Secs],1))+1,0)","v":0},185,{"$f":"IF(ISNUMBER(XC[[#This Row],[TP Mens Secs]]),50-_xlfn.RANK.EQ(XC[[#This Row],[TP Mens Secs]],XC[TP Mens Secs],1)+1,0)","v":0},{"$f":"IF(ISNUMBER(XC[[#This Row],[TP Ladies Secs]]),50-_xlfn.RANK.EQ(XC[[#This Row],[TP Ladies Secs]],XC[TP Ladies Secs],1)+1,0)","v":46},"","00:38:22","",2302]
[null,"James","Bentall",{"$f":"TRIM(XC[[#This Row],[N1]])&\" \"&TRIM(XC[[#This Row],[N2]])","v":"James Bentall"},null,{"$f":"VLOOKUP(XC[[#This Row],[Name]],members,2,0)","v":141},"M",{"$f":"VLOOKUP(XC[[#This Row],[Mem]],Allmembers[],7,FALSE)","v":"MV40"},{"$f":"COUNT(XC[[#This Row],[Royston Race Position]],XC[[#This Row],[Watford Race Position]],XC[[#This Row],[Cheshut place]],XC[[#This Row],[Watford Challenge Place]],XC[[#This Row],[Grovelands place]],XC[[#This Row],[Trent Park Pos]])","v":3},{"$f":"IF(XC[[#This Row],[Gender]]=\"M\",XC[[#This Row],[Royston Mens Points]]+XC[[#This Row],[Watford Mens Points]]+XC[[#This Row],[Cheshunt Mens Points]]+XC[[#This Row],[Watford Challenge Mens Points]]+XC[[#This Row],[Gland Mens Points]]+XC[[#This Row],[Trent Park Mens Points]],XC[[#This Row],[Royston Ladies Points]]+XC[[#This Row],[Waftord Ladies Points]]+XC[[#This Row],[Cheshunt Ladies Point]]+XC[[#This Row],[Watford Challenge Ladies Points]]+XC[[#This Row],[Gland Ladies Points]]+XC[[#This Row],[Trent Park Ladies Points]])","v":113},130,"44:02",{"$f":"IF(XC[[#This Row],[Royston Time2]]>\" \",(HOUR(XC[[#This Row],[Royston Time2]])*3600)+MINUTE(XC[[#This Row],[Royston Time2]])*60+SECOND(XC[[#This Row],[Royston Time2]]),\"\")","v":2642},{"$f":"IFERROR(IF(FIND(\"M\",XC[[#This Row],[Group]])>0,XC[[#This Row],[Royston Seconds]],\"errorif\"),\"\")","v":2642},{"$f":"IFERROR(IF(FIND(\"F\",XC[[#This Row],[Group]])>0,XC[[#This Row],[Royston Seconds]],\"errorif\"),\"\")","v":""},{"$f":"IF(ISNUMBER(XC[[#This Row],[Royston Mens Time]]),50-(RANK(XC[[#This Row],[Royston Mens Time]],XC[Royston Mens Time],1))+1,0)","v":36},{"$f":"IF(ISNUMBER(XC[[#This Row],[Royston Ladies Times]]),50-(RANK(XC[[#This Row],[Royston Ladies Times]],XC[Royston Ladies Times],1))+1,0)","v":0},{"$f":"Hatime(XC[[#This Row],[Royston Time]])","v":"00:44:02"},130,"46:57",{"$f":"IFERROR((HOUR(XC[[#This Row],[Watford Time]])*3600)+MINUTE(XC[[#This Row],[Watford Time]])*60+SECOND(XC[[#This Row],[Watford Time]]),\"\")","v":2817},{"$f":"IFERROR(IF(FIND(\"M\",XC[[#This Row],[Group]])>0,XC[[#This Row],[Watford Seconds]],\"errorif\"),\"\")","v":2817},{"$f":"IFERROR(IF(FIND(\"F\",XC[[#This Row],[Group]])>0,XC[[#This Row],[Watford Seconds]],\"errorif\"),\"\")","v":""},{"$f":"IF(ISNUMBER(XC[[#This Row],[Watford Mens Time]]),50-(RANK(XC[[#This Row],[Watford Mens Time]],XC[Watford Mens Time],1))+1,0)","v":40},{"$f":"IF(ISNUMBER(XC[[#This Row],[Watford  Ladies Time]]),50-(RANK(XC[[#This Row],[Watford  Ladies Time]],XC[Watford  Ladies Time],1))+1,0)","v":0},{"$f":"Hatime(XC[[#This Row],[WTime]])","v":"00:46:57"},null,null,null,null,{"$f":"IFERROR(IF(FIND(\"F\",XC[[#This Row],[Group]])>0,XC[[#This Row],[Cheshunt Second]],\"errorif\"),\"\")","v":""},{"$f":"IF(ISNUMBER(XC[[#This Row],[Cheshunt Mens Time]]),50-(RANK(XC[[#This Row],[Cheshunt Mens Time]],XC[Cheshunt Mens Time],1))+1,0)","v":0},{"$f":"IF(ISNUMBER(XC[[#This Row],[Cheshunt ladies Time]]),50-(RANK(XC[[#This Row],[Cheshunt ladies Time]],XC[Cheshunt ladies Time],1))+1,0)","v":0},null,null,null,null,null,null,null," "," ",{"$f":"IF(ISNUMBER(XC[[#This Row],[Glands Mens Secs]]),50-(RANK(XC[[#This Row],[Glands Mens Secs]],XC[Glands Mens Secs],1))+1,0)","v":0},{"$f":"IF(ISNUMBER(XC[[#This Row],[Gland Ladies Secs]]),50-(RANK(XC[[#This Row],[Gland Ladies Secs]],XC[Gland Ladies Secs],1))+1,0)","v":0},118,{"$f":"IF(ISNUMBER(XC[[#This Row],[TP Mens Secs]]),50-_xlfn.RANK.EQ(XC[[#This Row],[TP Mens Secs]],XC[TP Mens Secs],1)+1,0)","v":37},{"$f":"IF(ISNUMBER(XC[[#This Row],[TP Ladies Secs]]),50-_xlfn.RANK.EQ(XC[[#This Row],[TP Ladies Secs]],XC[TP Ladies Secs],1)+1,0)","v":0},"00:35:35","",2135,""]
[null,"Joanne","Richards",{"$f":"TRIM(XC[[#This Row],[N1]])&\" \"&TRIM(XC[[#This Row],[N2]])","v":"Joanne Richards"},null,{"$f":"VLOOKUP(XC[[#This Row],[Name]],members,2,0)","v":149},"W",{"$f":"VLOOKUP(XC[[#This Row],[Mem]],Allmembers[],7,FALSE)","v":"FV35"},{"$f":"COUNT(XC[[#This Row],[Royston Race Position]],XC[[#This Row],[Watford Race Position]],XC[[#This Row],[Cheshut place]],XC[[#This Row],[Watford Challenge Place]],XC[[#This Row],[Grovelands place]],XC[[#This Row],[Trent Park Pos]])","v":4},{"$f":"IF(XC[[#This Row],[Gender]]=\"M\",XC[[#This Row],[Royston Mens Points]]+XC[[#This Row],[Watford Mens Points]]+XC[[#This Row],[Cheshunt Mens Points]]+XC[[#This Row],[Watford Challenge Mens Points]]+XC[[#This Row],[Gland Mens Points]]+XC[[#This Row],[Trent Park Mens Points]],XC[[#This Row],[Royston Ladies Points]]+XC[[#This Row],[Waftord Ladies Points]]+XC[[#This Row],[Cheshunt Ladies Point]]+XC[[#This Row],[Watford Challenge Ladies Points]]+XC[[#This Row],[Gland Ladies Points]]+XC[[#This Row],[Trent Park Ladies Points]])","v":176},287,"57:33",{"$f":"IF(XC[[#This Row],[Royston Time2]]>\" \",(HOUR(XC[[#This Row],[Royston Time2]])*3600)+MINUTE(XC[[#This Row],[Royston Time2]])*60+SECOND(XC[[#This Row],[Royston Time2]]),\"\")","v":3453},{"$f":"IFERROR(IF(FIND(\"M\",XC[[#This Row],[Group]])>0,XC[[#This Row],[Royston Seconds]],\"errorif\"),\"\")","v":""},{"$f":"IFERROR(IF(FIND(\"F\",XC[[#This Row],[Group]])>0,XC[[#This Row],[Royston Seconds]],\"errorif\"),\"\")","v":3453},{"$f":"IF(ISNUMBER(XC[[#This Row],[Royston Mens Time]]),50-(RANK(XC[[#This Row],[Royston Mens Time]],XC[Royston Mens Time],1))+1,0)","v":0},{"$f":"IF(ISNUMBER(XC[[#This Row],[Royston Ladies Times]]),50-(RANK(XC[[#This Row],[Royston Ladies Times]],XC[Royston Ladies Times],1))+1,\"\")","v":42},{"$f":"Hatime(XC[[#This Row],[Royston Time]])","v":"00:57:33"},null,null,{"$f":"IFERROR((HOUR(XC[[#This Row],[Watford Time]])*3600)+MINUTE(XC[[#This Row],[Watford Time]])*60+SECOND(XC[[#This Row],[Watford Time]]),\"\")","v":""},{"$f":"IFERROR(IF(FIND(\"M\",XC[[#This Row],[Group]])>0,XC[[#This Row],[Watford Seconds]],\"errorif\"),\"\")","v":""},{"$f":"IFERROR(IF(FIND(\"F\",XC[[#This Row],[Group]])>0,XC[[#This Row],[Watford Seconds]],\"errorif\"),\"\")","v":""},{"$f":"IF(ISNUMBER(XC[[#This Row],[Watford Mens Time]]),50-(RANK(XC[[#This Row],[Watford Mens Time]],XC[Watford Mens Time],1))+1,0)","v":0},{"$f":"IF(ISNUMBER(XC[[#This Row],[Watford  Ladies Time]]),50-(RANK(XC[[#This Row],[Watford  Ladies Time]],XC[Watford  Ladies Time],1))+1,0)","v":0},{"$f":"Hatime(XC[[#This Row],[WTime]])","v":""},"00:45:17",306,{"$f":"(HOUR(XC[[#This Row],[Cheshunt  wtime]])*3600)+MINUTE(XC[[#This Row],[Cheshunt  wtime]])*60+SECOND(XC[[#This Row],[Cheshunt  wtime]])","v":2717},{"$f":"IFERROR(IF(FIND(\"M\",XC[[#This Row],[Group]])>0,XC[[#This Row],[Cheshunt Second]],\"errorif\"),\"\")","v":""},{"$f":"IFERROR(IF(FIND(\"F\",XC[[#This Row],[Group]])>0,XC[[#This Row],[Cheshunt Second]],\"errorif\"),\"\")","v":2717},{"$f":"IF(ISNUMBER(XC[[#This Row],[Cheshunt Mens Time]]),50-(RANK(XC[[#This Row],[Cheshunt Mens Time]],XC[Cheshunt Mens Time],1))+1,0)","v":0},{"$f":"IF(ISNUMBER(XC[[#This Row],[Cheshunt ladies Time]]),50-(RANK(XC[[#This Row],[Cheshunt ladies Time]],XC[Cheshunt ladies Time],1))+1,0)","v":44},74,null,49,3.019675925925926E-2,null,null,null," "," ",{"$f":"IF(ISNUMBER(XC[[#This Row],[Glands Mens Secs]]),50-(RANK(XC[[#This Row],[Glands Mens Secs]],XC[Glands Mens Secs],1))+1,0)","v":0},{"$f":"IF(ISNUMBER(XC[[#This Row],[Gland Ladies Secs]]),50-(RANK(XC[[#This Row],[Gland Ladies Secs]],XC[Gland Ladies Secs],1))+1,0)","v":0},262,{"$f":"IF(ISNUMBER(XC[[#This Row],[TP Mens Secs]]),50-_xlfn.RANK.EQ(XC[[#This Row],[TP Mens Secs]],XC[TP Mens Secs],1)+1,0)","v":0},{"$f":"IF(ISNUMBER(XC[[#This Row],[TP Ladies Secs]]),50-_xlfn.RANK.EQ(XC[[#This Row],[TP Ladies Secs]],XC[TP Ladies Secs],1)+1,0)","v":41},"","00:43:11","",2591]
[null,"Richard ","Bruce",{"$f":"TRIM(XC[[#This Row],[N1]])&\" \"&TRIM(XC[[#This Row],[N2]])","v":"Richard Bruce"},1,{"$f":"VLOOKUP(XC[[#This Row],[Name]],members,2,0)","v":152},"M",{"$f":"VLOOKUP(XC[[#This Row],[Mem]],Allmembers[],7,FALSE)","v":"MV40"},{"$f":"COUNT(XC[[#This Row],[Royston Race Position]],XC[[#This Row],[Watford Race Position]],XC[[#This Row],[Cheshut place]],XC[[#This Row],[Watford Challenge Place]],XC[[#This Row],[Grovelands place]],XC[[#This Row],[Trent Park Pos]])","v":2},{"$f":"IF(XC[[#This Row],[Gender]]=\"M\",XC[[#This Row],[Royston Mens Points]]+XC[[#This Row],[Watford Mens Points]]+XC[[#This Row],[Cheshunt Mens Points]]+XC[[#This Row],[Watford Challenge Mens Points]]+XC[[#This Row],[Gland Mens Points]]+XC[[#This Row],[Trent Park Mens Points]],XC[[#This Row],[Royston Ladies Points]]+XC[[#This Row],[Waftord Ladies Points]]+XC[[#This Row],[Cheshunt Ladies Point]]+XC[[#This Row],[Watford Challenge Ladies Points]]+XC[[#This Row],[Gland Ladies Points]]+XC[[#This Row],[Trent Park Ladies Points]])","v":93},null," ",{"$f":"IF(XC[[#This Row],[Royston Time2]]>\" \",(HOUR(XC[[#This Row],[Royston Time2]])*3600)+MINUTE(XC[[#This Row],[Royston Time2]])*60+SECOND(XC[[#This Row],[Royston Time2]]),\"\")","v":""},{"$f":"IFERROR(IF(FIND(\"M\",XC[[#This Row],[Group]])>0,XC[[#This Row],[Royston Seconds]],\"errorif\"),\"\")","v":""},{"$f":"IFERROR(IF(FIND(\"F\",XC[[#This Row],[Group]])>0,XC[[#This Row],[Royston Seconds]],\"errorif\"),\"\")","v":""},0,{"$f":"IF(ISNUMBER(XC[[#This Row],[Royston Ladies Times]]),50-(RANK(XC[[#This Row],[Royston Ladies Times]],XC[Royston Ladies Times],1))+1,0)","v":0}," ",null,null,{"$f":"IFERROR((HOUR(XC[[#This Row],[Watford Time]])*3600)+MINUTE(XC[[#This Row],[Watford Time]])*60+SECOND(XC[[#This Row],[Watford Time]]),\"\")","v":""},{"$f":"IFERROR(IF(FIND(\"M\",XC[[#This Row],[Group]])>0,XC[[#This Row],[Watford Seconds]],\"errorif\"),\"\")","v":""},{"$f":"IFERROR(IF(FIND(\"F\",XC[[#This Row],[Group]])>0,XC[[#This Row],[Watford Seconds]],\"errorif\"),\"\")","v":""},{"$f":"IF(ISNUMBER(XC[[#This Row],[Watford Mens Time]]),50-(RANK(XC[[#This Row],[Watford Mens Time]],XC[Watford Mens Time],1))+1,0)","v":0},null,{"$f":"Hatime(XC[[#This Row],[WTime]])","v":""},null,null," "," ",{"$f":"IFERROR(IF(FIND(\"F\",XC[[#This Row],[Group]])>0,XC[[#This Row],[Cheshunt Second]],\"errorif\"),\"\")","v":""},{"$f":"IF(ISNUMBER(XC[[#This Row],[Cheshunt Mens Time]]),50-(RANK(XC[[#This Row],[Cheshunt Mens Time]],XC[Cheshunt Mens Time],1))+1,0)","v":0},{"$f":"IF(ISNUMBER(XC[[#This Row],[Cheshunt ladies Time]]),50-(RANK(XC[[#This Row],[Cheshunt ladies Time]],XC[Cheshunt ladies Time],1))+1,0)","v":0},14,48,null,2.3460648148148147E-2,55,"00:31:41",null,{"$f":"(HOUR(XC[[#This Row],[Grovelands Mens Time]])*3600)+MINUTE(XC[[#This Row],[Grovelands Mens Time]])*60+SECOND(XC[[#This Row],[Grovelands Mens Time]])","v":1901}," ",{"$f":"IF(ISNUMBER(XC[[#This Row],[Glands Mens Secs]]),50-(RANK(XC[[#This Row],[Glands Mens Secs]],XC[Glands Mens Secs],1))+1,0)","v":45},{"$f":"IF(ISNUMBER(XC[[#This Row],[Gland Ladies Secs]]),50-(RANK(XC[[#This Row],[Gland Ladies Secs]],XC[Gland Ladies Secs],1))+1,0)","v":0},"  ",{"$f":"IF(ISNUMBER(XC[[#This Row],[TP Mens Secs]]),50-_xlfn.RANK.EQ(XC[[#This Row],[TP Mens Secs]],XC[TP Mens Secs],1)+1,0)","v":0},{"$f":"IF(ISNUMBER(XC[[#This Row],[TP Ladies Secs]]),50-_xlfn.RANK.EQ(XC[[#This Row],[TP Ladies Secs]],XC[TP Ladies Secs],1)+1,0)","v":0}]
[null,"Ian","Long",{"$f":"TRIM(XC[[#This Row],[N1]])&\" \"&TRIM(XC[[#This Row],[N2]])","v":"Ian Long"},null,{"$f":"VLOOKUP(XC[[#This Row],[Name]],members,2,0)","v":167},"M",{"$f":"VLOOKUP(XC[[#This Row],[Mem]],Allmembers[],7,FALSE)","v":"MV40"},{"$f":"COUNT(XC[[#This Row],[Royston Race Position]],XC[[#This Row],[Watford Race Position]],XC[[#This Row],[Cheshut place]],XC[[#This Row],[Watford Challenge Place]],XC[[#This Row],[Grovelands place]],XC[[#This Row],[Trent Park Pos]])","v":2},{"$f":"IF(XC[[#This Row],[Gender]]=\"M\",XC[[#This Row],[Royston Mens Points]]+XC[[#This Row],[Watford Mens Points]]+XC[[#This Row],[Cheshunt Mens Points]]+XC[[#This Row],[Watford Challenge Mens Points]]+XC[[#This Row],[Gland Mens Points]]+XC[[#This Row],[Trent Park Mens Points]],XC[[#This Row],[Royston Ladies Points]]+XC[[#This Row],[Waftord Ladies Points]]+XC[[#This Row],[Cheshunt Ladies Point]]+XC[[#This Row],[Watford Challenge Ladies Points]]+XC[[#This Row],[Gland Ladies Points]]+XC[[#This Row],[Trent Park Ladies Points]])","v":70},134,"44:27",{"$f":"IF(XC[[#This Row],[Royston Time2]]>\" \",(HOUR(XC[[#This Row],[Royston Time2]])*3600)+MINUTE(XC[[#This Row],[Royston Time2]])*60+SECOND(XC[[#This Row],[Royston Time2]]),\"\")","v":2667},{"$f":"IFERROR(IF(FIND(\"M\",XC[[#This Row],[Group]])>0,XC[[#This Row],[Royston Seconds]],\"errorif\"),\"\")","v":2667},{"$f":"IFERROR(IF(FIND(\"F\",XC[[#This Row],[Group]])>0,XC[[#This Row],[Royston Seconds]],\"errorif\"),\"\")","v":""},{"$f":"IF(ISNUMBER(XC[[#This Row],[Royston Mens Time]]),50-(RANK(XC[[#This Row],[Royston Mens Time]],XC[Royston Mens Time],1))+1,0)","v":35},{"$f":"IF(ISNUMBER(XC[[#This Row],[Royston Ladies Times]]),50-(RANK(XC[[#This Row],[Royston Ladies Times]],XC[Royston Ladies Times],1))+1,0)","v":0},{"$f":"Hatime(XC[[#This Row],[Royston Time]])","v":"00:44:27"},203,"52:13",{"$f":"IFERROR((HOUR(XC[[#This Row],[Watford Time]])*3600)+MINUTE(XC[[#This Row],[Watford Time]])*60+SECOND(XC[[#This Row],[Watford Time]]),\"\")","v":3133},{"$f":"IFERROR(IF(FIND(\"M\",XC[[#This Row],[Group]])>0,XC[[#This Row],[Watford Seconds]],\"errorif\"),\"\")","v":3133},{"$f":"IFERROR(IF(FIND(\"F\",XC[[#This Row],[Group]])>0,XC[[#This Row],[Watford Seconds]],\"errorif\"),\"\")","v":""},{"$f":"IF(ISNUMBER(XC[[#This Row],[Watford Mens Time]]),50-(RANK(XC[[#This Row],[Watford Mens Time]],XC[Watford Mens Time],1))+1,0)","v":35},{"$f":"IF(ISNUMBER(XC[[#This Row],[Watford  Ladies Time]]),50-(RANK(XC[[#This Row],[Watford  Ladies Time]],XC[Watford  Ladies Time],1))+1,0)","v":0},{"$f":"Hatime(XC[[#This Row],[WTime]])","v":"00:52:13"},null,null,null,null,{"$f":"IFERROR(IF(FIND(\"F\",XC[[#This Row],[Group]])>0,XC[[#This Row],[Cheshunt Second]],\"errorif\"),\"\")","v":""},{"$f":"IF(ISNUMBER(XC[[#This Row],[Cheshunt Mens Time]]),50-(RANK(XC[[#This Row],[Cheshunt Mens Time]],XC[Cheshunt Mens Time],1))+1,0)","v":0},{"$f":"IF(ISNUMBER(XC[[#This Row],[Cheshunt ladies Time]]),50-(RANK(XC[[#This Row],[Cheshunt ladies Time]],XC[Cheshunt ladies Time],1))+1,0)","v":0},null,null,null,null,null,null,null," "," ",{"$f":"IF(ISNUMBER(XC[[#This Row],[Glands Mens Secs]]),50-(RANK(XC[[#This Row],[Glands Mens Secs]],XC[Glands Mens Secs],1))+1,0)","v":0},{"$f":"IF(ISNUMBER(XC[[#This Row],[Gland Ladies Secs]]),50-(RANK(XC[[#This Row],[Gland Ladies Secs]],XC[Gland Ladies Secs],1))+1,0)","v":0},"  ",{"$f":"IF(ISNUMBER(XC[[#This Row],[TP Mens Secs]]),50-_xlfn.RANK.EQ(XC[[#This Row],[TP Mens Secs]],XC[TP Mens Secs],1)+1,0)","v":0},{"$f":"IF(ISNUMBER(XC[[#This Row],[TP Ladies Secs]]),50-_xlfn.RANK.EQ(XC[[#This Row],[TP Ladies Secs]],XC[TP Ladies Secs],1)+1,0)","v":0}]
[null,"Julia","Scott","Joolz Scott",null,178,"W",{"$f":"VLOOKUP(XC[[#This Row],[Mem]],Allmembers[],7,FALSE)","v":"FV45"},{"$f":"COUNT(XC[[#This Row],[Royston Race Position]],XC[[#This Row],[Watford Race Position]],XC[[#This Row],[Cheshut place]],XC[[#This Row],[Watford Challenge Place]],XC[[#This Row],[Grovelands place]],XC[[#This Row],[Trent Park Pos]])","v":1},{"$f":"IF(XC[[#This Row],[Gender]]=\"M\",XC[[#This Row],[Royston Mens Points]]+XC[[#This Row],[Watford Mens Points]]+XC[[#This Row],[Cheshunt Mens Points]]+XC[[#This Row],[Watford Challenge Mens Points]]+XC[[#This Row],[Gland Mens Points]]+XC[[#This Row],[Trent Park Mens Points]],XC[[#This Row],[Royston Ladies Points]]+XC[[#This Row],[Waftord Ladies Points]]+XC[[#This Row],[Cheshunt Ladies Point]]+XC[[#This Row],[Watford Challenge Ladies Points]]+XC[[#This Row],[Gland Ladies Points]]+XC[[#This Row],[Trent Park Ladies Points]])","v":46},223,"51:17",{"$f":"IF(XC[[#This Row],[Royston Time2]]>\" \",(HOUR(XC[[#This Row],[Royston Time2]])*3600)+MINUTE(XC[[#This Row],[Royston Time2]])*60+SECOND(XC[[#This Row],[Royston Time2]]),\"\")","v":3077},{"$f":"IFERROR(IF(FIND(\"M\",XC[[#This Row],[Group]])>0,XC[[#This Row],[Royston Seconds]],\"errorif\"),\"\")","v":""},{"$f":"IFERROR(IF(FIND(\"F\",XC[[#This Row],[Group]])>0,XC[[#This Row],[Royston Seconds]],\"errorif\"),\"\")","v":3077},{"$f":"IF(ISNUMBER(XC[[#This Row],[Royston Mens Time]]),50-(RANK(XC[[#This Row],[Royston Mens Time]],XC[Royston Mens Time],1))+1,0)","v":0},{"$f":"IF(ISNUMBER(XC[[#This Row],[Royston Ladies Times]]),50-(RANK(XC[[#This Row],[Royston Ladies Times]],XC[Royston Ladies Times],1))+1,\"\")","v":46},{"$f":"Hatime(XC[[#This Row],[Royston Time]])","v":"00:51:17"},null,null,{"$f":"IFERROR((HOUR(XC[[#This Row],[Watford Time]])*3600)+MINUTE(XC[[#This Row],[Watford Time]])*60+SECOND(XC[[#This Row],[Watford Time]]),\"\")","v":""},{"$f":"IFERROR(IF(FIND(\"M\",XC[[#This Row],[Group]])>0,XC[[#This Row],[Watford Seconds]],\"errorif\"),\"\")","v":""},{"$f":"IFERROR(IF(FIND(\"F\",XC[[#This Row],[Group]])>0,XC[[#This Row],[Watford Seconds]],\"errorif\"),\"\")","v":""},{"$f":"IF(ISNUMBER(XC[[#This Row],[Watford Mens Time]]),50-(RANK(XC[[#This Row],[Watford Mens Time]],XC[Watford Mens Time],1))+1,0)","v":0},{"$f":"IF(ISNUMBER(XC[[#This Row],[Watford  Ladies Time]]),50-(RANK(XC[[#This Row],[Watford  Ladies Time]],XC[Watford  Ladies Time],1))+1,0)","v":0},{"$f":"Hatime(XC[[#This Row],[WTime]])","v":""},null,null,null,{"$f":"IFERROR(IF(FIND(\"M\",XC[[#This Row],[Group]])>0,XC[[#This Row],[Cheshunt Second]],\"errorif\"),\"\")","v":""}," ",{"$f":"IF(ISNUMBER(XC[[#This Row],[Cheshunt Mens Time]]),50-(RANK(XC[[#This Row],[Cheshunt Mens Time]],XC[Cheshunt Mens Time],1))+1,0)","v":0},{"$f":"IF(ISNUMBER(XC[[#This Row],[Cheshunt ladies Time]]),50-(RANK(XC[[#This Row],[Cheshunt ladies Time]],XC[Cheshunt ladies Time],1))+1,0)","v":0},null,null,null,null,null,null,null," "," ",{"$f":"IF(ISNUMBER(XC[[#This Row],[Glands Mens Secs]]),50-(RANK(XC[[#This Row],[Glands Mens Secs]],XC[Glands Mens Secs],1))+1,0)","v":0},{"$f":"IF(ISNUMBER(XC[[#This Row],[Gland Ladies Secs]]),50-(RANK(XC[[#This Row],[Gland Ladies Secs]],XC[Gland Ladies Secs],1))+1,0)","v":0},"  ",{"$f":"IF(ISNUMBER(XC[[#This Row],[TP Mens Secs]]),50-_xlfn.RANK.EQ(XC[[#This Row],[TP Mens Secs]],XC[TP Mens Secs],1)+1,0)","v":0},{"$f":"IF(ISNUMBER(XC[[#This Row],[TP Ladies Secs]]),50-_xlfn.RANK.EQ(XC[[#This Row],[TP Ladies Secs]],XC[TP Ladies Secs],1)+1,0)","v":0}]
[null,"John","Rowlands","John Rowlands",1,{"$f":"VLOOKUP(XC[[#This Row],[Name]],members,2,0)","v":185},"M",{"$f":"VLOOKUP(XC[[#This Row],[Mem]],Allmembers[],7,FALSE)","v":"MV60"},{"$f":"COUNT(XC[[#This Row],[Royston Race Position]],XC[[#This Row],[Watford Race Position]],XC[[#This Row],[Cheshut place]],XC[[#This Row],[Watford Challenge Place]],XC[[#This Row],[Grovelands place]],XC[[#This Row],[Trent Park Pos]])","v":1},{"$f":"IF(XC[[#This Row],[Gender]]=\"M\",XC[[#This Row],[Royston Mens Points]]+XC[[#This Row],[Watford Mens Points]]+XC[[#This Row],[Cheshunt Mens Points]]+XC[[#This Row],[Watford Challenge Mens Points]]+XC[[#This Row],[Gland Mens Points]]+XC[[#This Row],[Trent Park Mens Points]],XC[[#This Row],[Royston Ladies Points]]+XC[[#This Row],[Waftord Ladies Points]]+XC[[#This Row],[Cheshunt Ladies Point]]+XC[[#This Row],[Watford Challenge Ladies Points]]+XC[[#This Row],[Gland Ladies Points]]+XC[[#This Row],[Trent Park Ladies Points]])","v":28},null,"  ",{"$f":"IF(XC[[#This Row],[Royston Time2]]>\" \",(HOUR(XC[[#This Row],[Royston Time2]])*3600)+MINUTE(XC[[#This Row],[Royston Time2]])*60+SECOND(XC[[#This Row],[Royston Time2]]),\"\")","v":""},{"$f":"IFERROR(IF(FIND(\"M\",XC[[#This Row],[Group]])>0,XC[[#This Row],[Royston Seconds]],\"errorif\"),\"\")","v":""},{"$f":"IFERROR(IF(FIND(\"F\",XC[[#This Row],[Group]])>0,XC[[#This Row],[Royston Seconds]],\"errorif\"),\"\")","v":""},0,{"$f":"IF(ISNUMBER(XC[[#This Row],[Royston Ladies Times]]),50-(RANK(XC[[#This Row],[Royston Ladies Times]],XC[Royston Ladies Times],1))+1,0)","v":0}," ",null,null,{"$f":"IFERROR((HOUR(XC[[#This Row],[Watford Time]])*3600)+MINUTE(XC[[#This Row],[Watford Time]])*60+SECOND(XC[[#This Row],[Watford Time]]),\"\")","v":""},{"$f":"IFERROR(IF(FIND(\"M\",XC[[#This Row],[Group]])>0,XC[[#This Row],[Watford Seconds]],\"errorif\"),\"\")","v":""},{"$f":"IFERROR(IF(FIND(\"F\",XC[[#This Row],[Group]])>0,XC[[#This Row],[Watford Seconds]],\"errorif\"),\"\")","v":""},{"$f":"IF(ISNUMBER(XC[[#This Row],[Watford Mens Time]]),50-(RANK(XC[[#This Row],[Watford Mens Time]],XC[Watford Mens Time],1))+1,0)","v":0},null,{"$f":"Hatime(XC[[#This Row],[WTime]])","v":""},null,null," "," ",{"$f":"IFERROR(IF(FIND(\"F\",XC[[#This Row],[Group]])>0,XC[[#This Row],[Cheshunt Second]],\"errorif\"),\"\")","v":""},{"$f":"IF(ISNUMBER(XC[[#This Row],[Cheshunt Mens Time]]),50-(RANK(XC[[#This Row],[Cheshunt Mens Time]],XC[Cheshunt Mens Time],1))+1,0)","v":0},{"$f":"IF(ISNUMBER(XC[[#This Row],[Cheshunt ladies Time]]),50-(RANK(XC[[#This Row],[Cheshunt ladies Time]],XC[Cheshunt ladies Time],1))+1,0)","v":0},null,null,null,null,304,"00:42:50",null,{"$f":"(HOUR(XC[[#This Row],[Grovelands Mens Time]])*3600)+MINUTE(XC[[#This Row],[Grovelands Mens Time]])*60+SECOND(XC[[#This Row],[Grovelands Mens Time]])","v":2570}," ",{"$f":"IF(ISNUMBER(XC[[#This Row],[Glands Mens Secs]]),50-(RANK(XC[[#This Row],[Glands Mens Secs]],XC[Glands Mens Secs],1))+1,0)","v":28},{"$f":"IF(ISNUMBER(XC[[#This Row],[Gland Ladies Secs]]),50-(RANK(XC[[#This Row],[Gland Ladies Secs]],XC[Gland Ladies Secs],1))+1,0)","v":0},"  ",{"$f":"IF(ISNUMBER(XC[[#This Row],[TP Mens Secs]]),50-_xlfn.RANK.EQ(XC[[#This Row],[TP Mens Secs]],XC[TP Mens Secs],1)+1,0)","v":0},{"$f":"IF(ISNUMBER(XC[[#This Row],[TP Ladies Secs]]),50-_xlfn.RANK.EQ(XC[[#This Row],[TP Ladies Secs]],XC[TP Ladies Secs],1)+1,0)","v":0}]
[null,"Ben","Turner",{"$f":"TRIM(XC[[#This Row],[N1]])&\" \"&TRIM(XC[[#This Row],[N2]])","v":"Ben Turner"},null,{"$f":"VLOOKUP(XC[[#This Row],[Name]],members,2,0)","v":189},"M",{"$f":"VLOOKUP(XC[[#This Row],[Mem]],Allmembers[],7,FALSE)","v":"MV40"},{"$f":"COUNT(XC[[#This Row],[Royston Race Position]],XC[[#This Row],[Watford Race Position]],XC[[#This Row],[Cheshut place]],XC[[#This Row],[Watford Challenge Place]],XC[[#This Row],[Grovelands place]],XC[[#This Row],[Trent Park Pos]])","v":1},{"$f":"IF(XC[[#This Row],[Gender]]=\"M\",XC[[#This Row],[Royston Mens Points]]+XC[[#This Row],[Watford Mens Points]]+XC[[#This Row],[Cheshunt Mens Points]]+XC[[#This Row],[Watford Challenge Mens Points]]+XC[[#This Row],[Gland Mens Points]]+XC[[#This Row],[Trent Park Mens Points]],XC[[#This Row],[Royston Ladies Points]]+XC[[#This Row],[Waftord Ladies Points]]+XC[[#This Row],[Cheshunt Ladies Point]]+XC[[#This Row],[Watford Challenge Ladies Points]]+XC[[#This Row],[Gland Ladies Points]]+XC[[#This Row],[Trent Park Ladies Points]])","v":31},null," ",{"$f":"IF(XC[[#This Row],[Royston Time2]]>\" \",(HOUR(XC[[#This Row],[Royston Time2]])*3600)+MINUTE(XC[[#This Row],[Royston Time2]])*60+SECOND(XC[[#This Row],[Royston Time2]]),\"\")","v":""},{"$f":"IFERROR(IF(FIND(\"M\",XC[[#This Row],[Group]])>0,XC[[#This Row],[Royston Seconds]],\"errorif\"),\"\")","v":""},{"$f":"IFERROR(IF(FIND(\"F\",XC[[#This Row],[Group]])>0,XC[[#This Row],[Royston Seconds]],\"errorif\"),\"\")","v":""},0,{"$f":"IF(ISNUMBER(XC[[#This Row],[Royston Ladies Times]]),50-(RANK(XC[[#This Row],[Royston Ladies Times]],XC[Royston Ladies Times],1))+1,0)","v":0}," ",null,null,{"$f":"IFERROR((HOUR(XC[[#This Row],[Watford Time]])*3600)+MINUTE(XC[[#This Row],[Watford Time]])*60+SECOND(XC[[#This Row],[Watford Time]]),\"\")","v":""},{"$f":"IFERROR(IF(FIND(\"M\",XC[[#This Row],[Group]])>0,XC[[#This Row],[Watford Seconds]],\"errorif\"),\"\")","v":""},{"$f":"IFERROR(IF(FIND(\"F\",XC[[#This Row],[Group]])>0,XC[[#This Row],[Watford Seconds]],\"errorif\"),\"\")","v":""},{"$f":"IF(ISNUMBER(XC[[#This Row],[Watford Mens Time]]),50-(RANK(XC[[#This Row],[Watford Mens Time]],XC[Watford Mens Time],1))+1,0)","v":0},null,{"$f":"Hatime(XC[[#This Row],[WTime]])","v":""},"00:38:50",177,{"$f":"(HOUR(XC[[#This Row],[Cheshunt  wtime]])*3600)+MINUTE(XC[[#This Row],[Cheshunt  wtime]])*60+SECOND(XC[[#This Row],[Cheshunt  wtime]])","v":2330},{"$f":"IFERROR(IF(FIND(\"M\",XC[[#This Row],[Group]])>0,XC[[#This Row],[Cheshunt Second]],\"errorif\"),\"\")","v":2330},{"$f":"IFERROR(IF(FIND(\"F\",XC[[#This Row],[Group]])>0,XC[[#This Row],[Cheshunt Second]],\"errorif\"),\"\")","v":""},{"$f":"IF(ISNUMBER(XC[[#This Row],[Cheshunt Mens Time]]),50-(RANK(XC[[#This Row],[Cheshunt Mens Time]],XC[Cheshunt Mens Time],1))+1,0)","v":31},{"$f":"IF(ISNUMBER(XC[[#This Row],[Cheshunt ladies Time]]),50-(RANK(XC[[#This Row],[Cheshunt ladies Time]],XC[Cheshunt ladies Time],1))+1,0)","v":0},null,null,null,null,null,null,null," "," ",{"$f":"IF(ISNUMBER(XC[[#This Row],[Glands Mens Secs]]),50-(RANK(XC[[#This Row],[Glands Mens Secs]],XC[Glands Mens Secs],1))+1,0)","v":0},{"$f":"IF(ISNUMBER(XC[[#This Row],[Gland Ladies Secs]]),50-(RANK(XC[[#This Row],[Gland Ladies Secs]],XC[Gland Ladies Secs],1))+1,0)","v":0},"  ",{"$f":"IF(ISNUMBER(XC[[#This Row],[TP Mens Secs]]),50-_xlfn.RANK.EQ(XC[[#This Row],[TP Mens Secs]],XC[TP Mens Secs],1)+1,0)","v":0},{"$f":"IF(ISNUMBER(XC[[#This Row],[TP Ladies Secs]]),50-_xlfn.RANK.EQ(XC[[#This Row],[TP Ladies Secs]],XC[TP Ladies Secs],1)+1,0)","v":0}]
[null,"Paul","Savage",{"$f":"TRIM(XC[[#This Row],[N1]])&\" \"&TRIM(XC[[#This Row],[N2]])","v":"Paul Savage"},1,{"$f":"VLOOKUP(XC[[#This Row],[Name]],members,2,0)","v":192},"M",{"$f":"VLOOKUP(XC[[#This Row],[Mem]],Allmembers[],7,FALSE)","v":"MV40"},{"$f":"COUNT(XC[[#This Row],[Royston Race Position]],XC[[#This Row],[Watford Race Position]],XC[[#This Row],[Cheshut place]],XC[[#This Row],[Watford Challenge Place]],XC[[#This Row],[Grovelands place]],XC[[#This Row],[Trent Park Pos]])","v":5},{"$f":"IF(XC[[#This Row],[Gender]]=\"M\",XC[[#This Row],[Royston Mens Points]]+XC[[#This Row],[Watford Mens Points]]+XC[[#This Row],[Cheshunt Mens Points]]+XC[[#This Row],[Watford Challenge Mens Points]]+XC[[#This Row],[Gland Mens Points]]+XC[[#This Row],[Trent Park Mens Points]],XC[[#This Row],[Royston Ladies Points]]+XC[[#This Row],[Waftord Ladies Points]]+XC[[#This Row],[Cheshunt Ladies Point]]+XC[[#This Row],[Watford Challenge Ladies Points]]+XC[[#This Row],[Gland Ladies Points]]+XC[[#This Row],[Trent Park Ladies Points]])","v":184},112,"42:31",{"$f":"IF(XC[[#This Row],[Royston Time2]]>\" \",(HOUR(XC[[#This Row],[Royston Time2]])*3600)+MINUTE(XC[[#This Row],[Royston Time2]])*60+SECOND(XC[[#This Row],[Royston Time2]]),\"\")","v":2551},{"$f":"IFERROR(IF(FIND(\"M\",XC[[#This Row],[Group]])>0,XC[[#This Row],[Royston Seconds]],\"errorif\"),\"\")","v":2551},{"$f":"IFERROR(IF(FIND(\"F\",XC[[#This Row],[Group]])>0,XC[[#This Row],[Royston Seconds]],\"errorif\"),\"\")","v":""},{"$f":"IF(ISNUMBER(XC[[#This Row],[Royston Mens Time]]),50-(RANK(XC[[#This Row],[Royston Mens Time]],XC[Royston Mens Time],1))+1,0)","v":37},{"$f":"IF(ISNUMBER(XC[[#This Row],[Royston Ladies Times]]),50-(RANK(XC[[#This Row],[Royston Ladies Times]],XC[Royston Ladies Times],1))+1,0)","v":0},{"$f":"Hatime(XC[[#This Row],[Royston Time]])","v":"00:42:31"},107,"45:15",{"$f":"IFERROR((HOUR(XC[[#This Row],[Watford Time]])*3600)+MINUTE(XC[[#This Row],[Watford Time]])*60+SECOND(XC[[#This Row],[Watford Time]]),\"\")","v":2715},{"$f":"IFERROR(IF(FIND(\"M\",XC[[#This Row],[Group]])>0,XC[[#This Row],[Watford Seconds]],\"errorif\"),\"\")","v":2715},{"$f":"IFERROR(IF(FIND(\"F\",XC[[#This Row],[Group]])>0,XC[[#This Row],[Watford Seconds]],\"errorif\"),\"\")","v":""},{"$f":"IF(ISNUMBER(XC[[#This Row],[Watford Mens Time]]),50-(RANK(XC[[#This Row],[Watford Mens Time]],XC[Watford Mens Time],1))+1,0)","v":42},{"$f":"IF(ISNUMBER(XC[[#This Row],[Watford  Ladies Time]]),50-(RANK(XC[[#This Row],[Watford  Ladies Time]],XC[Watford  Ladies Time],1))+1,0)","v":0},{"$f":"Hatime(XC[[#This Row],[WTime]])","v":"00:45:15"},"00:36:54",130,{"$f":"(HOUR(XC[[#This Row],[Cheshunt  wtime]])*3600)+MINUTE(XC[[#This Row],[Cheshunt  wtime]])*60+SECOND(XC[[#This Row],[Cheshunt  wtime]])","v":2214},{"$f":"IFERROR(IF(FIND(\"M\",XC[[#This Row],[Group]])>0,XC[[#This Row],[Cheshunt Second]],\"errorif\"),\"\")","v":2214},{"$f":"IFERROR(IF(FIND(\"F\",XC[[#This Row],[Group]])>0,XC[[#This Row],[Cheshunt Second]],\"errorif\"),\"\")","v":""},{"$f":"IF(ISNUMBER(XC[[#This Row],[Cheshunt Mens Time]]),50-(RANK(XC[[#This Row],[Cheshunt Mens Time]],XC[Cheshunt Mens Time],1))+1,0)","v":34},{"$f":"IF(ISNUMBER(XC[[#This Row],[Cheshunt ladies Time]]),50-(RANK(XC[[#This Row],[Cheshunt ladies Time]],XC[Cheshunt ladies Time],1))+1,0)","v":0},null,null,null,null,126,"00:35:11",null,{"$f":"(HOUR(XC[[#This Row],[Grovelands Mens Time]])*3600)+MINUTE(XC[[#This Row],[Grovelands Mens Time]])*60+SECOND(XC[[#This Row],[Grovelands Mens Time]])","v":2111}," ",{"$f":"IF(ISNUMBER(XC[[#This Row],[Glands Mens Secs]]),50-(RANK(XC[[#This Row],[Glands Mens Secs]],XC[Glands Mens Secs],1))+1,0)","v":35},{"$f":"IF(ISNUMBER(XC[[#This Row],[Gland Ladies Secs]]),50-(RANK(XC[[#This Row],[Gland Ladies Secs]],XC[Gland Ladies Secs],1))+1,0)","v":0},119,{"$f":"IF(ISNUMBER(XC[[#This Row],[TP Mens Secs]]),50-_xlfn.RANK.EQ(XC[[#This Row],[TP Mens Secs]],XC[TP Mens Secs],1)+1,0)","v":36},{"$f":"IF(ISNUMBER(XC[[#This Row],[TP Ladies Secs]]),50-_xlfn.RANK.EQ(XC[[#This Row],[TP Ladies Secs]],XC[TP Ladies Secs],1)+1,0)","v":0},"00:35:36","",2136,""]
[null,"Simon","Townsend",{"$f":"TRIM(XC[[#This Row],[N1]])&\" \"&TRIM(XC[[#This Row],[N2]])","v":"Simon Townsend"},1,{"$f":"VLOOKUP(XC[[#This Row],[Name]],members,2,0)","v":208},"M",{"$f":"VLOOKUP(XC[[#This Row],[Mem]],Allmembers[],7,FALSE)","v":"MV40"},{"$f":"COUNT(XC[[#This Row],[Royston Race Position]],XC[[#This Row],[Watford Race Position]],XC[[#This Row],[Cheshut place]],XC[[#This Row],[Watford Challenge Place]],XC[[#This Row],[Grovelands place]],XC[[#This Row],[Trent Park Pos]])","v":2},{"$f":"IF(XC[[#This Row],[Gender]]=\"M\",XC[[#This Row],[Royston Mens Points]]+XC[[#This Row],[Watford Mens Points]]+XC[[#This Row],[Cheshunt Mens Points]]+XC[[#This Row],[Watford Challenge Mens Points]]+XC[[#This Row],[Gland Mens Points]]+XC[[#This Row],[Trent Park Mens Points]],XC[[#This Row],[Royston Ladies Points]]+XC[[#This Row],[Waftord Ladies Points]]+XC[[#This Row],[Cheshunt Ladies Point]]+XC[[#This Row],[Watford Challenge Ladies Points]]+XC[[#This Row],[Gland Ladies Points]]+XC[[#This Row],[Trent Park Ladies Points]])","v":72},null," ",{"$f":"IF(XC[[#This Row],[Royston Time2]]>\" \",(HOUR(XC[[#This Row],[Royston Time2]])*3600)+MINUTE(XC[[#This Row],[Royston Time2]])*60+SECOND(XC[[#This Row],[Royston Time2]]),\"\")","v":""},{"$f":"IFERROR(IF(FIND(\"M\",XC[[#This Row],[Group]])>0,XC[[#This Row],[Royston Seconds]],\"errorif\"),\"\")","v":""},{"$f":"IFERROR(IF(FIND(\"F\",XC[[#This Row],[Group]])>0,XC[[#This Row],[Royston Seconds]],\"errorif\"),\"\")","v":""},{"$f":"IF(ISNUMBER(XC[[#This Row],[Royston Mens Time]]),50-(RANK(XC[[#This Row],[Royston Mens Time]],XC[Royston Mens Time],1))+1,0)","v":0},{"$f":"IF(ISNUMBER(XC[[#This Row],[Royston Ladies Times]]),50-(RANK(XC[[#This Row],[Royston Ladies Times]],XC[Royston Ladies Times],1))+1,0)","v":0}," ",149,"48:12",{"$f":"IFERROR((HOUR(XC[[#This Row],[Watford Time]])*3600)+MINUTE(XC[[#This Row],[Watford Time]])*60+SECOND(XC[[#This Row],[Watford Time]]),\"\")","v":2892},{"$f":"IFERROR(IF(FIND(\"M\",XC[[#This Row],[Group]])>0,XC[[#This Row],[Watford Seconds]],\"errorif\"),\"\")","v":2892},{"$f":"IFERROR(IF(FIND(\"F\",XC[[#This Row],[Group]])>0,XC[[#This Row],[Watford Seconds]],\"errorif\"),\"\")","v":""},{"$f":"IF(ISNUMBER(XC[[#This Row],[Watford Mens Time]]),50-(RANK(XC[[#This Row],[Watford Mens Time]],XC[Watford Mens Time],1))+1,0)","v":39},{"$f":"IF(ISNUMBER(XC[[#This Row],[Watford  Ladies Time]]),50-(RANK(XC[[#This Row],[Watford  Ladies Time]],XC[Watford  Ladies Time],1))+1,0)","v":0},{"$f":"Hatime(XC[[#This Row],[WTime]])","v":"00:48:12"},null,null,null,null,{"$f":"IFERROR(IF(FIND(\"F\",XC[[#This Row],[Group]])>0,XC[[#This Row],[Cheshunt Second]],\"errorif\"),\"\")","v":""},{"$f":"IF(ISNUMBER(XC[[#This Row],[Cheshunt Mens Time]]),50-(RANK(XC[[#This Row],[Cheshunt Mens Time]],XC[Cheshunt Mens Time],1))+1,0)","v":0},{"$f":"IF(ISNUMBER(XC[[#This Row],[Cheshunt ladies Time]]),50-(RANK(XC[[#This Row],[Cheshunt ladies Time]],XC[Cheshunt ladies Time],1))+1,0)","v":0},null,null,null,null,155,"00:35:58",null,{"$f":"(HOUR(XC[[#This Row],[Grovelands Mens Time]])*3600)+MINUTE(XC[[#This Row],[Grovelands Mens Time]])*60+SECOND(XC[[#This Row],[Grovelands Mens Time]])","v":2158}," ",{"$f":"IF(ISNUMBER(XC[[#This Row],[Glands Mens Secs]]),50-(RANK(XC[[#This Row],[Glands Mens Secs]],XC[Glands Mens Secs],1))+1,0)","v":33},{"$f":"IF(ISNUMBER(XC[[#This Row],[Gland Ladies Secs]]),50-(RANK(XC[[#This Row],[Gland Ladies Secs]],XC[Gland Ladies Secs],1))+1,0)","v":0},"  ",{"$f":"IF(ISNUMBER(XC[[#This Row],[TP Mens Secs]]),50-_xlfn.RANK.EQ(XC[[#This Row],[TP Mens Secs]],XC[TP Mens Secs],1)+1,0)","v":0},{"$f":"IF(ISNUMBER(XC[[#This Row],[TP Ladies Secs]]),50-_xlfn.RANK.EQ(XC[[#This Row],[TP Ladies Secs]],XC[TP Ladies Secs],1)+1,0)","v":0}]
[null,"Andrew","Cripps",{"$f":"TRIM(XC[[#This Row],[N1]])&\" \"&TRIM(XC[[#This Row],[N2]])","v":"Andrew Cripps"},1,{"$f":"VLOOKUP(XC[[#This Row],[Name]],members,2,0)","v":212},"M",{"$f":"VLOOKUP(XC[[#This Row],[Mem]],Allmembers[],7,FALSE)","v":"MV40"},{"$f":"COUNT(XC[[#This Row],[Royston Race Position]],XC[[#This Row],[Watford Race Position]],XC[[#This Row],[Cheshut place]],XC[[#This Row],[Watford Challenge Place]],XC[[#This Row],[Grovelands place]],XC[[#This Row],[Trent Park Pos]])","v":5},{"$f":"IF(XC[[#This Row],[Gender]]=\"M\",XC[[#This Row],[Royston Mens Points]]+XC[[#This Row],[Watford Mens Points]]+XC[[#This Row],[Cheshunt Mens Points]]+XC[[#This Row],[Watford Challenge Mens Points]]+XC[[#This Row],[Gland Mens Points]]+XC[[#This Row],[Trent Park Mens Points]],XC[[#This Row],[Royston Ladies Points]]+XC[[#This Row],[Waftord Ladies Points]]+XC[[#This Row],[Cheshunt Ladies Point]]+XC[[#This Row],[Watford Challenge Ladies Points]]+XC[[#This Row],[Gland Ladies Points]]+XC[[#This Row],[Trent Park Ladies Points]])","v":212},50,"39:28",{"$f":"IF(XC[[#This Row],[Royston Time2]]>\" \",(HOUR(XC[[#This Row],[Royston Time2]])*3600)+MINUTE(XC[[#This Row],[Royston Time2]])*60+SECOND(XC[[#This Row],[Royston Time2]]),\"\")","v":2368},{"$f":"IFERROR(IF(FIND(\"M\",XC[[#This Row],[Group]])>0,XC[[#This Row],[Royston Seconds]],\"errorif\"),\"\")","v":2368},{"$f":"IFERROR(IF(FIND(\"F\",XC[[#This Row],[Group]])>0,XC[[#This Row],[Royston Seconds]],\"errorif\"),\"\")","v":""},{"$f":"IF(ISNUMBER(XC[[#This Row],[Royston Mens Time]]),50-(RANK(XC[[#This Row],[Royston Mens Time]],XC[Royston Mens Time],1))+1,0)","v":44},{"$f":"IF(ISNUMBER(XC[[#This Row],[Royston Ladies Times]]),50-(RANK(XC[[#This Row],[Royston Ladies Times]],XC[Royston Ladies Times],1))+1,0)","v":0},{"$f":"Hatime(XC[[#This Row],[Royston Time]])","v":"00:39:28"},83,"43:59",{"$f":"IFERROR((HOUR(XC[[#This Row],[Watford Time]])*3600)+MINUTE(XC[[#This Row],[Watford Time]])*60+SECOND(XC[[#This Row],[Watford Time]]),\"\")","v":2639},{"$f":"IFERROR(IF(FIND(\"M\",XC[[#This Row],[Group]])>0,XC[[#This Row],[Watford Seconds]],\"errorif\"),\"\")","v":2639},{"$f":"IFERROR(IF(FIND(\"F\",XC[[#This Row],[Group]])>0,XC[[#This Row],[Watford Seconds]],\"errorif\"),\"\")","v":""},{"$f":"IF(ISNUMBER(XC[[#This Row],[Watford Mens Time]]),50-(RANK(XC[[#This Row],[Watford Mens Time]],XC[Watford Mens Time],1))+1,0)","v":45},{"$f":"IF(ISNUMBER(XC[[#This Row],[Watford  Ladies Time]]),50-(RANK(XC[[#This Row],[Watford  Ladies Time]],XC[Watford  Ladies Time],1))+1,0)","v":0},{"$f":"Hatime(XC[[#This Row],[WTime]])","v":"00:43:59"},"00:34:54",86,{"$f":"(HOUR(XC[[#This Row],[Cheshunt  wtime]])*3600)+MINUTE(XC[[#This Row],[Cheshunt  wtime]])*60+SECOND(XC[[#This Row],[Cheshunt  wtime]])","v":2094},{"$f":"IFERROR(IF(FIND(\"M\",XC[[#This Row],[Group]])>0,XC[[#This Row],[Cheshunt Second]],\"errorif\"),\"\")","v":2094},{"$f":"IFERROR(IF(FIND(\"F\",XC[[#This Row],[Group]])>0,XC[[#This Row],[Cheshunt Second]],\"errorif\"),\"\")","v":""},{"$f":"IF(ISNUMBER(XC[[#This Row],[Cheshunt Mens Time]]),50-(RANK(XC[[#This Row],[Cheshunt Mens Time]],XC[Cheshunt Mens Time],1))+1,0)","v":41},{"$f":"IF(ISNUMBER(XC[[#This Row],[Cheshunt ladies Time]]),50-(RANK(XC[[#This Row],[Cheshunt ladies Time]],XC[Cheshunt ladies Time],1))+1,0)","v":0},null,null,null,null,80,"00:32:53",null,{"$f":"(HOUR(XC[[#This Row],[Grovelands Mens Time]])*3600)+MINUTE(XC[[#This Row],[Grovelands Mens Time]])*60+SECOND(XC[[#This Row],[Grovelands Mens Time]])","v":1973}," ",{"$f":"IF(ISNUMBER(XC[[#This Row],[Glands Mens Secs]]),50-(RANK(XC[[#This Row],[Glands Mens Secs]],XC[Glands Mens Secs],1))+1,0)","v":41},{"$f":"IF(ISNUMBER(XC[[#This Row],[Gland Ladies Secs]]),50-(RANK(XC[[#This Row],[Gland Ladies Secs]],XC[Gland Ladies Secs],1))+1,0)","v":0},64,{"$f":"IF(ISNUMBER(XC[[#This Row],[TP Mens Secs]]),50-_xlfn.RANK.EQ(XC[[#This Row],[TP Mens Secs]],XC[TP Mens Secs],1)+1,0)","v":41},{"$f":"IF(ISNUMBER(XC[[#This Row],[TP Ladies Secs]]),50-_xlfn.RANK.EQ(XC[[#This Row],[TP Ladies Secs]],XC[TP Ladies Secs],1)+1,0)","v":0},"00:33:02","",1982,""]
[null,"Paul","Hermsen",{"$f":"TRIM(XC[[#This Row],[N1]])&\" \"&TRIM(XC[[#This Row],[N2]])","v":"Paul Hermsen"},null,{"$f":"VLOOKUP(XC[[#This Row],[Name]],members,2,0)","v":216},"M",{"$f":"VLOOKUP(XC[[#This Row],[Mem]],Allmembers[],7,FALSE)","v":"MS"},{"$f":"COUNT(XC[[#This Row],[Royston Race Position]],XC[[#This Row],[Watford Race Position]],XC[[#This Row],[Cheshut place]],XC[[#This Row],[Watford Challenge Place]],XC[[#This Row],[Grovelands place]],XC[[#This Row],[Trent Park Pos]])","v":1},{"$f":"IF(XC[[#This Row],[Gender]]=\"M\",XC[[#This Row],[Royston Mens Points]]+XC[[#This Row],[Watford Mens Points]]+XC[[#This Row],[Cheshunt Mens Points]]+XC[[#This Row],[Watford Challenge Mens Points]]+XC[[#This Row],[Gland Mens Points]]+XC[[#This Row],[Trent Park Mens Points]],XC[[#This Row],[Royston Ladies Points]]+XC[[#This Row],[Waftord Ladies Points]]+XC[[#This Row],[Cheshunt Ladies Point]]+XC[[#This Row],[Watford Challenge Ladies Points]]+XC[[#This Row],[Gland Ladies Points]]+XC[[#This Row],[Trent Park Ladies Points]])","v":37},null," ",{"$f":"IF(XC[[#This Row],[Royston Time2]]>\" \",(HOUR(XC[[#This Row],[Royston Time2]])*3600)+MINUTE(XC[[#This Row],[Royston Time2]])*60+SECOND(XC[[#This Row],[Royston Time2]]),\"\")","v":""},null,{"$f":"IFERROR(IF(FIND(\"F\",XC[[#This Row],[Group]])>0,XC[[#This Row],[Royston Seconds]],\"errorif\"),\"\")","v":""},{"$f":"IF(ISNUMBER(XC[[#This Row],[Royston Mens Time]]),50-(RANK(XC[[#This Row],[Royston Mens Time]],XC[Royston Mens Time],1))+1,0)","v":0},{"$f":"IF(ISNUMBER(XC[[#This Row],[Royston Ladies Times]]),50-(RANK(XC[[#This Row],[Royston Ladies Times]],XC[Royston Ladies Times],1))+1,0)","v":0}," ",159,"48:40",{"$f":"IFERROR((HOUR(XC[[#This Row],[Watford Time]])*3600)+MINUTE(XC[[#This Row],[Watford Time]])*60+SECOND(XC[[#This Row],[Watford Time]]),\"\")","v":2920},{"$f":"IFERROR(IF(FIND(\"M\",XC[[#This Row],[Group]])>0,XC[[#This Row],[Watford Seconds]],\"errorif\"),\"\")","v":2920},{"$f":"IFERROR(IF(FIND(\"F\",XC[[#This Row],[Group]])>0,XC[[#This Row],[Watford Seconds]],\"errorif\"),\"\")","v":""},{"$f":"IF(ISNUMBER(XC[[#This Row],[Watford Mens Time]]),50-(RANK(XC[[#This Row],[Watford Mens Time]],XC[Watford Mens Time],1))+1,0)","v":37},{"$f":"IF(ISNUMBER(XC[[#This Row],[Watford  Ladies Time]]),50-(RANK(XC[[#This Row],[Watford  Ladies Time]],XC[Watford  Ladies Time],1))+1,0)","v":0},{"$f":"Hatime(XC[[#This Row],[WTime]])","v":"00:48:40"},null,null,null,null,{"$f":"IFERROR(IF(FIND(\"F\",XC[[#This Row],[Group]])>0,XC[[#This Row],[Cheshunt Second]],\"errorif\"),\"\")","v":""},{"$f":"IF(ISNUMBER(XC[[#This Row],[Cheshunt Mens Time]]),50-(RANK(XC[[#This Row],[Cheshunt Mens Time]],XC[Cheshunt Mens Time],1))+1,0)","v":0},{"$f":"IF(ISNUMBER(XC[[#This Row],[Cheshunt ladies Time]]),50-(RANK(XC[[#This Row],[Cheshunt ladies Time]],XC[Cheshunt ladies Time],1))+1,0)","v":0},null,null,null,null,null,null,null," "," ",{"$f":"IF(ISNUMBER(XC[[#This Row],[Glands Mens Secs]]),50-(RANK(XC[[#This Row],[Glands Mens Secs]],XC[Glands Mens Secs],1))+1,0)","v":0},{"$f":"IF(ISNUMBER(XC[[#This Row],[Gland Ladies Secs]]),50-(RANK(XC[[#This Row],[Gland Ladies Secs]],XC[Gland Ladies Secs],1))+1,0)","v":0},"  ",{"$f":"IF(ISNUMBER(XC[[#This Row],[TP Mens Secs]]),50-_xlfn.RANK.EQ(XC[[#This Row],[TP Mens Secs]],XC[TP Mens Secs],1)+1,0)","v":0},{"$f":"IF(ISNUMBER(XC[[#This Row],[TP Ladies Secs]]),50-_xlfn.RANK.EQ(XC[[#This Row],[TP Ladies Secs]],XC[TP Ladies Secs],1)+1,0)","v":0}]
[null,"Paul","Goodwin",{"$f":"TRIM(XC[[#This Row],[N1]])&\" \"&TRIM(XC[[#This Row],[N2]])","v":"Paul Goodwin"},null,{"$f":"VLOOKUP(XC[[#This Row],[Name]],members,2,0)","v":222},"M",{"$f":"VLOOKUP(XC[[#This Row],[Mem]],Allmembers[],7,FALSE)","v":"MS"},{"$f":"COUNT(XC[[#This Row],[Royston Race Position]],XC[[#This Row],[Watford Race Position]],XC[[#This Row],[Cheshut place]],XC[[#This Row],[Watford Challenge Place]],XC[[#This Row],[Grovelands place]],XC[[#This Row],[Trent Park Pos]])","v":2},{"$f":"IF(XC[[#This Row],[Gender]]=\"M\",XC[[#This Row],[Royston Mens Points]]+XC[[#This Row],[Watford Mens Points]]+XC[[#This Row],[Cheshunt Mens Points]]+XC[[#This Row],[Watford Challenge Mens Points]]+XC[[#This Row],[Gland Mens Points]]+XC[[#This Row],[Trent Park Mens Points]],XC[[#This Row],[Royston Ladies Points]]+XC[[#This Row],[Waftord Ladies Points]]+XC[[#This Row],[Cheshunt Ladies Point]]+XC[[#This Row],[Watford Challenge Ladies Points]]+XC[[#This Row],[Gland Ladies Points]]+XC[[#This Row],[Trent Park Ladies Points]])","v":98},33,"37:31",{"$f":"IF(XC[[#This Row],[Royston Time2]]>\" \",(HOUR(XC[[#This Row],[Royston Time2]])*3600)+MINUTE(XC[[#This Row],[Royston Time2]])*60+SECOND(XC[[#This Row],[Royston Time2]]),\"\")","v":2251},{"$f":"IFERROR(IF(FIND(\"M\",XC[[#This Row],[Group]])>0,XC[[#This Row],[Royston Seconds]],\"errorif\"),\"\")","v":2251},{"$f":"IFERROR(IF(FIND(\"F\",XC[[#This Row],[Group]])>0,XC[[#This Row],[Royston Seconds]],\"errorif\"),\"\")","v":""},{"$f":"IF(ISNUMBER(XC[[#This Row],[Royston Mens Time]]),50-(RANK(XC[[#This Row],[Royston Mens Time]],XC[Royston Mens Time],1))+1,0)","v":48},{"$f":"IF(ISNUMBER(XC[[#This Row],[Royston Ladies Times]]),50-(RANK(XC[[#This Row],[Royston Ladies Times]],XC[Royston Ladies Times],1))+1,0)","v":0},{"$f":"Hatime(XC[[#This Row],[Royston Time]])","v":"00:37:31"},41,"40:44",{"$f":"IFERROR((HOUR(XC[[#This Row],[Watford Time]])*3600)+MINUTE(XC[[#This Row],[Watford Time]])*60+SECOND(XC[[#This Row],[Watford Time]]),\"\")","v":2444},{"$f":"IFERROR(IF(FIND(\"M\",XC[[#This Row],[Group]])>0,XC[[#This Row],[Watford Seconds]],\"errorif\"),\"\")","v":2444},{"$f":"IFERROR(IF(FIND(\"F\",XC[[#This Row],[Group]])>0,XC[[#This Row],[Watford Seconds]],\"errorif\"),\"\")","v":""},{"$f":"IF(ISNUMBER(XC[[#This Row],[Watford Mens Time]]),50-(RANK(XC[[#This Row],[Watford Mens Time]],XC[Watford Mens Time],1))+1,0)","v":50},{"$f":"IF(ISNUMBER(XC[[#This Row],[Watford  Ladies Time]]),50-(RANK(XC[[#This Row],[Watford  Ladies Time]],XC[Watford  Ladies Time],1))+1,0)","v":0},{"$f":"Hatime(XC[[#This Row],[WTime]])","v":"00:40:44"},null,null,null,null,{"$f":"IFERROR(IF(FIND(\"F\",XC[[#This Row],[Group]])>0,XC[[#This Row],[Cheshunt Second]],\"errorif\"),\"\")","v":""},{"$f":"IF(ISNUMBER(XC[[#This Row],[Cheshunt Mens Time]]),50-(RANK(XC[[#This Row],[Cheshunt Mens Time]],XC[Cheshunt Mens Time],1))+1,0)","v":0},{"$f":"IF(ISNUMBER(XC[[#This Row],[Cheshunt ladies Time]]),50-(RANK(XC[[#This Row],[Cheshunt ladies Time]],XC[Cheshunt ladies Time],1))+1,0)","v":0},null,null,null,null,null,null,null," "," ",{"$f":"IF(ISNUMBER(XC[[#This Row],[Glands Mens Secs]]),50-(RANK(XC[[#This Row],[Glands Mens Secs]],XC[Glands Mens Secs],1))+1,0)","v":0},{"$f":"IF(ISNUMBER(XC[[#This Row],[Gland Ladies Secs]]),50-(RANK(XC[[#This Row],[Gland Ladies Secs]],XC[Gland Ladies Secs],1))+1,0)","v":0},"  ",{"$f":"IF(ISNUMBER(XC[[#This Row],[TP Mens Secs]]),50-_xlfn.RANK.EQ(XC[[#This Row],[TP Mens Secs]],XC[TP Mens Secs],1)+1,0)","v":0},{"$f":"IF(ISNUMBER(XC[[#This Row],[TP Ladies Secs]]),50-_xlfn.RANK.EQ(XC[[#This Row],[TP Ladies Secs]],XC[TP Ladies Secs],1)+1,0)","v":0}]
[null,"Steve","Bowran",{"$f":"TRIM(XC[[#This Row],[N1]])&\" \"&TRIM(XC[[#This Row],[N2]])","v":"Steve Bowran"},1,{"$f":"VLOOKUP(XC[[#This Row],[Name]],members,2,0)","v":223},"M",{"$f":"VLOOKUP(XC[[#This Row],[Mem]],Allmembers[],7,FALSE)","v":"MV40"},{"$f":"COUNT(XC[[#This Row],[Royston Race Position]],XC[[#This Row],[Watford Race Position]],XC[[#This Row],[Cheshut place]],XC[[#This Row],[Watford Challenge Place]],XC[[#This Row],[Grovelands place]],XC[[#This Row],[Trent Park Pos]])","v":5},{"$f":"IF(XC[[#This Row],[Gender]]=\"M\",XC[[#This Row],[Royston Mens Points]]+XC[[#This Row],[Watford Mens Points]]+XC[[#This Row],[Cheshunt Mens Points]]+XC[[#This Row],[Watford Challenge Mens Points]]+XC[[#This Row],[Gland Mens Points]]+XC[[#This Row],[Trent Park Mens Points]],XC[[#This Row],[Royston Ladies Points]]+XC[[#This Row],[Waftord Ladies Points]]+XC[[#This Row],[Cheshunt Ladies Point]]+XC[[#This Row],[Watford Challenge Ladies Points]]+XC[[#This Row],[Gland Ladies Points]]+XC[[#This Row],[Trent Park Ladies Points]])","v":226},49,"39:25",{"$f":"IF(XC[[#This Row],[Royston Time2]]>\" \",(HOUR(XC[[#This Row],[Royston Time2]])*3600)+MINUTE(XC[[#This Row],[Royston Time2]])*60+SECOND(XC[[#This Row],[Royston Time2]]),\"\")","v":2365},{"$f":"IFERROR(IF(FIND(\"M\",XC[[#This Row],[Group]])>0,XC[[#This Row],[Royston Seconds]],\"errorif\"),\"\")","v":2365},{"$f":"IFERROR(IF(FIND(\"F\",XC[[#This Row],[Group]])>0,XC[[#This Row],[Royston Seconds]],\"errorif\"),\"\")","v":""},{"$f":"IF(ISNUMBER(XC[[#This Row],[Royston Mens Time]]),50-(RANK(XC[[#This Row],[Royston Mens Time]],XC[Royston Mens Time],1))+1,0)","v":45},{"$f":"IF(ISNUMBER(XC[[#This Row],[Royston Ladies Times]]),50-(RANK(XC[[#This Row],[Royston Ladies Times]],XC[Royston Ladies Times],1))+1,0)","v":0},{"$f":"Hatime(XC[[#This Row],[Royston Time]])","v":"00:39:25"},78,"43:44",{"$f":"IFERROR((HOUR(XC[[#This Row],[Watford Time]])*3600)+MINUTE(XC[[#This Row],[Watford Time]])*60+SECOND(XC[[#This Row],[Watford Time]]),\"\")","v":2624},{"$f":"IFERROR(IF(FIND(\"M\",XC[[#This Row],[Group]])>0,XC[[#This Row],[Watford Seconds]],\"errorif\"),\"\")","v":2624},{"$f":"IFERROR(IF(FIND(\"F\",XC[[#This Row],[Group]])>0,XC[[#This Row],[Watford Seconds]],\"errorif\"),\"\")","v":""},{"$f":"IF(ISNUMBER(XC[[#This Row],[Watford Mens Time]]),50-(RANK(XC[[#This Row],[Watford Mens Time]],XC[Watford Mens Time],1))+1,0)","v":46},{"$f":"IF(ISNUMBER(XC[[#This Row],[Watford  Ladies Time]]),50-(RANK(XC[[#This Row],[Watford  Ladies Time]],XC[Watford  Ladies Time],1))+1,0)","v":0},{"$f":"Hatime(XC[[#This Row],[WTime]])","v":"00:43:44"},"00:34:16",69,{"$f":"(HOUR(XC[[#This Row],[Cheshunt  wtime]])*3600)+MINUTE(XC[[#This Row],[Cheshunt  wtime]])*60+SECOND(XC[[#This Row],[Cheshunt  wtime]])","v":2056},{"$f":"IFERROR(IF(FIND(\"M\",XC[[#This Row],[Group]])>0,XC[[#This Row],[Cheshunt Second]],\"errorif\"),\"\")","v":2056},{"$f":"IFERROR(IF(FIND(\"F\",XC[[#This Row],[Group]])>0,XC[[#This Row],[Cheshunt Second]],\"errorif\"),\"\")","v":""},{"$f":"IF(ISNUMBER(XC[[#This Row],[Cheshunt Mens Time]]),50-(RANK(XC[[#This Row],[Cheshunt Mens Time]],XC[Cheshunt Mens Time],1))+1,0)","v":43},{"$f":"IF(ISNUMBER(XC[[#This Row],[Cheshunt ladies Time]]),50-(RANK(XC[[#This Row],[Cheshunt ladies Time]],XC[Cheshunt ladies Time],1))+1,0)","v":0},null,null,null,null,53,"00:31:36",null,{"$f":"(HOUR(XC[[#This Row],[Grovelands Mens Time]])*3600)+MINUTE(XC[[#This Row],[Grovelands Mens Time]])*60+SECOND(XC[[#This Row],[Grovelands Mens Time]])","v":1896}," ",{"$f":"IF(ISNUMBER(XC[[#This Row],[Glands Mens Secs]]),50-(RANK(XC[[#This Row],[Glands Mens Secs]],XC[Glands Mens Secs],1))+1,0)","v":46},{"$f":"IF(ISNUMBER(XC[[#This Row],[Gland Ladies Secs]]),50-(RANK(XC[[#This Row],[Gland Ladies Secs]],XC[Gland Ladies Secs],1))+1,0)","v":0},37,{"$f":"IF(ISNUMBER(XC[[#This Row],[TP Mens Secs]]),50-_xlfn.RANK.EQ(XC[[#This Row],[TP Mens Secs]],XC[TP Mens Secs],1)+1,0)","v":46},{"$f":"IF(ISNUMBER(XC[[#This Row],[TP Ladies Secs]]),50-_xlfn.RANK.EQ(XC[[#This Row],[TP Ladies Secs]],XC[TP Ladies Secs],1)+1,0)","v":0},"00:31:40","",1900,""]
[null,"Jennifer","Cunniff",{"$f":"TRIM(XC[[#This Row],[N1]])&\" \"&TRIM(XC[[#This Row],[N2]])","v":"Jennifer Cunniff"},1,{"$f":"VLOOKUP(XC[[#This Row],[Name]],members,2,0)","v":225},"W",{"$f":"VLOOKUP(XC[[#This Row],[Mem]],Allmembers[],7,FALSE)","v":"FS"},{"$f":"COUNT(XC[[#This Row],[Royston Race Position]],XC[[#This Row],[Watford Race Position]],XC[[#This Row],[Cheshut place]],XC[[#This Row],[Watford Challenge Place]],XC[[#This Row],[Grovelands place]],XC[[#This Row],[Trent Park Pos]])","v":2},{"$f":"IF(XC[[#This Row],[Gender]]=\"M\",XC[[#This Row],[Royston Mens Points]]+XC[[#This Row],[Watford Mens Points]]+XC[[#This Row],[Cheshunt Mens Points]]+XC[[#This Row],[Watford Challenge Mens Points]]+XC[[#This Row],[Gland Mens Points]]+XC[[#This Row],[Trent Park Mens Points]],XC[[#This Row],[Royston Ladies Points]]+XC[[#This Row],[Waftord Ladies Points]]+XC[[#This Row],[Cheshunt Ladies Point]]+XC[[#This Row],[Watford Challenge Ladies Points]]+XC[[#This Row],[Gland Ladies Points]]+XC[[#This Row],[Trent Park Ladies Points]])","v":86},null," ",{"$f":"IF(XC[[#This Row],[Royston Time2]]>\" \",(HOUR(XC[[#This Row],[Royston Time2]])*3600)+MINUTE(XC[[#This Row],[Royston Time2]])*60+SECOND(XC[[#This Row],[Royston Time2]]),\"\")","v":""},{"$f":"IFERROR(IF(FIND(\"M\",XC[[#This Row],[Group]])>0,XC[[#This Row],[Royston Seconds]],\"errorif\"),\"\")","v":""},{"$f":"IFERROR(IF(FIND(\"F\",XC[[#This Row],[Group]])>0,XC[[#This Row],[Royston Seconds]],\"errorif\"),\"\")","v":""},{"$f":"IF(ISNUMBER(XC[[#This Row],[Royston Mens Time]]),50-(RANK(XC[[#This Row],[Royston Mens Time]],XC[Royston Mens Time],1))+1,0)","v":0},{"$f":"IF(ISNUMBER(XC[[#This Row],[Royston Ladies Times]]),50-(RANK(XC[[#This Row],[Royston Ladies Times]],XC[Royston Ladies Times],1))+1,0)","v":0}," ",null,null,{"$f":"IFERROR((HOUR(XC[[#This Row],[Watford Time]])*3600)+MINUTE(XC[[#This Row],[Watford Time]])*60+SECOND(XC[[#This Row],[Watford Time]]),\"\")","v":""},{"$f":"IFERROR(IF(FIND(\"M\",XC[[#This Row],[Group]])>0,XC[[#This Row],[Watford Seconds]],\"errorif\"),\"\")","v":""},{"$f":"IFERROR(IF(FIND(\"F\",XC[[#This Row],[Group]])>0,XC[[#This Row],[Watford Seconds]],\"errorif\"),\"\")","v":""},{"$f":"IF(ISNUMBER(XC[[#This Row],[Watford Mens Time]]),50-(RANK(XC[[#This Row],[Watford Mens Time]],XC[Watford Mens Time],1))+1,0)","v":0},null,{"$f":"Hatime(XC[[#This Row],[WTime]])","v":""},"00:46:19",324,{"$f":"(HOUR(XC[[#This Row],[Cheshunt  wtime]])*3600)+MINUTE(XC[[#This Row],[Cheshunt  wtime]])*60+SECOND(XC[[#This Row],[Cheshunt  wtime]])","v":2779},{"$f":"IFERROR(IF(FIND(\"M\",XC[[#This Row],[Group]])>0,XC[[#This Row],[Cheshunt Second]],\"errorif\"),\"\")","v":""},{"$f":"IFERROR(IF(FIND(\"F\",XC[[#This Row],[Group]])>0,XC[[#This Row],[Cheshunt Second]],\"errorif\"),\"\")","v":2779},{"$f":"IF(ISNUMBER(XC[[#This Row],[Cheshunt Mens Time]]),50-(RANK(XC[[#This Row],[Cheshunt Mens Time]],XC[Cheshunt Mens Time],1))+1,0)","v":0},{"$f":"IF(ISNUMBER(XC[[#This Row],[Cheshunt ladies Time]]),50-(RANK(XC[[#This Row],[Cheshunt ladies Time]],XC[Cheshunt ladies Time],1))+1,0)","v":43},null,null,null,null,329,null,"00:44:40"," ",{"$f":"(HOUR(XC[[#This Row],[Grovelands Ladies Time]])*3600)+MINUTE(XC[[#This Row],[Grovelands Ladies Time]])*60+SECOND(XC[[#This Row],[Grovelands Ladies Time]])","v":2680},{"$f":"IF(ISNUMBER(XC[[#This Row],[Glands Mens Secs]]),50-(RANK(XC[[#This Row],[Glands Mens Secs]],XC[Glands Mens Secs],1))+1,0)","v":0},{"$f":"IF(ISNUMBER(XC[[#This Row],[Gland Ladies Secs]]),50-(RANK(XC[[#This Row],[Gland Ladies Secs]],XC[Gland Ladies Secs],1))+1,0)","v":43},"  ",{"$f":"IF(ISNUMBER(XC[[#This Row],[TP Mens Secs]]),50-_xlfn.RANK.EQ(XC[[#This Row],[TP Mens Secs]],XC[TP Mens Secs],1)+1,0)","v":0},{"$f":"IF(ISNUMBER(XC[[#This Row],[TP Ladies Secs]]),50-_xlfn.RANK.EQ(XC[[#This Row],[TP Ladies Secs]],XC[TP Ladies Secs],1)+1,0)","v":0}]
[null,"Ed","Rhodes",{"$f":"TRIM(XC[[#This Row],[N1]])&\" \"&TRIM(XC[[#This Row],[N2]])","v":"Ed Rhodes"},null,231,"M",{"$f":"VLOOKUP(XC[[#This Row],[Mem]],Allmembers[],7,FALSE)","v":"MV40"},{"$f":"COUNT(XC[[#This Row],[Royston Race Position]],XC[[#This Row],[Watford Race Position]],XC[[#This Row],[Cheshut place]],XC[[#This Row],[Watford Challenge Place]],XC[[#This Row],[Grovelands place]],XC[[#This Row],[Trent Park Pos]])","v":2},{"$f":"IF(XC[[#This Row],[Gender]]=\"M\",XC[[#This Row],[Royston Mens Points]]+XC[[#This Row],[Watford Mens Points]]+XC[[#This Row],[Cheshunt Mens Points]]+XC[[#This Row],[Watford Challenge Mens Points]]+XC[[#This Row],[Gland Mens Points]]+XC[[#This Row],[Trent Park Mens Points]],XC[[#This Row],[Royston Ladies Points]]+XC[[#This Row],[Waftord Ladies Points]]+XC[[#This Row],[Cheshunt Ladies Point]]+XC[[#This Row],[Watford Challenge Ladies Points]]+XC[[#This Row],[Gland Ladies Points]]+XC[[#This Row],[Trent Park Ladies Points]])","v":79},89,"41:17",{"$f":"IF(XC[[#This Row],[Royston Time2]]>\" \",(HOUR(XC[[#This Row],[Royston Time2]])*3600)+MINUTE(XC[[#This Row],[Royston Time2]])*60+SECOND(XC[[#This Row],[Royston Time2]]),\"\")","v":2477},{"$f":"IFERROR(IF(FIND(\"M\",XC[[#This Row],[Group]])>0,XC[[#This Row],[Royston Seconds]],\"errorif\"),\"\")","v":2477},{"$f":"IFERROR(IF(FIND(\"F\",XC[[#This Row],[Group]])>0,XC[[#This Row],[Royston Seconds]],\"errorif\"),\"\")","v":""},{"$f":"IF(ISNUMBER(XC[[#This Row],[Royston Mens Time]]),50-(RANK(XC[[#This Row],[Royston Mens Time]],XC[Royston Mens Time],1))+1,0)","v":38},{"$f":"IF(ISNUMBER(XC[[#This Row],[Royston Ladies Times]]),50-(RANK(XC[[#This Row],[Royston Ladies Times]],XC[Royston Ladies Times],1))+1,0)","v":0},{"$f":"Hatime(XC[[#This Row],[Royston Time]])","v":"00:41:17"},109,"45:18",{"$f":"IFERROR((HOUR(XC[[#This Row],[Watford Time]])*3600)+MINUTE(XC[[#This Row],[Watford Time]])*60+SECOND(XC[[#This Row],[Watford Time]]),\"\")","v":2718},{"$f":"IFERROR(IF(FIND(\"M\",XC[[#This Row],[Group]])>0,XC[[#This Row],[Watford Seconds]],\"errorif\"),\"\")","v":2718},{"$f":"IFERROR(IF(FIND(\"F\",XC[[#This Row],[Group]])>0,XC[[#This Row],[Watford Seconds]],\"errorif\"),\"\")","v":""},{"$f":"IF(ISNUMBER(XC[[#This Row],[Watford Mens Time]]),50-(RANK(XC[[#This Row],[Watford Mens Time]],XC[Watford Mens Time],1))+1,0)","v":41},{"$f":"IF(ISNUMBER(XC[[#This Row],[Watford  Ladies Time]]),50-(RANK(XC[[#This Row],[Watford  Ladies Time]],XC[Watford  Ladies Time],1))+1,0)","v":0},{"$f":"Hatime(XC[[#This Row],[WTime]])","v":"00:45:18"},null,null,null,null,{"$f":"IFERROR(IF(FIND(\"F\",XC[[#This Row],[Group]])>0,XC[[#This Row],[Cheshunt Second]],\"errorif\"),\"\")","v":""},{"$f":"IF(ISNUMBER(XC[[#This Row],[Cheshunt Mens Time]]),50-(RANK(XC[[#This Row],[Cheshunt Mens Time]],XC[Cheshunt Mens Time],1))+1,0)","v":0},{"$f":"IF(ISNUMBER(XC[[#This Row],[Cheshunt ladies Time]]),50-(RANK(XC[[#This Row],[Cheshunt ladies Time]],XC[Cheshunt ladies Time],1))+1,0)","v":0},null,null,null,null,null,null,null," "," ",{"$f":"IF(ISNUMBER(XC[[#This Row],[Glands Mens Secs]]),50-(RANK(XC[[#This Row],[Glands Mens Secs]],XC[Glands Mens Secs],1))+1,0)","v":0},{"$f":"IF(ISNUMBER(XC[[#This Row],[Gland Ladies Secs]]),50-(RANK(XC[[#This Row],[Gland Ladies Secs]],XC[Gland Ladies Secs],1))+1,0)","v":0},"  ",{"$f":"IF(ISNUMBER(XC[[#This Row],[TP Mens Secs]]),50-_xlfn.RANK.EQ(XC[[#This Row],[TP Mens Secs]],XC[TP Mens Secs],1)+1,0)","v":0},{"$f":"IF(ISNUMBER(XC[[#This Row],[TP Ladies Secs]]),50-_xlfn.RANK.EQ(XC[[#This Row],[TP Ladies Secs]],XC[TP Ladies Secs],1)+1,0)","v":0}]
[null,"Philippa","O'Donovan",{"$f":"TRIM(XC[[#This Row],[N1]])&\" \"&TRIM(XC[[#This Row],[N2]])","v":"Philippa O'Donovan"},null,{"$f":"VLOOKUP(XC[[#This Row],[Name]],members,2,0)","v":232},"W",{"$f":"VLOOKUP(XC[[#This Row],[Mem]],Allmembers[],7,FALSE)","v":"FS"},{"$f":"COUNT(XC[[#This Row],[Royston Race Position]],XC[[#This Row],[Watford Race Position]],XC[[#This Row],[Cheshut place]],XC[[#This Row],[Watford Challenge Place]],XC[[#This Row],[Grovelands place]],XC[[#This Row],[Trent Park Pos]])","v":4},{"$f":"IF(XC[[#This Row],[Gender]]=\"M\",XC[[#This Row],[Royston Mens Points]]+XC[[#This Row],[Watford Mens Points]]+XC[[#This Row],[Cheshunt Mens Points]]+XC[[#This Row],[Watford Challenge Mens Points]]+XC[[#This Row],[Gland Mens Points]]+XC[[#This Row],[Trent Park Mens Points]],XC[[#This Row],[Royston Ladies Points]]+XC[[#This Row],[Waftord Ladies Points]]+XC[[#This Row],[Cheshunt Ladies Point]]+XC[[#This Row],[Watford Challenge Ladies Points]]+XC[[#This Row],[Gland Ladies Points]]+XC[[#This Row],[Trent Park Ladies Points]])","v":175},251,"53:55",{"$f":"IF(XC[[#This Row],[Royston Time2]]>\" \",(HOUR(XC[[#This Row],[Royston Time2]])*3600)+MINUTE(XC[[#This Row],[Royston Time2]])*60+SECOND(XC[[#This Row],[Royston Time2]]),\"\")","v":3235},{"$f":"IFERROR(IF(FIND(\"M\",XC[[#This Row],[Group]])>0,XC[[#This Row],[Royston Seconds]],\"errorif\"),\"\")","v":""},{"$f":"IFERROR(IF(FIND(\"F\",XC[[#This Row],[Group]])>0,XC[[#This Row],[Royston Seconds]],\"errorif\"),\"\")","v":3235},{"$f":"IF(ISNUMBER(XC[[#This Row],[Royston Mens Time]]),50-(RANK(XC[[#This Row],[Royston Mens Time]],XC[Royston Mens Time],1))+1,0)","v":0},{"$f":"IF(ISNUMBER(XC[[#This Row],[Royston Ladies Times]]),50-(RANK(XC[[#This Row],[Royston Ladies Times]],XC[Royston Ladies Times],1))+1,\"\")","v":44},{"$f":"Hatime(XC[[#This Row],[Royston Time]])","v":"00:53:55"},237,"56:15",{"$f":"IFERROR((HOUR(XC[[#This Row],[Watford Time]])*3600)+MINUTE(XC[[#This Row],[Watford Time]])*60+SECOND(XC[[#This Row],[Watford Time]]),\"\")","v":3375},{"$f":"IFERROR(IF(FIND(\"M\",XC[[#This Row],[Group]])>0,XC[[#This Row],[Watford Seconds]],\"errorif\"),\"\")","v":""},{"$f":"IFERROR(IF(FIND(\"F\",XC[[#This Row],[Group]])>0,XC[[#This Row],[Watford Seconds]],\"errorif\"),\"\")","v":3375},{"$f":"IF(ISNUMBER(XC[[#This Row],[Watford Mens Time]]),50-(RANK(XC[[#This Row],[Watford Mens Time]],XC[Watford Mens Time],1))+1,0)","v":0},{"$f":"IF(ISNUMBER(XC[[#This Row],[Watford  Ladies Time]]),50-(RANK(XC[[#This Row],[Watford  Ladies Time]],XC[Watford  Ladies Time],1))+1,0)","v":46},{"$f":"Hatime(XC[[#This Row],[WTime]])","v":"00:56:15"},"00:45:04",301,{"$f":"(HOUR(XC[[#This Row],[Cheshunt  wtime]])*3600)+MINUTE(XC[[#This Row],[Cheshunt  wtime]])*60+SECOND(XC[[#This Row],[Cheshunt  wtime]])","v":2704},{"$f":"IFERROR(IF(FIND(\"M\",XC[[#This Row],[Group]])>0,XC[[#This Row],[Cheshunt Second]],\"errorif\"),\"\")","v":""},{"$f":"IFERROR(IF(FIND(\"F\",XC[[#This Row],[Group]])>0,XC[[#This Row],[Cheshunt Second]],\"errorif\"),\"\")","v":2704},{"$f":"IF(ISNUMBER(XC[[#This Row],[Cheshunt Mens Time]]),50-(RANK(XC[[#This Row],[Cheshunt Mens Time]],XC[Cheshunt Mens Time],1))+1,0)","v":0},{"$f":"IF(ISNUMBER(XC[[#This Row],[Cheshunt ladies Time]]),50-(RANK(XC[[#This Row],[Cheshunt ladies Time]],XC[Cheshunt ladies Time],1))+1,0)","v":45},null,null,null,null,null,null,null," "," ",{"$f":"IF(ISNUMBER(XC[[#This Row],[Glands Mens Secs]]),50-(RANK(XC[[#This Row],[Glands Mens Secs]],XC[Glands Mens Secs],1))+1,0)","v":0},{"$f":"IF(ISNUMBER(XC[[#This Row],[Gland Ladies Secs]]),50-(RANK(XC[[#This Row],[Gland Ladies Secs]],XC[Gland Ladies Secs],1))+1,0)","v":0},266,{"$f":"IF(ISNUMBER(XC[[#This Row],[TP Mens Secs]]),50-_xlfn.RANK.EQ(XC[[#This Row],[TP Mens Secs]],XC[TP Mens Secs],1)+1,0)","v":0},{"$f":"IF(ISNUMBER(XC[[#This Row],[TP Ladies Secs]]),50-_xlfn.RANK.EQ(XC[[#This Row],[TP Ladies Secs]],XC[TP Ladies Secs],1)+1,0)","v":40},"","00:43:22","",2602]
[null,"Adrian","James",{"$f":"TRIM(XC[[#This Row],[N1]])&\" \"&TRIM(XC[[#This Row],[N2]])","v":"Adrian James"},1,{"$f":"VLOOKUP(XC[[#This Row],[Name]],members,2,0)","v":236},"M",{"$f":"VLOOKUP(XC[[#This Row],[Mem]],Allmembers[],7,FALSE)","v":"MV40"},{"$f":"COUNT(XC[[#This Row],[Royston Race Position]],XC[[#This Row],[Watford Race Position]],XC[[#This Row],[Cheshut place]],XC[[#This Row],[Watford Challenge Place]],XC[[#This Row],[Grovelands place]],XC[[#This Row],[Trent Park Pos]])","v":3},{"$f":"IF(XC[[#This Row],[Gender]]=\"M\",XC[[#This Row],[Royston Mens Points]]+XC[[#This Row],[Watford Mens Points]]+XC[[#This Row],[Cheshunt Mens Points]]+XC[[#This Row],[Watford Challenge Mens Points]]+XC[[#This Row],[Gland Mens Points]]+XC[[#This Row],[Trent Park Mens Points]],XC[[#This Row],[Royston Ladies Points]]+XC[[#This Row],[Waftord Ladies Points]]+XC[[#This Row],[Cheshunt Ladies Point]]+XC[[#This Row],[Watford Challenge Ladies Points]]+XC[[#This Row],[Gland Ladies Points]]+XC[[#This Row],[Trent Park Ladies Points]])","v":139},41,"38:27",{"$f":"IF(XC[[#This Row],[Royston Time2]]>\" \",(HOUR(XC[[#This Row],[Royston Time2]])*3600)+MINUTE(XC[[#This Row],[Royston Time2]])*60+SECOND(XC[[#This Row],[Royston Time2]]),\"\")","v":2307},{"$f":"IFERROR(IF(FIND(\"M\",XC[[#This Row],[Group]])>0,XC[[#This Row],[Royston Seconds]],\"errorif\"),\"\")","v":2307},{"$f":"IFERROR(IF(FIND(\"F\",XC[[#This Row],[Group]])>0,XC[[#This Row],[Royston Seconds]],\"errorif\"),\"\")","v":""},{"$f":"IF(ISNUMBER(XC[[#This Row],[Royston Mens Time]]),50-(RANK(XC[[#This Row],[Royston Mens Time]],XC[Royston Mens Time],1))+1,0)","v":47},{"$f":"IF(ISNUMBER(XC[[#This Row],[Royston Ladies Times]]),50-(RANK(XC[[#This Row],[Royston Ladies Times]],XC[Royston Ladies Times],1))+1,0)","v":0},{"$f":"Hatime(XC[[#This Row],[Royston Time]])","v":"00:38:27"},null,null,{"$f":"IFERROR((HOUR(XC[[#This Row],[Watford Time]])*3600)+MINUTE(XC[[#This Row],[Watford Time]])*60+SECOND(XC[[#This Row],[Watford Time]]),\"\")","v":""},{"$f":"IFERROR(IF(FIND(\"M\",XC[[#This Row],[Group]])>0,XC[[#This Row],[Watford Seconds]],\"errorif\"),\"\")","v":""},{"$f":"IFERROR(IF(FIND(\"F\",XC[[#This Row],[Group]])>0,XC[[#This Row],[Watford Seconds]],\"errorif\"),\"\")","v":""},{"$f":"IF(ISNUMBER(XC[[#This Row],[Watford Mens Time]]),50-(RANK(XC[[#This Row],[Watford Mens Time]],XC[Watford Mens Time],1))+1,0)","v":0},{"$f":"IF(ISNUMBER(XC[[#This Row],[Watford  Ladies Time]]),50-(RANK(XC[[#This Row],[Watford  Ladies Time]],XC[Watford  Ladies Time],1))+1,0)","v":0},{"$f":"Hatime(XC[[#This Row],[WTime]])","v":""},null,null,null,null,{"$f":"IFERROR(IF(FIND(\"F\",XC[[#This Row],[Group]])>0,XC[[#This Row],[Cheshunt Second]],\"errorif\"),\"\")","v":""},{"$f":"IF(ISNUMBER(XC[[#This Row],[Cheshunt Mens Time]]),50-(RANK(XC[[#This Row],[Cheshunt Mens Time]],XC[Cheshunt Mens Time],1))+1,0)","v":0},{"$f":"IF(ISNUMBER(XC[[#This Row],[Cheshunt ladies Time]]),50-(RANK(XC[[#This Row],[Cheshunt ladies Time]],XC[Cheshunt ladies Time],1))+1,0)","v":0},null,null,null,null,51,"00:31:35",null,{"$f":"(HOUR(XC[[#This Row],[Grovelands Mens Time]])*3600)+MINUTE(XC[[#This Row],[Grovelands Mens Time]])*60+SECOND(XC[[#This Row],[Grovelands Mens Time]])","v":1895}," ",{"$f":"IF(ISNUMBER(XC[[#This Row],[Glands Mens Secs]]),50-(RANK(XC[[#This Row],[Glands Mens Secs]],XC[Glands Mens Secs],1))+1,0)","v":47},{"$f":"IF(ISNUMBER(XC[[#This Row],[Gland Ladies Secs]]),50-(RANK(XC[[#This Row],[Gland Ladies Secs]],XC[Gland Ladies Secs],1))+1,0)","v":0},40,{"$f":"IF(ISNUMBER(XC[[#This Row],[TP Mens Secs]]),50-_xlfn.RANK.EQ(XC[[#This Row],[TP Mens Secs]],XC[TP Mens Secs],1)+1,0)","v":45},{"$f":"IF(ISNUMBER(XC[[#This Row],[TP Ladies Secs]]),50-_xlfn.RANK.EQ(XC[[#This Row],[TP Ladies Secs]],XC[TP Ladies Secs],1)+1,0)","v":0},"00:31:58","",1918,""]
[null,"Andrew","Hazley-Payne",{"$f":"TRIM(XC[[#This Row],[N1]])&\" \"&TRIM(XC[[#This Row],[N2]])","v":"Andrew Hazley-Payne"},null,{"$f":"VLOOKUP(XC[[#This Row],[Name]],members,2,0)","v":237},"M",{"$f":"VLOOKUP(XC[[#This Row],[Mem]],Allmembers[],7,FALSE)","v":"MV40"},{"$f":"COUNT(XC[[#This Row],[Royston Race Position]],XC[[#This Row],[Watford Race Position]],XC[[#This Row],[Cheshut place]],XC[[#This Row],[Watford Challenge Place]],XC[[#This Row],[Grovelands place]],XC[[#This Row],[Trent Park Pos]])","v":1},{"$f":"IF(XC[[#This Row],[Gender]]=\"M\",XC[[#This Row],[Royston Mens Points]]+XC[[#This Row],[Watford Mens Points]]+XC[[#This Row],[Cheshunt Mens Points]]+XC[[#This Row],[Watford Challenge Mens Points]]+XC[[#This Row],[Gland Mens Points]]+XC[[#This Row],[Trent Park Mens Points]],XC[[#This Row],[Royston Ladies Points]]+XC[[#This Row],[Waftord Ladies Points]]+XC[[#This Row],[Cheshunt Ladies Point]]+XC[[#This Row],[Watford Challenge Ladies Points]]+XC[[#This Row],[Gland Ladies Points]]+XC[[#This Row],[Trent Park Ladies Points]])","v":38},null," ",{"$f":"IF(XC[[#This Row],[Royston Time2]]>\" \",(HOUR(XC[[#This Row],[Royston Time2]])*3600)+MINUTE(XC[[#This Row],[Royston Time2]])*60+SECOND(XC[[#This Row],[Royston Time2]]),\"\")","v":""},null,{"$f":"IFERROR(IF(FIND(\"F\",XC[[#This Row],[Group]])>0,XC[[#This Row],[Royston Seconds]],\"errorif\"),\"\")","v":""},{"$f":"IF(ISNUMBER(XC[[#This Row],[Royston Mens Time]]),50-(RANK(XC[[#This Row],[Royston Mens Time]],XC[Royston Mens Time],1))+1,0)","v":0},{"$f":"IF(ISNUMBER(XC[[#This Row],[Royston Ladies Times]]),50-(RANK(XC[[#This Row],[Royston Ladies Times]],XC[Royston Ladies Times],1))+1,0)","v":0}," ",155,"48:30",{"$f":"IFERROR((HOUR(XC[[#This Row],[Watford Time]])*3600)+MINUTE(XC[[#This Row],[Watford Time]])*60+SECOND(XC[[#This Row],[Watford Time]]),\"\")","v":2910},{"$f":"IFERROR(IF(FIND(\"M\",XC[[#This Row],[Group]])>0,XC[[#This Row],[Watford Seconds]],\"errorif\"),\"\")","v":2910},{"$f":"IFERROR(IF(FIND(\"F\",XC[[#This Row],[Group]])>0,XC[[#This Row],[Watford Seconds]],\"errorif\"),\"\")","v":""},{"$f":"IF(ISNUMBER(XC[[#This Row],[Watford Mens Time]]),50-(RANK(XC[[#This Row],[Watford Mens Time]],XC[Watford Mens Time],1))+1,0)","v":38},{"$f":"IF(ISNUMBER(XC[[#This Row],[Watford  Ladies Time]]),50-(RANK(XC[[#This Row],[Watford  Ladies Time]],XC[Watford  Ladies Time],1))+1,0)","v":0},{"$f":"Hatime(XC[[#This Row],[WTime]])","v":"00:48:30"},null,null,null,null,{"$f":"IFERROR(IF(FIND(\"F\",XC[[#This Row],[Group]])>0,XC[[#This Row],[Cheshunt Second]],\"errorif\"),\"\")","v":""},{"$f":"IF(ISNUMBER(XC[[#This Row],[Cheshunt Mens Time]]),50-(RANK(XC[[#This Row],[Cheshunt Mens Time]],XC[Cheshunt Mens Time],1))+1,0)","v":0},{"$f":"IF(ISNUMBER(XC[[#This Row],[Cheshunt ladies Time]]),50-(RANK(XC[[#This Row],[Cheshunt ladies Time]],XC[Cheshunt ladies Time],1))+1,0)","v":0},null,null,null,null,null,null,null," "," ",{"$f":"IF(ISNUMBER(XC[[#This Row],[Glands Mens Secs]]),50-(RANK(XC[[#This Row],[Glands Mens Secs]],XC[Glands Mens Secs],1))+1,0)","v":0},{"$f":"IF(ISNUMBER(XC[[#This Row],[Gland Ladies Secs]]),50-(RANK(XC[[#This Row],[Gland Ladies Secs]],XC[Gland Ladies Secs],1))+1,0)","v":0},"  ",{"$f":"IF(ISNUMBER(XC[[#This Row],[TP Mens Secs]]),50-_xlfn.RANK.EQ(XC[[#This Row],[TP Mens Secs]],XC[TP Mens Secs],1)+1,0)","v":0},{"$f":"IF(ISNUMBER(XC[[#This Row],[TP Ladies Secs]]),50-_xlfn.RANK.EQ(XC[[#This Row],[TP Ladies Secs]],XC[TP Ladies Secs],1)+1,0)","v":0}]
[null,"Andy","Jordan",{"$f":"TRIM(XC[[#This Row],[N1]])&\" \"&TRIM(XC[[#This Row],[N2]])","v":"Andy Jordan"},1,{"$f":"VLOOKUP(XC[[#This Row],[Name]],members,2,0)","v":239},"M",{"$f":"VLOOKUP(XC[[#This Row],[Mem]],Allmembers[],7,FALSE)","v":"MV50"},{"$f":"COUNT(XC[[#This Row],[Royston Race Position]],XC[[#This Row],[Watford Race Position]],XC[[#This Row],[Cheshut place]],XC[[#This Row],[Watford Challenge Place]],XC[[#This Row],[Grovelands place]],XC[[#This Row],[Trent Park Pos]])","v":4},{"$f":"IF(XC[[#This Row],[Gender]]=\"M\",XC[[#This Row],[Royston Mens Points]]+XC[[#This Row],[Watford Mens Points]]+XC[[#This Row],[Cheshunt Mens Points]]+XC[[#This Row],[Watford Challenge Mens Points]]+XC[[#This Row],[Gland Mens Points]]+XC[[#This Row],[Trent Park Mens Points]],XC[[#This Row],[Royston Ladies Points]]+XC[[#This Row],[Waftord Ladies Points]]+XC[[#This Row],[Cheshunt Ladies Point]]+XC[[#This Row],[Watford Challenge Ladies Points]]+XC[[#This Row],[Gland Ladies Points]]+XC[[#This Row],[Trent Park Ladies Points]])","v":172},53,"39:41",{"$f":"IF(XC[[#This Row],[Royston Time2]]>\" \",(HOUR(XC[[#This Row],[Royston Time2]])*3600)+MINUTE(XC[[#This Row],[Royston Time2]])*60+SECOND(XC[[#This Row],[Royston Time2]]),\"\")","v":2381},{"$f":"IFERROR(IF(FIND(\"M\",XC[[#This Row],[Group]])>0,XC[[#This Row],[Royston Seconds]],\"errorif\"),\"\")","v":2381},{"$f":"IFERROR(IF(FIND(\"F\",XC[[#This Row],[Group]])>0,XC[[#This Row],[Royston Seconds]],\"errorif\"),\"\")","v":""},{"$f":"IF(ISNUMBER(XC[[#This Row],[Royston Mens Time]]),50-(RANK(XC[[#This Row],[Royston Mens Time]],XC[Royston Mens Time],1))+1,0)","v":43},{"$f":"IF(ISNUMBER(XC[[#This Row],[Royston Ladies Times]]),50-(RANK(XC[[#This Row],[Royston Ladies Times]],XC[Royston Ladies Times],1))+1,0)","v":0},{"$f":"Hatime(XC[[#This Row],[Royston Time]])","v":"00:39:41"},null,null,{"$f":"IFERROR((HOUR(XC[[#This Row],[Watford Time]])*3600)+MINUTE(XC[[#This Row],[Watford Time]])*60+SECOND(XC[[#This Row],[Watford Time]]),\"\")","v":""},{"$f":"IFERROR(IF(FIND(\"M\",XC[[#This Row],[Group]])>0,XC[[#This Row],[Watford Seconds]],\"errorif\"),\"\")","v":""},{"$f":"IFERROR(IF(FIND(\"F\",XC[[#This Row],[Group]])>0,XC[[#This Row],[Watford Seconds]],\"errorif\"),\"\")","v":""},{"$f":"IF(ISNUMBER(XC[[#This Row],[Watford Mens Time]]),50-(RANK(XC[[#This Row],[Watford Mens Time]],XC[Watford Mens Time],1))+1,0)","v":0},{"$f":"IF(ISNUMBER(XC[[#This Row],[Watford  Ladies Time]]),50-(RANK(XC[[#This Row],[Watford  Ladies Time]],XC[Watford  Ladies Time],1))+1,0)","v":0},{"$f":"Hatime(XC[[#This Row],[WTime]])","v":""},"00:33:29",52,{"$f":"(HOUR(XC[[#This Row],[Cheshunt  wtime]])*3600)+MINUTE(XC[[#This Row],[Cheshunt  wtime]])*60+SECOND(XC[[#This Row],[Cheshunt  wtime]])","v":2009},{"$f":"IFERROR(IF(FIND(\"M\",XC[[#This Row],[Group]])>0,XC[[#This Row],[Cheshunt Second]],\"errorif\"),\"\")","v":2009},{"$f":"IFERROR(IF(FIND(\"F\",XC[[#This Row],[Group]])>0,XC[[#This Row],[Cheshunt Second]],\"errorif\"),\"\")","v":""},{"$f":"IF(ISNUMBER(XC[[#This Row],[Cheshunt Mens Time]]),50-(RANK(XC[[#This Row],[Cheshunt Mens Time]],XC[Cheshunt Mens Time],1))+1,0)","v":44},{"$f":"IF(ISNUMBER(XC[[#This Row],[Cheshunt ladies Time]]),50-(RANK(XC[[#This Row],[Cheshunt ladies Time]],XC[Cheshunt ladies Time],1))+1,0)","v":0},null,null,null,null,79,"00:32:52",null,{"$f":"(HOUR(XC[[#This Row],[Grovelands Mens Time]])*3600)+MINUTE(XC[[#This Row],[Grovelands Mens Time]])*60+SECOND(XC[[#This Row],[Grovelands Mens Time]])","v":1972}," ",{"$f":"IF(ISNUMBER(XC[[#This Row],[Glands Mens Secs]]),50-(RANK(XC[[#This Row],[Glands Mens Secs]],XC[Glands Mens Secs],1))+1,0)","v":42},{"$f":"IF(ISNUMBER(XC[[#This Row],[Gland Ladies Secs]]),50-(RANK(XC[[#This Row],[Gland Ladies Secs]],XC[Gland Ladies Secs],1))+1,0)","v":0},53,{"$f":"IF(ISNUMBER(XC[[#This Row],[TP Mens Secs]]),50-_xlfn.RANK.EQ(XC[[#This Row],[TP Mens Secs]],XC[TP Mens Secs],1)+1,0)","v":43},{"$f":"IF(ISNUMBER(XC[[#This Row],[TP Ladies Secs]]),50-_xlfn.RANK.EQ(XC[[#This Row],[TP Ladies Secs]],XC[TP Ladies Secs],1)+1,0)","v":0},"00:32:17","",1937,""]
[null,"Jamie","Davies",{"$f":"TRIM(XC[[#This Row],[N1]])&\" \"&TRIM(XC[[#This Row],[N2]])","v":"Jamie Davies"},1,{"$f":"VLOOKUP(XC[[#This Row],[Name]],members,2,0)","v":240},"M",{"$f":"VLOOKUP(XC[[#This Row],[Mem]],Allmembers[],7,FALSE)","v":"MS"},{"$f":"COUNT(XC[[#This Row],[Royston Race Position]],XC[[#This Row],[Watford Race Position]],XC[[#This Row],[Cheshut place]],XC[[#This Row],[Watford Challenge Place]],XC[[#This Row],[Grovelands place]],XC[[#This Row],[Trent Park Pos]])","v":5},{"$f":"IF(XC[[#This Row],[Gender]]=\"M\",XC[[#This Row],[Royston Mens Points]]+XC[[#This Row],[Watford Mens Points]]+XC[[#This Row],[Cheshunt Mens Points]]+XC[[#This Row],[Watford Challenge Mens Points]]+XC[[#This Row],[Gland Mens Points]]+XC[[#This Row],[Trent Park Mens Points]],XC[[#This Row],[Royston Ladies Points]]+XC[[#This Row],[Waftord Ladies Points]]+XC[[#This Row],[Cheshunt Ladies Point]]+XC[[#This Row],[Watford Challenge Ladies Points]]+XC[[#This Row],[Gland Ladies Points]]+XC[[#This Row],[Trent Park Ladies Points]])","v":156},274,"56:24",{"$f":"IF(XC[[#This Row],[Royston Time2]]>\" \",(HOUR(XC[[#This Row],[Royston Time2]])*3600)+MINUTE(XC[[#This Row],[Royston Time2]])*60+SECOND(XC[[#This Row],[Royston Time2]]),\"\")","v":3384},{"$f":"IFERROR(IF(FIND(\"M\",XC[[#This Row],[Group]])>0,XC[[#This Row],[Royston Seconds]],\"errorif\"),\"\")","v":3384},{"$f":"IFERROR(IF(FIND(\"F\",XC[[#This Row],[Group]])>0,XC[[#This Row],[Royston Seconds]],\"errorif\"),\"\")","v":""},{"$f":"IF(ISNUMBER(XC[[#This Row],[Royston Mens Time]]),50-(RANK(XC[[#This Row],[Royston Mens Time]],XC[Royston Mens Time],1))+1,0)","v":33},{"$f":"IF(ISNUMBER(XC[[#This Row],[Royston Ladies Times]]),50-(RANK(XC[[#This Row],[Royston Ladies Times]],XC[Royston Ladies Times],1))+1,0)","v":0},{"$f":"Hatime(XC[[#This Row],[Royston Time]])","v":"00:56:24"},277,"62:18",{"$f":"IFERROR((HOUR(XC[[#This Row],[Watford Time]])*3600)+MINUTE(XC[[#This Row],[Watford Time]])*60+SECOND(XC[[#This Row],[Watford Time]]),\"\")","v":3738},{"$f":"IFERROR(IF(FIND(\"M\",XC[[#This Row],[Group]])>0,XC[[#This Row],[Watford Seconds]],\"errorif\"),\"\")","v":3738},{"$f":"IFERROR(IF(FIND(\"F\",XC[[#This Row],[Group]])>0,XC[[#This Row],[Watford Seconds]],\"errorif\"),\"\")","v":""},{"$f":"IF(ISNUMBER(XC[[#This Row],[Watford Mens Time]]),50-(RANK(XC[[#This Row],[Watford Mens Time]],XC[Watford Mens Time],1))+1,0)","v":33},{"$f":"IF(ISNUMBER(XC[[#This Row],[Watford  Ladies Time]]),50-(RANK(XC[[#This Row],[Watford  Ladies Time]],XC[Watford  Ladies Time],1))+1,0)","v":0},{"$f":"Hatime(XC[[#This Row],[WTime]])","v":"01:02:18"},"00:44:24",290,{"$f":"(HOUR(XC[[#This Row],[Cheshunt  wtime]])*3600)+MINUTE(XC[[#This Row],[Cheshunt  wtime]])*60+SECOND(XC[[#This Row],[Cheshunt  wtime]])","v":2664},{"$f":"IFERROR(IF(FIND(\"M\",XC[[#This Row],[Group]])>0,XC[[#This Row],[Cheshunt Second]],\"errorif\"),\"\")","v":2664},{"$f":"IFERROR(IF(FIND(\"F\",XC[[#This Row],[Group]])>0,XC[[#This Row],[Cheshunt Second]],\"errorif\"),\"\")","v":""},{"$f":"IF(ISNUMBER(XC[[#This Row],[Cheshunt Mens Time]]),50-(RANK(XC[[#This Row],[Cheshunt Mens Time]],XC[Cheshunt Mens Time],1))+1,0)","v":27},{"$f":"IF(ISNUMBER(XC[[#This Row],[Cheshunt ladies Time]]),50-(RANK(XC[[#This Row],[Cheshunt ladies Time]],XC[Cheshunt ladies Time],1))+1,0)","v":0},null,null,null,null,288,"00:41:52",null,{"$f":"(HOUR(XC[[#This Row],[Grovelands Mens Time]])*3600)+MINUTE(XC[[#This Row],[Grovelands Mens Time]])*60+SECOND(XC[[#This Row],[Grovelands Mens Time]])","v":2512}," ",{"$f":"IF(ISNUMBER(XC[[#This Row],[Glands Mens Secs]]),50-(RANK(XC[[#This Row],[Glands Mens Secs]],XC[Glands Mens Secs],1))+1,0)","v":29},{"$f":"IF(ISNUMBER(XC[[#This Row],[Gland Ladies Secs]]),50-(RANK(XC[[#This Row],[Gland Ladies Secs]],XC[Gland Ladies Secs],1))+1,0)","v":0},264,{"$f":"IF(ISNUMBER(XC[[#This Row],[TP Mens Secs]]),50-_xlfn.RANK.EQ(XC[[#This Row],[TP Mens Secs]],XC[TP Mens Secs],1)+1,0)","v":34},{"$f":"IF(ISNUMBER(XC[[#This Row],[TP Ladies Secs]]),50-_xlfn.RANK.EQ(XC[[#This Row],[TP Ladies Secs]],XC[TP Ladies Secs],1)+1,0)","v":0},"00:43:14","",2594,""]
[null,"Lorna","Townsend",{"$f":"TRIM(XC[[#This Row],[N1]])&\" \"&TRIM(XC[[#This Row],[N2]])","v":"Lorna Townsend"},null,{"$f":"VLOOKUP(XC[[#This Row],[Name]],members,2,0)","v":242},"W",{"$f":"VLOOKUP(XC[[#This Row],[Mem]],Allmembers[],7,FALSE)","v":"F"},{"$f":"COUNT(XC[[#This Row],[Royston Race Position]],XC[[#This Row],[Watford Race Position]],XC[[#This Row],[Cheshut place]],XC[[#This Row],[Watford Challenge Place]],XC[[#This Row],[Grovelands place]],XC[[#This Row],[Trent Park Pos]])","v":2},{"$f":"IF(XC[[#This Row],[Gender]]=\"M\",XC[[#This Row],[Royston Mens Points]]+XC[[#This Row],[Watford Mens Points]]+XC[[#This Row],[Cheshunt Mens Points]]+XC[[#This Row],[Watford Challenge Mens Points]]+XC[[#This Row],[Gland Mens Points]]+XC[[#This Row],[Trent Park Mens Points]],XC[[#This Row],[Royston Ladies Points]]+XC[[#This Row],[Waftord Ladies Points]]+XC[[#This Row],[Cheshunt Ladies Point]]+XC[[#This Row],[Watford Challenge Ladies Points]]+XC[[#This Row],[Gland Ladies Points]]+XC[[#This Row],[Trent Park Ladies Points]])","v":86},277,"56:33",{"$f":"IF(XC[[#This Row],[Royston Time2]]>\" \",(HOUR(XC[[#This Row],[Royston Time2]])*3600)+MINUTE(XC[[#This Row],[Royston Time2]])*60+SECOND(XC[[#This Row],[Royston Time2]]),\"\")","v":3393},{"$f":"IFERROR(IF(FIND(\"M\",XC[[#This Row],[Group]])>0,XC[[#This Row],[Royston Seconds]],\"errorif\"),\"\")","v":""},{"$f":"IFERROR(IF(FIND(\"F\",XC[[#This Row],[Group]])>0,XC[[#This Row],[Royston Seconds]],\"errorif\"),\"\")","v":3393},{"$f":"IF(ISNUMBER(XC[[#This Row],[Royston Mens Time]]),50-(RANK(XC[[#This Row],[Royston Mens Time]],XC[Royston Mens Time],1))+1,0)","v":0},{"$f":"IF(ISNUMBER(XC[[#This Row],[Royston Ladies Times]]),50-(RANK(XC[[#This Row],[Royston Ladies Times]],XC[Royston Ladies Times],1))+1,\"\")","v":43},{"$f":"Hatime(XC[[#This Row],[Royston Time]])","v":"00:56:33"},271,"60:27",{"$f":"IFERROR((HOUR(XC[[#This Row],[Watford Time]])*3600)+MINUTE(XC[[#This Row],[Watford Time]])*60+SECOND(XC[[#This Row],[Watford Time]]),\"\")","v":3627},{"$f":"IFERROR(IF(FIND(\"M\",XC[[#This Row],[Group]])>0,XC[[#This Row],[Watford Seconds]],\"errorif\"),\"\")","v":""},{"$f":"IFERROR(IF(FIND(\"F\",XC[[#This Row],[Group]])>0,XC[[#This Row],[Watford Seconds]],\"errorif\"),\"\")","v":3627},{"$f":"IF(ISNUMBER(XC[[#This Row],[Watford Mens Time]]),50-(RANK(XC[[#This Row],[Watford Mens Time]],XC[Watford Mens Time],1))+1,0)","v":0},{"$f":"IF(ISNUMBER(XC[[#This Row],[Watford  Ladies Time]]),50-(RANK(XC[[#This Row],[Watford  Ladies Time]],XC[Watford  Ladies Time],1))+1,0)","v":43},{"$f":"Hatime(XC[[#This Row],[WTime]])","v":"01:00:27"},null,null," ",{"$f":"IFERROR(IF(FIND(\"M\",XC[[#This Row],[Group]])>0,XC[[#This Row],[Cheshunt Second]],\"errorif\"),\"\")","v":""},{"$f":"IFERROR(IF(FIND(\"F\",XC[[#This Row],[Group]])>0,XC[[#This Row],[Cheshunt Second]],\"errorif\"),\"\")","v":" "},{"$f":"IF(ISNUMBER(XC[[#This Row],[Cheshunt Mens Time]]),50-(RANK(XC[[#This Row],[Cheshunt Mens Time]],XC[Cheshunt Mens Time],1))+1,0)","v":0},{"$f":"IF(ISNUMBER(XC[[#This Row],[Cheshunt ladies Time]]),50-(RANK(XC[[#This Row],[Cheshunt ladies Time]],XC[Cheshunt ladies Time],1))+1,0)","v":0},null,null,null,null,null,null,null," "," ",{"$f":"IF(ISNUMBER(XC[[#This Row],[Glands Mens Secs]]),50-(RANK(XC[[#This Row],[Glands Mens Secs]],XC[Glands Mens Secs],1))+1,0)","v":0},{"$f":"IF(ISNUMBER(XC[[#This Row],[Gland Ladies Secs]]),50-(RANK(XC[[#This Row],[Gland Ladies Secs]],XC[Gland Ladies Secs],1))+1,0)","v":0},"  ",{"$f":"IF(ISNUMBER(XC[[#This Row],[TP Mens Secs]]),50-_xlfn.RANK.EQ(XC[[#This Row],[TP Mens Secs]],XC[TP Mens Secs],1)+1,0)","v":0},{"$f":"IF(ISNUMBER(XC[[#This Row],[TP Ladies Secs]]),50-_xlfn.RANK.EQ(XC[[#This Row],[TP Ladies Secs]],XC[TP Ladies Secs],1)+1,0)","v":0}]
[null,"Julian","Jones",{"$f":"TRIM(XC[[#This Row],[N1]])&\" \"&TRIM(XC[[#This Row],[N2]])","v":"Julian Jones"},null,{"$f":"VLOOKUP(XC[[#This Row],[Name]],members,2,0)","v":243},"M",{"$f":"VLOOKUP(XC[[#This Row],[Mem]],Allmembers[],7,FALSE)","v":"MV40"},{"$f":"COUNT(XC[[#This Row],[Royston Race Position]],XC[[#This Row],[Watford Race Position]],XC[[#This Row],[Cheshut place]],XC[[#This Row],[Watford Challenge Place]],XC[[#This Row],[Grovelands place]],XC[[#This Row],[Trent Park Pos]])","v":3},{"$f":"IF(XC[[#This Row],[Gender]]=\"M\",XC[[#This Row],[Royston Mens Points]]+XC[[#This Row],[Watford Mens Points]]+XC[[#This Row],[Cheshunt Mens Points]]+XC[[#This Row],[Watford Challenge Mens Points]]+XC[[#This Row],[Gland Mens Points]]+XC[[#This Row],[Trent Park Mens Points]],XC[[#This Row],[Royston Ladies Points]]+XC[[#This Row],[Waftord Ladies Points]]+XC[[#This Row],[Cheshunt Ladies Point]]+XC[[#This Row],[Watford Challenge Ladies Points]]+XC[[#This Row],[Gland Ladies Points]]+XC[[#This Row],[Trent Park Ladies Points]])","v":123},60,"40:10",{"$f":"IF(XC[[#This Row],[Royston Time2]]>\" \",(HOUR(XC[[#This Row],[Royston Time2]])*3600)+MINUTE(XC[[#This Row],[Royston Time2]])*60+SECOND(XC[[#This Row],[Royston Time2]]),\"\")","v":2410},{"$f":"IFERROR(IF(FIND(\"M\",XC[[#This Row],[Group]])>0,XC[[#This Row],[Royston Seconds]],\"errorif\"),\"\")","v":2410},{"$f":"IFERROR(IF(FIND(\"F\",XC[[#This Row],[Group]])>0,XC[[#This Row],[Royston Seconds]],\"errorif\"),\"\")","v":""},{"$f":"IF(ISNUMBER(XC[[#This Row],[Royston Mens Time]]),50-(RANK(XC[[#This Row],[Royston Mens Time]],XC[Royston Mens Time],1))+1,0)","v":42},{"$f":"IF(ISNUMBER(XC[[#This Row],[Royston Ladies Times]]),50-(RANK(XC[[#This Row],[Royston Ladies Times]],XC[Royston Ladies Times],1))+1,0)","v":0},{"$f":"Hatime(XC[[#This Row],[Royston Time]])","v":"00:40:10"},64,"42:36",{"$f":"IFERROR((HOUR(XC[[#This Row],[Watford Time]])*3600)+MINUTE(XC[[#This Row],[Watford Time]])*60+SECOND(XC[[#This Row],[Watford Time]]),\"\")","v":2556},{"$f":"IFERROR(IF(FIND(\"M\",XC[[#This Row],[Group]])>0,XC[[#This Row],[Watford Seconds]],\"errorif\"),\"\")","v":2556},{"$f":"IFERROR(IF(FIND(\"F\",XC[[#This Row],[Group]])>0,XC[[#This Row],[Watford Seconds]],\"errorif\"),\"\")","v":""},{"$f":"IF(ISNUMBER(XC[[#This Row],[Watford Mens Time]]),50-(RANK(XC[[#This Row],[Watford Mens Time]],XC[Watford Mens Time],1))+1,0)","v":48},{"$f":"IF(ISNUMBER(XC[[#This Row],[Watford  Ladies Time]]),50-(RANK(XC[[#This Row],[Watford  Ladies Time]],XC[Watford  Ladies Time],1))+1,0)","v":0},{"$f":"Hatime(XC[[#This Row],[WTime]])","v":"00:42:36"},"00:38:17",160,{"$f":"(HOUR(XC[[#This Row],[Cheshunt  wtime]])*3600)+MINUTE(XC[[#This Row],[Cheshunt  wtime]])*60+SECOND(XC[[#This Row],[Cheshunt  wtime]])","v":2297},{"$f":"IFERROR(IF(FIND(\"M\",XC[[#This Row],[Group]])>0,XC[[#This Row],[Cheshunt Second]],\"errorif\"),\"\")","v":2297},{"$f":"IFERROR(IF(FIND(\"F\",XC[[#This Row],[Group]])>0,XC[[#This Row],[Cheshunt Second]],\"errorif\"),\"\")","v":""},{"$f":"IF(ISNUMBER(XC[[#This Row],[Cheshunt Mens Time]]),50-(RANK(XC[[#This Row],[Cheshunt Mens Time]],XC[Cheshunt Mens Time],1))+1,0)","v":33},{"$f":"IF(ISNUMBER(XC[[#This Row],[Cheshunt ladies Time]]),50-(RANK(XC[[#This Row],[Cheshunt ladies Time]],XC[Cheshunt ladies Time],1))+1,0)","v":0},null,null,null,null,null,null,null," "," ",{"$f":"IF(ISNUMBER(XC[[#This Row],[Glands Mens Secs]]),50-(RANK(XC[[#This Row],[Glands Mens Secs]],XC[Glands Mens Secs],1))+1,0)","v":0},{"$f":"IF(ISNUMBER(XC[[#This Row],[Gland Ladies Secs]]),50-(RANK(XC[[#This Row],[Gland Ladies Secs]],XC[Gland Ladies Secs],1))+1,0)","v":0},"  ",{"$f":"IF(ISNUMBER(XC[[#This Row],[TP Mens Secs]]),50-_xlfn.RANK.EQ(XC[[#This Row],[TP Mens Secs]],XC[TP Mens Secs],1)+1,0)","v":0},{"$f":"IF(ISNUMBER(XC[[#This Row],[TP Ladies Secs]]),50-_xlfn.RANK.EQ(XC[[#This Row],[TP Ladies Secs]],XC[TP Ladies Secs],1)+1,0)","v":0}]
[null,"John","Mercer",{"$f":"TRIM(XC[[#This Row],[N1]])&\" \"&TRIM(XC[[#This Row],[N2]])","v":"John Mercer"},null,{"$f":"VLOOKUP(XC[[#This Row],[Name]],members,2,0)","v":252},"M",{"$f":"VLOOKUP(XC[[#This Row],[Mem]],Allmembers[],7,FALSE)","v":"MV50"},{"$f":"COUNT(XC[[#This Row],[Royston Race Position]],XC[[#This Row],[Watford Race Position]],XC[[#This Row],[Cheshut place]],XC[[#This Row],[Watford Challenge Place]],XC[[#This Row],[Grovelands place]],XC[[#This Row],[Trent Park Pos]])","v":1},{"$f":"IF(XC[[#This Row],[Gender]]=\"M\",XC[[#This Row],[Royston Mens Points]]+XC[[#This Row],[Watford Mens Points]]+XC[[#This Row],[Cheshunt Mens Points]]+XC[[#This Row],[Watford Challenge Mens Points]]+XC[[#This Row],[Gland Mens Points]]+XC[[#This Row],[Trent Park Mens Points]],XC[[#This Row],[Royston Ladies Points]]+XC[[#This Row],[Waftord Ladies Points]]+XC[[#This Row],[Cheshunt Ladies Point]]+XC[[#This Row],[Watford Challenge Ladies Points]]+XC[[#This Row],[Gland Ladies Points]]+XC[[#This Row],[Trent Park Ladies Points]])","v":36},null," ",{"$f":"IF(XC[[#This Row],[Royston Time2]]>\" \",(HOUR(XC[[#This Row],[Royston Time2]])*3600)+MINUTE(XC[[#This Row],[Royston Time2]])*60+SECOND(XC[[#This Row],[Royston Time2]]),\"\")","v":""},null,{"$f":"IFERROR(IF(FIND(\"F\",XC[[#This Row],[Group]])>0,XC[[#This Row],[Royston Seconds]],\"errorif\"),\"\")","v":""},{"$f":"IF(ISNUMBER(XC[[#This Row],[Royston Mens Time]]),50-(RANK(XC[[#This Row],[Royston Mens Time]],XC[Royston Mens Time],1))+1,0)","v":0},{"$f":"IF(ISNUMBER(XC[[#This Row],[Royston Ladies Times]]),50-(RANK(XC[[#This Row],[Royston Ladies Times]],XC[Royston Ladies Times],1))+1,0)","v":0}," ",178,"50:20",{"$f":"IFERROR((HOUR(XC[[#This Row],[Watford Time]])*3600)+MINUTE(XC[[#This Row],[Watford Time]])*60+SECOND(XC[[#This Row],[Watford Time]]),\"\")","v":3020},{"$f":"IFERROR(IF(FIND(\"M\",XC[[#This Row],[Group]])>0,XC[[#This Row],[Watford Seconds]],\"errorif\"),\"\")","v":3020},{"$f":"IFERROR(IF(FIND(\"F\",XC[[#This Row],[Group]])>0,XC[[#This Row],[Watford Seconds]],\"errorif\"),\"\")","v":""},{"$f":"IF(ISNUMBER(XC[[#This Row],[Watford Mens Time]]),50-(RANK(XC[[#This Row],[Watford Mens Time]],XC[Watford Mens Time],1))+1,0)","v":36},{"$f":"IF(ISNUMBER(XC[[#This Row],[Watford  Ladies Time]]),50-(RANK(XC[[#This Row],[Watford  Ladies Time]],XC[Watford  Ladies Time],1))+1,0)","v":0},{"$f":"Hatime(XC[[#This Row],[WTime]])","v":"00:50:20"},null,null,null,null,{"$f":"IFERROR(IF(FIND(\"F\",XC[[#This Row],[Group]])>0,XC[[#This Row],[Cheshunt Second]],\"errorif\"),\"\")","v":""},{"$f":"IF(ISNUMBER(XC[[#This Row],[Cheshunt Mens Time]]),50-(RANK(XC[[#This Row],[Cheshunt Mens Time]],XC[Cheshunt Mens Time],1))+1,0)","v":0},{"$f":"IF(ISNUMBER(XC[[#This Row],[Cheshunt ladies Time]]),50-(RANK(XC[[#This Row],[Cheshunt ladies Time]],XC[Cheshunt ladies Time],1))+1,0)","v":0},null,null,null,null,null,null,null," "," ",{"$f":"IF(ISNUMBER(XC[[#This Row],[Glands Mens Secs]]),50-(RANK(XC[[#This Row],[Glands Mens Secs]],XC[Glands Mens Secs],1))+1,0)","v":0},{"$f":"IF(ISNUMBER(XC[[#This Row],[Gland Ladies Secs]]),50-(RANK(XC[[#This Row],[Gland Ladies Secs]],XC[Gland Ladies Secs],1))+1,0)","v":0},"  ",{"$f":"IF(ISNUMBER(XC[[#This Row],[TP Mens Secs]]),50-_xlfn.RANK.EQ(XC[[#This Row],[TP Mens Secs]],XC[TP Mens Secs],1)+1,0)","v":0},{"$f":"IF(ISNUMBER(XC[[#This Row],[TP Ladies Secs]]),50-_xlfn.RANK.EQ(XC[[#This Row],[TP Ladies Secs]],XC[TP Ladies Secs],1)+1,0)","v":0}]
[null,"Georgia","Dench",{"$f":"TRIM(XC[[#This Row],[N1]])&\" \"&TRIM(XC[[#This Row],[N2]])","v":"Georgia Dench"},null,{"$f":"VLOOKUP(XC[[#This Row],[Name]],members,2,0)","v":254},"W",{"$f":"VLOOKUP(XC[[#This Row],[Mem]],Allmembers[],7,FALSE)","v":"FV35"},{"$f":"COUNT(XC[[#This Row],[Royston Race Position]],XC[[#This Row],[Watford Race Position]],XC[[#This Row],[Cheshut place]],XC[[#This Row],[Watford Challenge Place]],XC[[#This Row],[Grovelands place]],XC[[#This Row],[Trent Park Pos]])","v":2},{"$f":"IF(XC[[#This Row],[Gender]]=\"M\",XC[[#This Row],[Royston Mens Points]]+XC[[#This Row],[Watford Mens Points]]+XC[[#This Row],[Cheshunt Mens Points]]+XC[[#This Row],[Watford Challenge Mens Points]]+XC[[#This Row],[Gland Mens Points]]+XC[[#This Row],[Trent Park Mens Points]],XC[[#This Row],[Royston Ladies Points]]+XC[[#This Row],[Waftord Ladies Points]]+XC[[#This Row],[Cheshunt Ladies Point]]+XC[[#This Row],[Watford Challenge Ladies Points]]+XC[[#This Row],[Gland Ladies Points]]+XC[[#This Row],[Trent Park Ladies Points]])","v":99},56,"39:51",{"$f":"IF(XC[[#This Row],[Royston Time2]]>\" \",(HOUR(XC[[#This Row],[Royston Time2]])*3600)+MINUTE(XC[[#This Row],[Royston Time2]])*60+SECOND(XC[[#This Row],[Royston Time2]]),\"\")","v":2391},{"$f":"IFERROR(IF(FIND(\"M\",XC[[#This Row],[Group]])>0,XC[[#This Row],[Royston Seconds]],\"errorif\"),\"\")","v":""},{"$f":"IFERROR(IF(FIND(\"F\",XC[[#This Row],[Group]])>0,XC[[#This Row],[Royston Seconds]],\"errorif\"),\"\")","v":2391},{"$f":"IF(ISNUMBER(XC[[#This Row],[Royston Mens Time]]),50-(RANK(XC[[#This Row],[Royston Mens Time]],XC[Royston Mens Time],1))+1,0)","v":0},{"$f":"IF(ISNUMBER(XC[[#This Row],[Royston Ladies Times]]),50-(RANK(XC[[#This Row],[Royston Ladies Times]],XC[Royston Ladies Times],1))+1,\"\")","v":50},{"$f":"Hatime(XC[[#This Row],[Royston Time]])","v":"00:39:51"},79,"43:52",{"$f":"IFERROR((HOUR(XC[[#This Row],[Watford Time]])*3600)+MINUTE(XC[[#This Row],[Watford Time]])*60+SECOND(XC[[#This Row],[Watford Time]]),\"\")","v":2632},{"$f":"IFERROR(IF(FIND(\"M\",XC[[#This Row],[Group]])>0,XC[[#This Row],[Watford Seconds]],\"errorif\"),\"\")","v":""},{"$f":"IFERROR(IF(FIND(\"F\",XC[[#This Row],[Group]])>0,XC[[#This Row],[Watford Seconds]],\"errorif\"),\"\")","v":2632},{"$f":"IF(ISNUMBER(XC[[#This Row],[Watford Mens Time]]),50-(RANK(XC[[#This Row],[Watford Mens Time]],XC[Watford Mens Time],1))+1,0)","v":0},{"$f":"IF(ISNUMBER(XC[[#This Row],[Watford  Ladies Time]]),50-(RANK(XC[[#This Row],[Watford  Ladies Time]],XC[Watford  Ladies Time],1))+1,0)","v":49},{"$f":"Hatime(XC[[#This Row],[WTime]])","v":"00:43:52"},null,null," ",{"$f":"IFERROR(IF(FIND(\"M\",XC[[#This Row],[Group]])>0,XC[[#This Row],[Cheshunt Second]],\"errorif\"),\"\")","v":""},{"$f":"IFERROR(IF(FIND(\"F\",XC[[#This Row],[Group]])>0,XC[[#This Row],[Cheshunt Second]],\"errorif\"),\"\")","v":" "},{"$f":"IF(ISNUMBER(XC[[#This Row],[Cheshunt Mens Time]]),50-(RANK(XC[[#This Row],[Cheshunt Mens Time]],XC[Cheshunt Mens Time],1))+1,0)","v":0},{"$f":"IF(ISNUMBER(XC[[#This Row],[Cheshunt ladies Time]]),50-(RANK(XC[[#This Row],[Cheshunt ladies Time]],XC[Cheshunt ladies Time],1))+1,0)","v":0},null,null,null,null,null,null,null," "," ",{"$f":"IF(ISNUMBER(XC[[#This Row],[Glands Mens Secs]]),50-(RANK(XC[[#This Row],[Glands Mens Secs]],XC[Glands Mens Secs],1))+1,0)","v":0},{"$f":"IF(ISNUMBER(XC[[#This Row],[Gland Ladies Secs]]),50-(RANK(XC[[#This Row],[Gland Ladies Secs]],XC[Gland Ladies Secs],1))+1,0)","v":0},"  ",{"$f":"IF(ISNUMBER(XC[[#This Row],[TP Mens Secs]]),50-_xlfn.RANK.EQ(XC[[#This Row],[TP Mens Secs]],XC[TP Mens Secs],1)+1,0)","v":0},{"$f":"IF(ISNUMBER(XC[[#This Row],[TP Ladies Secs]]),50-_xlfn.RANK.EQ(XC[[#This Row],[TP Ladies Secs]],XC[TP Ladies Secs],1)+1,0)","v":0}]
[null,"Sarah","Chilvers",{"$f":"TRIM(XC[[#This Row],[N1]])&\" \"&TRIM(XC[[#This Row],[N2]])","v":"Sarah Chilvers"},1,{"$f":"VLOOKUP(XC[[#This Row],[Name]],members,2,0)","v":257},"W",{"$f":"VLOOKUP(XC[[#This Row],[Mem]],Allmembers[],7,FALSE)","v":"FV55"},{"$f":"COUNT(XC[[#This Row],[Royston Race Position]],XC[[#This Row],[Watford Race Position]],XC[[#This Row],[Cheshut place]],XC[[#This Row],[Watford Challenge Place]],XC[[#This Row],[Grovelands place]],XC[[#This Row],[Trent Park Pos]])","v":5},{"$f":"IF(XC[[#This Row],[Gender]]=\"M\",XC[[#This Row],[Royston Mens Points]]+XC[[#This Row],[Watford Mens Points]]+XC[[#This Row],[Cheshunt Mens Points]]+XC[[#This Row],[Watford Challenge Mens Points]]+XC[[#This Row],[Gland Mens Points]]+XC[[#This Row],[Trent Park Mens Points]],XC[[#This Row],[Royston Ladies Points]]+XC[[#This Row],[Waftord Ladies Points]]+XC[[#This Row],[Cheshunt Ladies Point]]+XC[[#This Row],[Watford Challenge Ladies Points]]+XC[[#This Row],[Gland Ladies Points]]+XC[[#This Row],[Trent Park Ladies Points]])","v":229},226,"51:33",{"$f":"IF(XC[[#This Row],[Royston Time2]]>\" \",(HOUR(XC[[#This Row],[Royston Time2]])*3600)+MINUTE(XC[[#This Row],[Royston Time2]])*60+SECOND(XC[[#This Row],[Royston Time2]]),\"\")","v":3093},{"$f":"IFERROR(IF(FIND(\"M\",XC[[#This Row],[Group]])>0,XC[[#This Row],[Royston Seconds]],\"errorif\"),\"\")","v":""},{"$f":"IFERROR(IF(FIND(\"F\",XC[[#This Row],[Group]])>0,XC[[#This Row],[Royston Seconds]],\"errorif\"),\"\")","v":3093},{"$f":"IF(ISNUMBER(XC[[#This Row],[Royston Mens Time]]),50-(RANK(XC[[#This Row],[Royston Mens Time]],XC[Royston Mens Time],1))+1,0)","v":0},{"$f":"IF(ISNUMBER(XC[[#This Row],[Royston Ladies Times]]),50-(RANK(XC[[#This Row],[Royston Ladies Times]],XC[Royston Ladies Times],1))+1,\"\")","v":45},{"$f":"Hatime(XC[[#This Row],[Royston Time]])","v":"00:51:33"},252,"57:27",{"$f":"IFERROR((HOUR(XC[[#This Row],[Watford Time]])*3600)+MINUTE(XC[[#This Row],[Watford Time]])*60+SECOND(XC[[#This Row],[Watford Time]]),\"\")","v":3447},{"$f":"IFERROR(IF(FIND(\"M\",XC[[#This Row],[Group]])>0,XC[[#This Row],[Watford Seconds]],\"errorif\"),\"\")","v":""},{"$f":"IFERROR(IF(FIND(\"F\",XC[[#This Row],[Group]])>0,XC[[#This Row],[Watford Seconds]],\"errorif\"),\"\")","v":3447},{"$f":"IF(ISNUMBER(XC[[#This Row],[Watford Mens Time]]),50-(RANK(XC[[#This Row],[Watford Mens Time]],XC[Watford Mens Time],1))+1,0)","v":0},{"$f":"IF(ISNUMBER(XC[[#This Row],[Watford  Ladies Time]]),50-(RANK(XC[[#This Row],[Watford  Ladies Time]],XC[Watford  Ladies Time],1))+1,0)","v":44},{"$f":"Hatime(XC[[#This Row],[WTime]])","v":"00:57:27"},"00:39:15",187,{"$f":"(HOUR(XC[[#This Row],[Cheshunt  wtime]])*3600)+MINUTE(XC[[#This Row],[Cheshunt  wtime]])*60+SECOND(XC[[#This Row],[Cheshunt  wtime]])","v":2355},{"$f":"IFERROR(IF(FIND(\"M\",XC[[#This Row],[Group]])>0,XC[[#This Row],[Cheshunt Second]],\"errorif\"),\"\")","v":""},{"$f":"IFERROR(IF(FIND(\"F\",XC[[#This Row],[Group]])>0,XC[[#This Row],[Cheshunt Second]],\"errorif\"),\"\")","v":2355},{"$f":"IF(ISNUMBER(XC[[#This Row],[Cheshunt Mens Time]]),50-(RANK(XC[[#This Row],[Cheshunt Mens Time]],XC[Cheshunt Mens Time],1))+1,0)","v":0},{"$f":"IF(ISNUMBER(XC[[#This Row],[Cheshunt ladies Time]]),50-(RANK(XC[[#This Row],[Cheshunt ladies Time]],XC[Cheshunt ladies Time],1))+1,0)","v":49},null,null,null,null,240,null,"00:39:32"," ",{"$f":"(HOUR(XC[[#This Row],[Grovelands Ladies Time]])*3600)+MINUTE(XC[[#This Row],[Grovelands Ladies Time]])*60+SECOND(XC[[#This Row],[Grovelands Ladies Time]])","v":2372},{"$f":"IF(ISNUMBER(XC[[#This Row],[Glands Mens Secs]]),50-(RANK(XC[[#This Row],[Glands Mens Secs]],XC[Glands Mens Secs],1))+1,0)","v":0},{"$f":"IF(ISNUMBER(XC[[#This Row],[Gland Ladies Secs]]),50-(RANK(XC[[#This Row],[Gland Ladies Secs]],XC[Gland Ladies Secs],1))+1,0)","v":48},216,{"$f":"IF(ISNUMBER(XC[[#This Row],[TP Mens Secs]]),50-_xlfn.RANK.EQ(XC[[#This Row],[TP Mens Secs]],XC[TP Mens Secs],1)+1,0)","v":0},{"$f":"IF(ISNUMBER(XC[[#This Row],[TP Ladies Secs]]),50-_xlfn.RANK.EQ(XC[[#This Row],[TP Ladies Secs]],XC[TP Ladies Secs],1)+1,0)","v":43},"","00:40:10","",2410]
[null,"Gordon","Alexander",{"$f":"TRIM(XC[[#This Row],[N1]])&\" \"&TRIM(XC[[#This Row],[N2]])","v":"Gordon Alexander"},1,{"$f":"VLOOKUP(XC[[#This Row],[Name]],members,2,0)","v":262},"M",{"$f":"VLOOKUP(XC[[#This Row],[Mem]],Allmembers[],7,FALSE)","v":"MV40"},{"$f":"COUNT(XC[[#This Row],[Royston Race Position]],XC[[#This Row],[Watford Race Position]],XC[[#This Row],[Cheshut place]],XC[[#This Row],[Watford Challenge Place]],XC[[#This Row],[Grovelands place]],XC[[#This Row],[Trent Park Pos]])","v":4},{"$f":"IF(XC[[#This Row],[Gender]]=\"M\",XC[[#This Row],[Royston Mens Points]]+XC[[#This Row],[Watford Mens Points]]+XC[[#This Row],[Cheshunt Mens Points]]+XC[[#This Row],[Watford Challenge Mens Points]]+XC[[#This Row],[Gland Mens Points]]+XC[[#This Row],[Trent Park Mens Points]],XC[[#This Row],[Royston Ladies Points]]+XC[[#This Row],[Waftord Ladies Points]]+XC[[#This Row],[Cheshunt Ladies Point]]+XC[[#This Row],[Watford Challenge Ladies Points]]+XC[[#This Row],[Gland Ladies Points]]+XC[[#This Row],[Trent Park Ladies Points]])","v":169}," ","  ",{"$f":"IF(XC[[#This Row],[Royston Time2]]>\" \",(HOUR(XC[[#This Row],[Royston Time2]])*3600)+MINUTE(XC[[#This Row],[Royston Time2]])*60+SECOND(XC[[#This Row],[Royston Time2]]),\"\")","v":""}," ",{"$f":"IFERROR(IF(FIND(\"F\",XC[[#This Row],[Group]])>0,XC[[#This Row],[Royston Seconds]],\"errorif\"),\"\")","v":""},0,{"$f":"IF(ISNUMBER(XC[[#This Row],[Royston Ladies Times]]),50-(RANK(XC[[#This Row],[Royston Ladies Times]],XC[Royston Ladies Times],1))+1,0)","v":0}," "," "," "," "," ",{"$f":"IFERROR(IF(FIND(\"F\",XC[[#This Row],[Group]])>0,XC[[#This Row],[Watford Seconds]],\"errorif\"),\"\")","v":""},0," "," ","00:34:57",88,{"$f":"(HOUR(XC[[#This Row],[Cheshunt  wtime]])*3600)+MINUTE(XC[[#This Row],[Cheshunt  wtime]])*60+SECOND(XC[[#This Row],[Cheshunt  wtime]])","v":2097},{"$f":"IFERROR(IF(FIND(\"M\",XC[[#This Row],[Group]])>0,XC[[#This Row],[Cheshunt Second]],\"errorif\"),\"\")","v":2097},{"$f":"IFERROR(IF(FIND(\"F\",XC[[#This Row],[Group]])>0,XC[[#This Row],[Cheshunt Second]],\"errorif\"),\"\")","v":""},{"$f":"IF(ISNUMBER(XC[[#This Row],[Cheshunt Mens Time]]),50-(RANK(XC[[#This Row],[Cheshunt Mens Time]],XC[Cheshunt Mens Time],1))+1,0)","v":40},{"$f":"IF(ISNUMBER(XC[[#This Row],[Cheshunt ladies Time]]),50-(RANK(XC[[#This Row],[Cheshunt ladies Time]],XC[Cheshunt ladies Time],1))+1,0)","v":0},16,47,null,2.3738425925925923E-2,97,"00:33:29",null,{"$f":"(HOUR(XC[[#This Row],[Grovelands Mens Time]])*3600)+MINUTE(XC[[#This Row],[Grovelands Mens Time]])*60+SECOND(XC[[#This Row],[Grovelands Mens Time]])","v":2009}," ",{"$f":"IF(ISNUMBER(XC[[#This Row],[Glands Mens Secs]]),50-(RANK(XC[[#This Row],[Glands Mens Secs]],XC[Glands Mens Secs],1))+1,0)","v":40},{"$f":"IF(ISNUMBER(XC[[#This Row],[Gland Ladies Secs]]),50-(RANK(XC[[#This Row],[Gland Ladies Secs]],XC[Gland Ladies Secs],1))+1,0)","v":0},60,{"$f":"IF(ISNUMBER(XC[[#This Row],[TP Mens Secs]]),50-_xlfn.RANK.EQ(XC[[#This Row],[TP Mens Secs]],XC[TP Mens Secs],1)+1,0)","v":42},{"$f":"IF(ISNUMBER(XC[[#This Row],[TP Ladies Secs]]),50-_xlfn.RANK.EQ(XC[[#This Row],[TP Ladies Secs]],XC[TP Ladies Secs],1)+1,0)","v":0},"00:32:52","",1972,""]
[null,"Patrick","McGuinness",{"$f":"TRIM(XC[[#This Row],[N1]])&\" \"&TRIM(XC[[#This Row],[N2]])","v":"Patrick McGuinness"},null,{"$f":"VLOOKUP(XC[[#This Row],[Name]],members,2,0)","v":269},"M",{"$f":"VLOOKUP(XC[[#This Row],[Mem]],Allmembers[],7,FALSE)","v":"MV40"},{"$f":"COUNT(XC[[#This Row],[Royston Race Position]],XC[[#This Row],[Watford Race Position]],XC[[#This Row],[Cheshut place]],XC[[#This Row],[Watford Challenge Place]],XC[[#This Row],[Grovelands place]],XC[[#This Row],[Trent Park Pos]])","v":1},{"$f":"IF(XC[[#This Row],[Gender]]=\"M\",XC[[#This Row],[Royston Mens Points]]+XC[[#This Row],[Watford Mens Points]]+XC[[#This Row],[Cheshunt Mens Points]]+XC[[#This Row],[Watford Challenge Mens Points]]+XC[[#This Row],[Gland Mens Points]]+XC[[#This Row],[Trent Park Mens Points]],XC[[#This Row],[Royston Ladies Points]]+XC[[#This Row],[Waftord Ladies Points]]+XC[[#This Row],[Cheshunt Ladies Point]]+XC[[#This Row],[Watford Challenge Ladies Points]]+XC[[#This Row],[Gland Ladies Points]]+XC[[#This Row],[Trent Park Ladies Points]])","v":39},null," ",{"$f":"IF(XC[[#This Row],[Royston Time2]]>\" \",(HOUR(XC[[#This Row],[Royston Time2]])*3600)+MINUTE(XC[[#This Row],[Royston Time2]])*60+SECOND(XC[[#This Row],[Royston Time2]]),\"\")","v":""},{"$f":"IFERROR(IF(FIND(\"M\",XC[[#This Row],[Group]])>0,XC[[#This Row],[Royston Seconds]],\"errorif\"),\"\")","v":""},{"$f":"IFERROR(IF(FIND(\"F\",XC[[#This Row],[Group]])>0,XC[[#This Row],[Royston Seconds]],\"errorif\"),\"\")","v":""},0,{"$f":"IF(ISNUMBER(XC[[#This Row],[Royston Ladies Times]]),50-(RANK(XC[[#This Row],[Royston Ladies Times]],XC[Royston Ladies Times],1))+1,0)","v":0}," ",null,null,{"$f":"IFERROR((HOUR(XC[[#This Row],[Watford Time]])*3600)+MINUTE(XC[[#This Row],[Watford Time]])*60+SECOND(XC[[#This Row],[Watford Time]]),\"\")","v":""},{"$f":"IFERROR(IF(FIND(\"M\",XC[[#This Row],[Group]])>0,XC[[#This Row],[Watford Seconds]],\"errorif\"),\"\")","v":""},{"$f":"IFERROR(IF(FIND(\"F\",XC[[#This Row],[Group]])>0,XC[[#This Row],[Watford Seconds]],\"errorif\"),\"\")","v":""},{"$f":"IF(ISNUMBER(XC[[#This Row],[Watford Mens Time]]),50-(RANK(XC[[#This Row],[Watford Mens Time]],XC[Watford Mens Time],1))+1,0)","v":0},null,{"$f":"Hatime(XC[[#This Row],[WTime]])","v":""},"00:35:01",90,{"$f":"(HOUR(XC[[#This Row],[Cheshunt  wtime]])*3600)+MINUTE(XC[[#This Row],[Cheshunt  wtime]])*60+SECOND(XC[[#This Row],[Cheshunt  wtime]])","v":2101},{"$f":"IFERROR(IF(FIND(\"M\",XC[[#This Row],[Group]])>0,XC[[#This Row],[Cheshunt Second]],\"errorif\"),\"\")","v":2101},{"$f":"IFERROR(IF(FIND(\"F\",XC[[#This Row],[Group]])>0,XC[[#This Row],[Cheshunt Second]],\"errorif\"),\"\")","v":""},{"$f":"IF(ISNUMBER(XC[[#This Row],[Cheshunt Mens Time]]),50-(RANK(XC[[#This Row],[Cheshunt Mens Time]],XC[Cheshunt Mens Time],1))+1,0)","v":39},{"$f":"IF(ISNUMBER(XC[[#This Row],[Cheshunt ladies Time]]),50-(RANK(XC[[#This Row],[Cheshunt ladies Time]],XC[Cheshunt ladies Time],1))+1,0)","v":0},null,null,null,null,null,null,null," "," ",{"$f":"IF(ISNUMBER(XC[[#This Row],[Glands Mens Secs]]),50-(RANK(XC[[#This Row],[Glands Mens Secs]],XC[Glands Mens Secs],1))+1,0)","v":0},{"$f":"IF(ISNUMBER(XC[[#This Row],[Gland Ladies Secs]]),50-(RANK(XC[[#This Row],[Gland Ladies Secs]],XC[Gland Ladies Secs],1))+1,0)","v":0},"  ",{"$f":"IF(ISNUMBER(XC[[#This Row],[TP Mens Secs]]),50-_xlfn.RANK.EQ(XC[[#This Row],[TP Mens Secs]],XC[TP Mens Secs],1)+1,0)","v":0},{"$f":"IF(ISNUMBER(XC[[#This Row],[TP Ladies Secs]]),50-_xlfn.RANK.EQ(XC[[#This Row],[TP Ladies Secs]],XC[TP Ladies Secs],1)+1,0)","v":0}]
[null,"Richard ","Moreton",{"$f":"TRIM(XC[[#This Row],[N1]])&\" \"&TRIM(XC[[#This Row],[N2]])","v":"Richard Moreton"},null,{"$f":"VLOOKUP(XC[[#This Row],[Name]],members,2,0)","v":283},"M",{"$f":"VLOOKUP(XC[[#This Row],[Mem]],Allmembers[],7,FALSE)","v":"MV40"},{"$f":"COUNT(XC[[#This Row],[Royston Race Position]],XC[[#This Row],[Watford Race Position]],XC[[#This Row],[Cheshut place]],XC[[#This Row],[Watford Challenge Place]],XC[[#This Row],[Grovelands place]],XC[[#This Row],[Trent Park Pos]])","v":2},{"$f":"IF(XC[[#This Row],[Gender]]=\"M\",XC[[#This Row],[Royston Mens Points]]+XC[[#This Row],[Watford Mens Points]]+XC[[#This Row],[Cheshunt Mens Points]]+XC[[#This Row],[Watford Challenge Mens Points]]+XC[[#This Row],[Gland Mens Points]]+XC[[#This Row],[Trent Park Mens Points]],XC[[#This Row],[Royston Ladies Points]]+XC[[#This Row],[Waftord Ladies Points]]+XC[[#This Row],[Cheshunt Ladies Point]]+XC[[#This Row],[Watford Challenge Ladies Points]]+XC[[#This Row],[Gland Ladies Points]]+XC[[#This Row],[Trent Park Ladies Points]])","v":68},null," ",{"$f":"IF(XC[[#This Row],[Royston Time2]]>\" \",(HOUR(XC[[#This Row],[Royston Time2]])*3600)+MINUTE(XC[[#This Row],[Royston Time2]])*60+SECOND(XC[[#This Row],[Royston Time2]]),\"\")","v":""},{"$f":"IFERROR(IF(FIND(\"M\",XC[[#This Row],[Group]])>0,XC[[#This Row],[Royston Seconds]],\"errorif\"),\"\")","v":""},{"$f":"IFERROR(IF(FIND(\"F\",XC[[#This Row],[Group]])>0,XC[[#This Row],[Royston Seconds]],\"errorif\"),\"\")","v":""},0,{"$f":"IF(ISNUMBER(XC[[#This Row],[Royston Ladies Times]]),50-(RANK(XC[[#This Row],[Royston Ladies Times]],XC[Royston Ladies Times],1))+1,0)","v":0}," ",null,null,{"$f":"IFERROR((HOUR(XC[[#This Row],[Watford Time]])*3600)+MINUTE(XC[[#This Row],[Watford Time]])*60+SECOND(XC[[#This Row],[Watford Time]]),\"\")","v":""},{"$f":"IFERROR(IF(FIND(\"M\",XC[[#This Row],[Group]])>0,XC[[#This Row],[Watford Seconds]],\"errorif\"),\"\")","v":""},{"$f":"IFERROR(IF(FIND(\"F\",XC[[#This Row],[Group]])>0,XC[[#This Row],[Watford Seconds]],\"errorif\"),\"\")","v":""},{"$f":"IF(ISNUMBER(XC[[#This Row],[Watford Mens Time]]),50-(RANK(XC[[#This Row],[Watford Mens Time]],XC[Watford Mens Time],1))+1,0)","v":0},null,{"$f":"Hatime(XC[[#This Row],[WTime]])","v":""},"00:38:52",179,{"$f":"(HOUR(XC[[#This Row],[Cheshunt  wtime]])*3600)+MINUTE(XC[[#This Row],[Cheshunt  wtime]])*60+SECOND(XC[[#This Row],[Cheshunt  wtime]])","v":2332},{"$f":"IFERROR(IF(FIND(\"M\",XC[[#This Row],[Group]])>0,XC[[#This Row],[Cheshunt Second]],\"errorif\"),\"\")","v":2332},{"$f":"IFERROR(IF(FIND(\"F\",XC[[#This Row],[Group]])>0,XC[[#This Row],[Cheshunt Second]],\"errorif\"),\"\")","v":""},{"$f":"IF(ISNUMBER(XC[[#This Row],[Cheshunt Mens Time]]),50-(RANK(XC[[#This Row],[Cheshunt Mens Time]],XC[Cheshunt Mens Time],1))+1,0)","v":30},{"$f":"IF(ISNUMBER(XC[[#This Row],[Cheshunt ladies Time]]),50-(RANK(XC[[#This Row],[Cheshunt ladies Time]],XC[Cheshunt ladies Time],1))+1,0)","v":0},null,null,null,null,null,null,null," "," ",{"$f":"IF(ISNUMBER(XC[[#This Row],[Glands Mens Secs]]),50-(RANK(XC[[#This Row],[Glands Mens Secs]],XC[Glands Mens Secs],1))+1,0)","v":0},{"$f":"IF(ISNUMBER(XC[[#This Row],[Gland Ladies Secs]]),50-(RANK(XC[[#This Row],[Gland Ladies Secs]],XC[Gland Ladies Secs],1))+1,0)","v":0},113,{"$f":"IF(ISNUMBER(XC[[#This Row],[TP Mens Secs]]),50-_xlfn.RANK.EQ(XC[[#This Row],[TP Mens Secs]],XC[TP Mens Secs],1)+1,0)","v":38},{"$f":"IF(ISNUMBER(XC[[#This Row],[TP Ladies Secs]]),50-_xlfn.RANK.EQ(XC[[#This Row],[TP Ladies Secs]],XC[TP Ladies Secs],1)+1,0)","v":0},"00:35:23","",2123,""]
[null,"Justin","Busby","Justin Busby",1,{"$f":"VLOOKUP(XC[[#This Row],[Name]],members,2,0)","v":292},"M",{"$f":"VLOOKUP(XC[[#This Row],[Mem]],Allmembers[],7,FALSE)","v":"MS"},{"$f":"COUNT(XC[[#This Row],[Royston Race Position]],XC[[#This Row],[Watford Race Position]],XC[[#This Row],[Cheshut place]],XC[[#This Row],[Watford Challenge Place]],XC[[#This Row],[Grovelands place]],XC[[#This Row],[Trent Park Pos]])","v":1},{"$f":"IF(XC[[#This Row],[Gender]]=\"M\",XC[[#This Row],[Royston Mens Points]]+XC[[#This Row],[Watford Mens Points]]+XC[[#This Row],[Cheshunt Mens Points]]+XC[[#This Row],[Watford Challenge Mens Points]]+XC[[#This Row],[Gland Mens Points]]+XC[[#This Row],[Trent Park Mens Points]],XC[[#This Row],[Royston Ladies Points]]+XC[[#This Row],[Waftord Ladies Points]]+XC[[#This Row],[Cheshunt Ladies Point]]+XC[[#This Row],[Watford Challenge Ladies Points]]+XC[[#This Row],[Gland Ladies Points]]+XC[[#This Row],[Trent Park Ladies Points]])","v":38},null,"  ",{"$f":"IF(XC[[#This Row],[Royston Time2]]>\" \",(HOUR(XC[[#This Row],[Royston Time2]])*3600)+MINUTE(XC[[#This Row],[Royston Time2]])*60+SECOND(XC[[#This Row],[Royston Time2]]),\"\")","v":""},{"$f":"IFERROR(IF(FIND(\"M\",XC[[#This Row],[Group]])>0,XC[[#This Row],[Royston Seconds]],\"errorif\"),\"\")","v":""},{"$f":"IFERROR(IF(FIND(\"F\",XC[[#This Row],[Group]])>0,XC[[#This Row],[Royston Seconds]],\"errorif\"),\"\")","v":""},0,{"$f":"IF(ISNUMBER(XC[[#This Row],[Royston Ladies Times]]),50-(RANK(XC[[#This Row],[Royston Ladies Times]],XC[Royston Ladies Times],1))+1,0)","v":0}," ",null,null,{"$f":"IFERROR((HOUR(XC[[#This Row],[Watford Time]])*3600)+MINUTE(XC[[#This Row],[Watford Time]])*60+SECOND(XC[[#This Row],[Watford Time]]),\"\")","v":""},{"$f":"IFERROR(IF(FIND(\"M\",XC[[#This Row],[Group]])>0,XC[[#This Row],[Watford Seconds]],\"errorif\"),\"\")","v":""},{"$f":"IFERROR(IF(FIND(\"F\",XC[[#This Row],[Group]])>0,XC[[#This Row],[Watford Seconds]],\"errorif\"),\"\")","v":""},{"$f":"IF(ISNUMBER(XC[[#This Row],[Watford Mens Time]]),50-(RANK(XC[[#This Row],[Watford Mens Time]],XC[Watford Mens Time],1))+1,0)","v":0},null,{"$f":"Hatime(XC[[#This Row],[WTime]])","v":""},null,null," "," ",{"$f":"IFERROR(IF(FIND(\"F\",XC[[#This Row],[Group]])>0,XC[[#This Row],[Cheshunt Second]],\"errorif\"),\"\")","v":""},{"$f":"IF(ISNUMBER(XC[[#This Row],[Cheshunt Mens Time]]),50-(RANK(XC[[#This Row],[Cheshunt Mens Time]],XC[Cheshunt Mens Time],1))+1,0)","v":0},{"$f":"IF(ISNUMBER(XC[[#This Row],[Cheshunt ladies Time]]),50-(RANK(XC[[#This Row],[Cheshunt ladies Time]],XC[Cheshunt ladies Time],1))+1,0)","v":0},null,null,null,null,99,"00:33:35",null,{"$f":"(HOUR(XC[[#This Row],[Grovelands Mens Time]])*3600)+MINUTE(XC[[#This Row],[Grovelands Mens Time]])*60+SECOND(XC[[#This Row],[Grovelands Mens Time]])","v":2015}," ",{"$f":"IF(ISNUMBER(XC[[#This Row],[Glands Mens Secs]]),50-(RANK(XC[[#This Row],[Glands Mens Secs]],XC[Glands Mens Secs],1))+1,0)","v":38},{"$f":"IF(ISNUMBER(XC[[#This Row],[Gland Ladies Secs]]),50-(RANK(XC[[#This Row],[Gland Ladies Secs]],XC[Gland Ladies Secs],1))+1,0)","v":0},"  ",{"$f":"IF(ISNUMBER(XC[[#This Row],[TP Mens Secs]]),50-_xlfn.RANK.EQ(XC[[#This Row],[TP Mens Secs]],XC[TP Mens Secs],1)+1,0)","v":0},{"$f":"IF(ISNUMBER(XC[[#This Row],[TP Ladies Secs]]),50-_xlfn.RANK.EQ(XC[[#This Row],[TP Ladies Secs]],XC[TP Ladies Secs],1)+1,0)","v":0}]
[null,"James","Chasen",{"$f":"TRIM(XC[[#This Row],[N1]])&\" \"&TRIM(XC[[#This Row],[N2]])","v":"James Chasen"},null,{"$f":"VLOOKUP(XC[[#This Row],[Name]],members,2,0)","v":294},"M",{"$f":"VLOOKUP(XC[[#This Row],[Mem]],Allmembers[],7,FALSE)","v":"MS"},{"$f":"COUNT(XC[[#This Row],[Royston Race Position]],XC[[#This Row],[Watford Race Position]],XC[[#This Row],[Cheshut place]],XC[[#This Row],[Watford Challenge Place]],XC[[#This Row],[Grovelands place]],XC[[#This Row],[Trent Park Pos]])","v":1},{"$f":"IF(XC[[#This Row],[Gender]]=\"M\",XC[[#This Row],[Royston Mens Points]]+XC[[#This Row],[Watford Mens Points]]+XC[[#This Row],[Cheshunt Mens Points]]+XC[[#This Row],[Watford Challenge Mens Points]]+XC[[#This Row],[Gland Mens Points]]+XC[[#This Row],[Trent Park Mens Points]],XC[[#This Row],[Royston Ladies Points]]+XC[[#This Row],[Waftord Ladies Points]]+XC[[#This Row],[Cheshunt Ladies Point]]+XC[[#This Row],[Watford Challenge Ladies Points]]+XC[[#This Row],[Gland Ladies Points]]+XC[[#This Row],[Trent Park Ladies Points]])","v":46},null," ",{"$f":"IF(XC[[#This Row],[Royston Time2]]>\" \",(HOUR(XC[[#This Row],[Royston Time2]])*3600)+MINUTE(XC[[#This Row],[Royston Time2]])*60+SECOND(XC[[#This Row],[Royston Time2]]),\"\")","v":""},{"$f":"IFERROR(IF(FIND(\"M\",XC[[#This Row],[Group]])>0,XC[[#This Row],[Royston Seconds]],\"errorif\"),\"\")","v":""},{"$f":"IFERROR(IF(FIND(\"F\",XC[[#This Row],[Group]])>0,XC[[#This Row],[Royston Seconds]],\"errorif\"),\"\")","v":""},0,{"$f":"IF(ISNUMBER(XC[[#This Row],[Royston Ladies Times]]),50-(RANK(XC[[#This Row],[Royston Ladies Times]],XC[Royston Ladies Times],1))+1,0)","v":0}," ",null,null,{"$f":"IFERROR((HOUR(XC[[#This Row],[Watford Time]])*3600)+MINUTE(XC[[#This Row],[Watford Time]])*60+SECOND(XC[[#This Row],[Watford Time]]),\"\")","v":""},{"$f":"IFERROR(IF(FIND(\"M\",XC[[#This Row],[Group]])>0,XC[[#This Row],[Watford Seconds]],\"errorif\"),\"\")","v":""},{"$f":"IFERROR(IF(FIND(\"F\",XC[[#This Row],[Group]])>0,XC[[#This Row],[Watford Seconds]],\"errorif\"),\"\")","v":""},{"$f":"IF(ISNUMBER(XC[[#This Row],[Watford Mens Time]]),50-(RANK(XC[[#This Row],[Watford Mens Time]],XC[Watford Mens Time],1))+1,0)","v":0},null,{"$f":"Hatime(XC[[#This Row],[WTime]])","v":""},"00:33:01",45,{"$f":"(HOUR(XC[[#This Row],[Cheshunt  wtime]])*3600)+MINUTE(XC[[#This Row],[Cheshunt  wtime]])*60+SECOND(XC[[#This Row],[Cheshunt  wtime]])","v":1981},{"$f":"IFERROR(IF(FIND(\"M\",XC[[#This Row],[Group]])>0,XC[[#This Row],[Cheshunt Second]],\"errorif\"),\"\")","v":1981},{"$f":"IFERROR(IF(FIND(\"F\",XC[[#This Row],[Group]])>0,XC[[#This Row],[Cheshunt Second]],\"errorif\"),\"\")","v":""},{"$f":"IF(ISNUMBER(XC[[#This Row],[Cheshunt Mens Time]]),50-(RANK(XC[[#This Row],[Cheshunt Mens Time]],XC[Cheshunt Mens Time],1))+1,0)","v":46},{"$f":"IF(ISNUMBER(XC[[#This Row],[Cheshunt ladies Time]]),50-(RANK(XC[[#This Row],[Cheshunt ladies Time]],XC[Cheshunt ladies Time],1))+1,0)","v":0},null,null,null,null,null,null,null," "," ",{"$f":"IF(ISNUMBER(XC[[#This Row],[Glands Mens Secs]]),50-(RANK(XC[[#This Row],[Glands Mens Secs]],XC[Glands Mens Secs],1))+1,0)","v":0},{"$f":"IF(ISNUMBER(XC[[#This Row],[Gland Ladies Secs]]),50-(RANK(XC[[#This Row],[Gland Ladies Secs]],XC[Gland Ladies Secs],1))+1,0)","v":0},"  ",{"$f":"IF(ISNUMBER(XC[[#This Row],[TP Mens Secs]]),50-_xlfn.RANK.EQ(XC[[#This Row],[TP Mens Secs]],XC[TP Mens Secs],1)+1,0)","v":0},{"$f":"IF(ISNUMBER(XC[[#This Row],[TP Ladies Secs]]),50-_xlfn.RANK.EQ(XC[[#This Row],[TP Ladies Secs]],XC[TP Ladies Secs],1)+1,0)","v":0}]
[null,"Janice","Nisbit",{"$f":"TRIM(XC[[#This Row],[N1]])&\" \"&TRIM(XC[[#This Row],[N2]])","v":"Janice Nisbit"},1,{"$f":"VLOOKUP(XC[[#This Row],[Name]],members,2,0)","v":307},"W",{"$f":"VLOOKUP(XC[[#This Row],[Mem]],Allmembers[],7,FALSE)","v":"FV55"},{"$f":"COUNT(XC[[#This Row],[Royston Race Position]],XC[[#This Row],[Watford Race Position]],XC[[#This Row],[Cheshut place]],XC[[#This Row],[Watford Challenge Place]],XC[[#This Row],[Grovelands place]],XC[[#This Row],[Trent Park Pos]])","v":2},{"$f":"IF(XC[[#This Row],[Gender]]=\"M\",XC[[#This Row],[Royston Mens Points]]+XC[[#This Row],[Watford Mens Points]]+XC[[#This Row],[Cheshunt Mens Points]]+XC[[#This Row],[Watford Challenge Mens Points]]+XC[[#This Row],[Gland Mens Points]]+XC[[#This Row],[Trent Park Mens Points]],XC[[#This Row],[Royston Ladies Points]]+XC[[#This Row],[Waftord Ladies Points]]+XC[[#This Row],[Cheshunt Ladies Point]]+XC[[#This Row],[Watford Challenge Ladies Points]]+XC[[#This Row],[Gland Ladies Points]]+XC[[#This Row],[Trent Park Ladies Points]])","v":83}," ","  ",{"$f":"IF(XC[[#This Row],[Royston Time2]]>\" \",(HOUR(XC[[#This Row],[Royston Time2]])*3600)+MINUTE(XC[[#This Row],[Royston Time2]])*60+SECOND(XC[[#This Row],[Royston Time2]]),\"\")","v":""},{"$f":"IFERROR(IF(FIND(\"M\",XC[[#This Row],[Group]])>0,XC[[#This Row],[Royston Seconds]],\"errorif\"),\"\")","v":""},{"$f":"IFERROR(IF(FIND(\"F\",XC[[#This Row],[Group]])>0,XC[[#This Row],[Royston Seconds]],\"errorif\"),\"\")","v":""},{"$f":"IF(ISNUMBER(XC[[#This Row],[Royston Mens Time]]),50-(RANK(XC[[#This Row],[Royston Mens Time]],XC[Royston Mens Time],1))+1,0)","v":0},{"$f":"IF(ISNUMBER(XC[[#This Row],[Royston Ladies Times]]),50-(RANK(XC[[#This Row],[Royston Ladies Times]],XC[Royston Ladies Times],1))+1,0)","v":0}," ",null," "," "," ",{"$f":"IFERROR(IF(FIND(\"F\",XC[[#This Row],[Group]])>0,XC[[#This Row],[Watford Seconds]],\"errorif\"),\"\")","v":" "},{"$f":"IF(ISNUMBER(XC[[#This Row],[Watford Mens Time]]),50-(RANK(XC[[#This Row],[Watford Mens Time]],XC[Watford Mens Time],1))+1,0)","v":0},null,{"$f":"Hatime(XC[[#This Row],[WTime]])","v":""},null,null," ",{"$f":"IFERROR(IF(FIND(\"M\",XC[[#This Row],[Group]])>0,XC[[#This Row],[Cheshunt Second]],\"errorif\"),\"\")","v":""},{"$f":"IFERROR(IF(FIND(\"F\",XC[[#This Row],[Group]])>0,XC[[#This Row],[Cheshunt Second]],\"errorif\"),\"\")","v":" "},{"$f":"IF(ISNUMBER(XC[[#This Row],[Cheshunt Mens Time]]),50-(RANK(XC[[#This Row],[Cheshunt Mens Time]],XC[Cheshunt Mens Time],1))+1,0)","v":0},{"$f":"IF(ISNUMBER(XC[[#This Row],[Cheshunt ladies Time]]),50-(RANK(XC[[#This Row],[Cheshunt ladies Time]],XC[Cheshunt ladies Time],1))+1,0)","v":0},null,null,null,null,294,null,"00:42:15",null,{"$f":"(HOUR(XC[[#This Row],[Grovelands Ladies Time]])*3600)+MINUTE(XC[[#This Row],[Grovelands Ladies Time]])*60+SECOND(XC[[#This Row],[Grovelands Ladies Time]])","v":2535},{"$f":"IF(ISNUMBER(XC[[#This Row],[Glands Mens Secs]]),50-(RANK(XC[[#This Row],[Glands Mens Secs]],XC[Glands Mens Secs],1))+1,0)","v":0},{"$f":"IF(ISNUMBER(XC[[#This Row],[Gland Ladies Secs]]),50-(RANK(XC[[#This Row],[Gland Ladies Secs]],XC[Gland Ladies Secs],1))+1,0)","v":45},277,{"$f":"IF(ISNUMBER(XC[[#This Row],[TP Mens Secs]]),50-_xlfn.RANK.EQ(XC[[#This Row],[TP Mens Secs]],XC[TP Mens Secs],1)+1,0)","v":0},{"$f":"IF(ISNUMBER(XC[[#This Row],[TP Ladies Secs]]),50-_xlfn.RANK.EQ(XC[[#This Row],[TP Ladies Secs]],XC[TP Ladies Secs],1)+1,0)","v":38},"","00:44:14","",2654]
[null,"Ken","Murray","Ken Murray",1,{"$f":"VLOOKUP(XC[[#This Row],[Name]],members,2,0)","v":310},"M",{"$f":"VLOOKUP(XC[[#This Row],[Mem]],Allmembers[],7,FALSE)","v":"MV40"},{"$f":"COUNT(XC[[#This Row],[Royston Race Position]],XC[[#This Row],[Watford Race Position]],XC[[#This Row],[Cheshut place]],XC[[#This Row],[Watford Challenge Place]],XC[[#This Row],[Grovelands place]],XC[[#This Row],[Trent Park Pos]])","v":1},{"$f":"IF(XC[[#This Row],[Gender]]=\"M\",XC[[#This Row],[Royston Mens Points]]+XC[[#This Row],[Watford Mens Points]]+XC[[#This Row],[Cheshunt Mens Points]]+XC[[#This Row],[Watford Challenge Mens Points]]+XC[[#This Row],[Gland Mens Points]]+XC[[#This Row],[Trent Park Mens Points]],XC[[#This Row],[Royston Ladies Points]]+XC[[#This Row],[Waftord Ladies Points]]+XC[[#This Row],[Cheshunt Ladies Point]]+XC[[#This Row],[Watford Challenge Ladies Points]]+XC[[#This Row],[Gland Ladies Points]]+XC[[#This Row],[Trent Park Ladies Points]])","v":32}," ","  ",{"$f":"IF(XC[[#This Row],[Royston Time2]]>\" \",(HOUR(XC[[#This Row],[Royston Time2]])*3600)+MINUTE(XC[[#This Row],[Royston Time2]])*60+SECOND(XC[[#This Row],[Royston Time2]]),\"\")","v":""}," ",{"$f":"IFERROR(IF(FIND(\"F\",XC[[#This Row],[Group]])>0,XC[[#This Row],[Royston Seconds]],\"errorif\"),\"\")","v":""},0,{"$f":"IF(ISNUMBER(XC[[#This Row],[Royston Ladies Times]]),50-(RANK(XC[[#This Row],[Royston Ladies Times]],XC[Royston Ladies Times],1))+1,0)","v":0}," ",null," "," "," ",{"$f":"IFERROR(IF(FIND(\"F\",XC[[#This Row],[Group]])>0,XC[[#This Row],[Watford Seconds]],\"errorif\"),\"\")","v":""},{"$f":"IF(ISNUMBER(XC[[#This Row],[Watford Mens Time]]),50-(RANK(XC[[#This Row],[Watford Mens Time]],XC[Watford Mens Time],1))+1,0)","v":0},null,{"$f":"Hatime(XC[[#This Row],[WTime]])","v":""},null,null," "," ",{"$f":"IFERROR(IF(FIND(\"F\",XC[[#This Row],[Group]])>0,XC[[#This Row],[Cheshunt Second]],\"errorif\"),\"\")","v":""},{"$f":"IF(ISNUMBER(XC[[#This Row],[Cheshunt Mens Time]]),50-(RANK(XC[[#This Row],[Cheshunt Mens Time]],XC[Cheshunt Mens Time],1))+1,0)","v":0},{"$f":"IF(ISNUMBER(XC[[#This Row],[Cheshunt ladies Time]]),50-(RANK(XC[[#This Row],[Cheshunt ladies Time]],XC[Cheshunt ladies Time],1))+1,0)","v":0},null,null,null,null,170,"00:36:46",null,{"$f":"(HOUR(XC[[#This Row],[Grovelands Mens Time]])*3600)+MINUTE(XC[[#This Row],[Grovelands Mens Time]])*60+SECOND(XC[[#This Row],[Grovelands Mens Time]])","v":2206}," ",{"$f":"IF(ISNUMBER(XC[[#This Row],[Glands Mens Secs]]),50-(RANK(XC[[#This Row],[Glands Mens Secs]],XC[Glands Mens Secs],1))+1,0)","v":32},{"$f":"IF(ISNUMBER(XC[[#This Row],[Gland Ladies Secs]]),50-(RANK(XC[[#This Row],[Gland Ladies Secs]],XC[Gland Ladies Secs],1))+1,0)","v":0},"  ",{"$f":"IF(ISNUMBER(XC[[#This Row],[TP Mens Secs]]),50-_xlfn.RANK.EQ(XC[[#This Row],[TP Mens Secs]],XC[TP Mens Secs],1)+1,0)","v":0},{"$f":"IF(ISNUMBER(XC[[#This Row],[TP Ladies Secs]]),50-_xlfn.RANK.EQ(XC[[#This Row],[TP Ladies Secs]],XC[TP Ladies Secs],1)+1,0)","v":0}]
[null,"Ammon\n","Piepgrass",{"$f":"TRIM(XC[[#This Row],[N1]])&\" \"&TRIM(XC[[#This Row],[N2]])","v":"Ammon\n Piepgrass"},1,311,"M",{"$f":"VLOOKUP(XC[[#This Row],[Mem]],Allmembers[],7,FALSE)","v":"MS"},{"$f":"COUNT(XC[[#This Row],[Royston Race Position]],XC[[#This Row],[Watford Race Position]],XC[[#This Row],[Cheshut place]],XC[[#This Row],[Watford Challenge Place]],XC[[#This Row],[Grovelands place]],XC[[#This Row],[Trent Park Pos]])","v":3},{"$f":"IF(XC[[#This Row],[Gender]]=\"M\",XC[[#This Row],[Royston Mens Points]]+XC[[#This Row],[Watford Mens Points]]+XC[[#This Row],[Cheshunt Mens Points]]+XC[[#This Row],[Watford Challenge Mens Points]]+XC[[#This Row],[Gland Mens Points]]+XC[[#This Row],[Trent Park Mens Points]],XC[[#This Row],[Royston Ladies Points]]+XC[[#This Row],[Waftord Ladies Points]]+XC[[#This Row],[Cheshunt Ladies Point]]+XC[[#This Row],[Watford Challenge Ladies Points]]+XC[[#This Row],[Gland Ladies Points]]+XC[[#This Row],[Trent Park Ladies Points]])","v":142},null," ",{"$f":"IF(XC[[#This Row],[Royston Time2]]>\" \",(HOUR(XC[[#This Row],[Royston Time2]])*3600)+MINUTE(XC[[#This Row],[Royston Time2]])*60+SECOND(XC[[#This Row],[Royston Time2]]),\"\")","v":""},{"$f":"IFERROR(IF(FIND(\"M\",XC[[#This Row],[Group]])>0,XC[[#This Row],[Royston Seconds]],\"errorif\"),\"\")","v":""},{"$f":"IFERROR(IF(FIND(\"F\",XC[[#This Row],[Group]])>0,XC[[#This Row],[Royston Seconds]],\"errorif\"),\"\")","v":""},0,{"$f":"IF(ISNUMBER(XC[[#This Row],[Royston Ladies Times]]),50-(RANK(XC[[#This Row],[Royston Ladies Times]],XC[Royston Ladies Times],1))+1,0)","v":0}," ",null,null,{"$f":"IFERROR((HOUR(XC[[#This Row],[Watford Time]])*3600)+MINUTE(XC[[#This Row],[Watford Time]])*60+SECOND(XC[[#This Row],[Watford Time]]),\"\")","v":""},{"$f":"IFERROR(IF(FIND(\"M\",XC[[#This Row],[Group]])>0,XC[[#This Row],[Watford Seconds]],\"errorif\"),\"\")","v":""},{"$f":"IFERROR(IF(FIND(\"F\",XC[[#This Row],[Group]])>0,XC[[#This Row],[Watford Seconds]],\"errorif\"),\"\")","v":""},{"$f":"IF(ISNUMBER(XC[[#This Row],[Watford Mens Time]]),50-(RANK(XC[[#This Row],[Watford Mens Time]],XC[Watford Mens Time],1))+1,0)","v":0},null,{"$f":"Hatime(XC[[#This Row],[WTime]])","v":""},"00:32:43",41,{"$f":"(HOUR(XC[[#This Row],[Cheshunt  wtime]])*3600)+MINUTE(XC[[#This Row],[Cheshunt  wtime]])*60+SECOND(XC[[#This Row],[Cheshunt  wtime]])","v":1963},{"$f":"IFERROR(IF(FIND(\"M\",XC[[#This Row],[Group]])>0,XC[[#This Row],[Cheshunt Second]],\"errorif\"),\"\")","v":1963},{"$f":"IFERROR(IF(FIND(\"F\",XC[[#This Row],[Group]])>0,XC[[#This Row],[Cheshunt Second]],\"errorif\"),\"\")","v":""},{"$f":"IF(ISNUMBER(XC[[#This Row],[Cheshunt Mens Time]]),50-(RANK(XC[[#This Row],[Cheshunt Mens Time]],XC[Cheshunt Mens Time],1))+1,0)","v":47},{"$f":"IF(ISNUMBER(XC[[#This Row],[Cheshunt ladies Time]]),50-(RANK(XC[[#This Row],[Cheshunt ladies Time]],XC[Cheshunt ladies Time],1))+1,0)","v":0},null,null,null,null,37,"00:30:48",null,{"$f":"(HOUR(XC[[#This Row],[Grovelands Mens Time]])*3600)+MINUTE(XC[[#This Row],[Grovelands Mens Time]])*60+SECOND(XC[[#This Row],[Grovelands Mens Time]])","v":1848}," ",{"$f":"IF(ISNUMBER(XC[[#This Row],[Glands Mens Secs]]),50-(RANK(XC[[#This Row],[Glands Mens Secs]],XC[Glands Mens Secs],1))+1,0)","v":48},{"$f":"IF(ISNUMBER(XC[[#This Row],[Gland Ladies Secs]]),50-(RANK(XC[[#This Row],[Gland Ladies Secs]],XC[Gland Ladies Secs],1))+1,0)","v":0},34,{"$f":"IF(ISNUMBER(XC[[#This Row],[TP Mens Secs]]),50-_xlfn.RANK.EQ(XC[[#This Row],[TP Mens Secs]],XC[TP Mens Secs],1)+1,0)","v":47},{"$f":"IF(ISNUMBER(XC[[#This Row],[TP Ladies Secs]]),50-_xlfn.RANK.EQ(XC[[#This Row],[TP Ladies Secs]],XC[TP Ladies Secs],1)+1,0)","v":0},"00:31:33","",1893,""]
[null,"Katherine","Cerris-Harris",{"$f":"TRIM(XC[[#This Row],[N1]])&\" \"&TRIM(XC[[#This Row],[N2]])","v":"Katherine Cerris-Harris"},null,{"$f":"VLOOKUP(XC[[#This Row],[Name]],members,2,0)","v":314},"W",{"$f":"VLOOKUP(XC[[#This Row],[Mem]],Allmembers[],7,FALSE)","v":"FV35"},{"$f":"COUNT(XC[[#This Row],[Royston Race Position]],XC[[#This Row],[Watford Race Position]],XC[[#This Row],[Cheshut place]],XC[[#This Row],[Watford Challenge Place]],XC[[#This Row],[Grovelands place]],XC[[#This Row],[Trent Park Pos]])","v":1},{"$f":"IF(XC[[#This Row],[Gender]]=\"M\",XC[[#This Row],[Royston Mens Points]]+XC[[#This Row],[Watford Mens Points]]+XC[[#This Row],[Cheshunt Mens Points]]+XC[[#This Row],[Watford Challenge Mens Points]]+XC[[#This Row],[Gland Mens Points]]+XC[[#This Row],[Trent Park Mens Points]],XC[[#This Row],[Royston Ladies Points]]+XC[[#This Row],[Waftord Ladies Points]]+XC[[#This Row],[Cheshunt Ladies Point]]+XC[[#This Row],[Watford Challenge Ladies Points]]+XC[[#This Row],[Gland Ladies Points]]+XC[[#This Row],[Trent Park Ladies Points]])","v":47},null," ",{"$f":"IF(XC[[#This Row],[Royston Time2]]>\" \",(HOUR(XC[[#This Row],[Royston Time2]])*3600)+MINUTE(XC[[#This Row],[Royston Time2]])*60+SECOND(XC[[#This Row],[Royston Time2]]),\"\")","v":""},{"$f":"IFERROR(IF(FIND(\"M\",XC[[#This Row],[Group]])>0,XC[[#This Row],[Royston Seconds]],\"errorif\"),\"\")","v":""},{"$f":"IFERROR(IF(FIND(\"F\",XC[[#This Row],[Group]])>0,XC[[#This Row],[Royston Seconds]],\"errorif\"),\"\")","v":""},{"$f":"IF(ISNUMBER(XC[[#This Row],[Royston Mens Time]]),50-(RANK(XC[[#This Row],[Royston Mens Time]],XC[Royston Mens Time],1))+1,0)","v":0},{"$f":"IF(ISNUMBER(XC[[#This Row],[Royston Ladies Times]]),50-(RANK(XC[[#This Row],[Royston Ladies Times]],XC[Royston Ladies Times],1))+1,0)","v":0}," ",null,null,{"$f":"IFERROR((HOUR(XC[[#This Row],[Watford Time]])*3600)+MINUTE(XC[[#This Row],[Watford Time]])*60+SECOND(XC[[#This Row],[Watford Time]]),\"\")","v":""},{"$f":"IFERROR(IF(FIND(\"M\",XC[[#This Row],[Group]])>0,XC[[#This Row],[Watford Seconds]],\"errorif\"),\"\")","v":""},{"$f":"IFERROR(IF(FIND(\"F\",XC[[#This Row],[Group]])>0,XC[[#This Row],[Watford Seconds]],\"errorif\"),\"\")","v":""},{"$f":"IF(ISNUMBER(XC[[#This Row],[Watford Mens Time]]),50-(RANK(XC[[#This Row],[Watford Mens Time]],XC[Watford Mens Time],1))+1,0)","v":0},0,{"$f":"Hatime(XC[[#This Row],[WTime]])","v":""},null,null," ",{"$f":"IFERROR(IF(FIND(\"M\",XC[[#This Row],[Group]])>0,XC[[#This Row],[Cheshunt Second]],\"errorif\"),\"\")","v":""},{"$f":"IFERROR(IF(FIND(\"F\",XC[[#This Row],[Group]])>0,XC[[#This Row],[Cheshunt Second]],\"errorif\"),\"\")","v":" "},{"$f":"IF(ISNUMBER(XC[[#This Row],[Cheshunt Mens Time]]),50-(RANK(XC[[#This Row],[Cheshunt Mens Time]],XC[Cheshunt Mens Time],1))+1,0)","v":0},{"$f":"IF(ISNUMBER(XC[[#This Row],[Cheshunt ladies Time]]),50-(RANK(XC[[#This Row],[Cheshunt ladies Time]],XC[Cheshunt ladies Time],1))+1,0)","v":0},null,null,null,null,null,null,null," "," ",{"$f":"IF(ISNUMBER(XC[[#This Row],[Glands Mens Secs]]),50-(RANK(XC[[#This Row],[Glands Mens Secs]],XC[Glands Mens Secs],1))+1,0)","v":0},{"$f":"IF(ISNUMBER(XC[[#This Row],[Gland Ladies Secs]]),50-(RANK(XC[[#This Row],[Gland Ladies Secs]],XC[Gland Ladies Secs],1))+1,0)","v":0},181,{"$f":"IF(ISNUMBER(XC[[#This Row],[TP Mens Secs]]),50-_xlfn.RANK.EQ(XC[[#This Row],[TP Mens Secs]],XC[TP Mens Secs],1)+1,0)","v":0},{"$f":"IF(ISNUMBER(XC[[#This Row],[TP Ladies Secs]]),50-_xlfn.RANK.EQ(XC[[#This Row],[TP Ladies Secs]],XC[TP Ladies Secs],1)+1,0)","v":47},"","00:38:15","",2295]
[null,"Riana","Walsh","Riana Walsh",1,{"$f":"VLOOKUP(XC[[#This Row],[Name]],members,2,0)","v":316},"W",{"$f":"VLOOKUP(XC[[#This Row],[Mem]],Allmembers[],7,FALSE)","v":"FV35"},{"$f":"COUNT(XC[[#This Row],[Royston Race Position]],XC[[#This Row],[Watford Race Position]],XC[[#This Row],[Cheshut place]],XC[[#This Row],[Watford Challenge Place]],XC[[#This Row],[Grovelands place]],XC[[#This Row],[Trent Park Pos]])","v":2},{"$f":"IF(XC[[#This Row],[Gender]]=\"M\",XC[[#This Row],[Royston Mens Points]]+XC[[#This Row],[Watford Mens Points]]+XC[[#This Row],[Cheshunt Mens Points]]+XC[[#This Row],[Watford Challenge Mens Points]]+XC[[#This Row],[Gland Mens Points]]+XC[[#This Row],[Trent Park Mens Points]],XC[[#This Row],[Royston Ladies Points]]+XC[[#This Row],[Waftord Ladies Points]]+XC[[#This Row],[Cheshunt Ladies Point]]+XC[[#This Row],[Watford Challenge Ladies Points]]+XC[[#This Row],[Gland Ladies Points]]+XC[[#This Row],[Trent Park Ladies Points]])","v":91},null,"  ",{"$f":"IF(XC[[#This Row],[Royston Time2]]>\" \",(HOUR(XC[[#This Row],[Royston Time2]])*3600)+MINUTE(XC[[#This Row],[Royston Time2]])*60+SECOND(XC[[#This Row],[Royston Time2]]),\"\")","v":""},{"$f":"IFERROR(IF(FIND(\"M\",XC[[#This Row],[Group]])>0,XC[[#This Row],[Royston Seconds]],\"errorif\"),\"\")","v":""},{"$f":"IFERROR(IF(FIND(\"F\",XC[[#This Row],[Group]])>0,XC[[#This Row],[Royston Seconds]],\"errorif\"),\"\")","v":""},{"$f":"IF(ISNUMBER(XC[[#This Row],[Royston Mens Time]]),50-(RANK(XC[[#This Row],[Royston Mens Time]],XC[Royston Mens Time],1))+1,0)","v":0},{"$f":"IF(ISNUMBER(XC[[#This Row],[Royston Ladies Times]]),50-(RANK(XC[[#This Row],[Royston Ladies Times]],XC[Royston Ladies Times],1))+1,0)","v":0}," ",null,null,{"$f":"IFERROR((HOUR(XC[[#This Row],[Watford Time]])*3600)+MINUTE(XC[[#This Row],[Watford Time]])*60+SECOND(XC[[#This Row],[Watford Time]]),\"\")","v":""},{"$f":"IFERROR(IF(FIND(\"M\",XC[[#This Row],[Group]])>0,XC[[#This Row],[Watford Seconds]],\"errorif\"),\"\")","v":""},{"$f":"IFERROR(IF(FIND(\"F\",XC[[#This Row],[Group]])>0,XC[[#This Row],[Watford Seconds]],\"errorif\"),\"\")","v":""},{"$f":"IF(ISNUMBER(XC[[#This Row],[Watford Mens Time]]),50-(RANK(XC[[#This Row],[Watford Mens Time]],XC[Watford Mens Time],1))+1,0)","v":0},null,{"$f":"Hatime(XC[[#This Row],[WTime]])","v":""},null,null," ",{"$f":"IFERROR(IF(FIND(\"M\",XC[[#This Row],[Group]])>0,XC[[#This Row],[Cheshunt Second]],\"errorif\"),\"\")","v":""},{"$f":"IFERROR(IF(FIND(\"F\",XC[[#This Row],[Group]])>0,XC[[#This Row],[Cheshunt Second]],\"errorif\"),\"\")","v":" "},{"$f":"IF(ISNUMBER(XC[[#This Row],[Cheshunt Mens Time]]),50-(RANK(XC[[#This Row],[Cheshunt Mens Time]],XC[Cheshunt Mens Time],1))+1,0)","v":0},{"$f":"IF(ISNUMBER(XC[[#This Row],[Cheshunt ladies Time]]),50-(RANK(XC[[#This Row],[Cheshunt ladies Time]],XC[Cheshunt ladies Time],1))+1,0)","v":0},null,null,null,null,267,null,"00:40:58"," ",{"$f":"(HOUR(XC[[#This Row],[Grovelands Ladies Time]])*3600)+MINUTE(XC[[#This Row],[Grovelands Ladies Time]])*60+SECOND(XC[[#This Row],[Grovelands Ladies Time]])","v":2458},{"$f":"IF(ISNUMBER(XC[[#This Row],[Glands Mens Secs]]),50-(RANK(XC[[#This Row],[Glands Mens Secs]],XC[Glands Mens Secs],1))+1,0)","v":0},{"$f":"IF(ISNUMBER(XC[[#This Row],[Gland Ladies Secs]]),50-(RANK(XC[[#This Row],[Gland Ladies Secs]],XC[Gland Ladies Secs],1))+1,0)","v":47},212,{"$f":"IF(ISNUMBER(XC[[#This Row],[TP Mens Secs]]),50-_xlfn.RANK.EQ(XC[[#This Row],[TP Mens Secs]],XC[TP Mens Secs],1)+1,0)","v":0},{"$f":"IF(ISNUMBER(XC[[#This Row],[TP Ladies Secs]]),50-_xlfn.RANK.EQ(XC[[#This Row],[TP Ladies Secs]],XC[TP Ladies Secs],1)+1,0)","v":44},"","00:40:01","",2401]
[null,"Total",null,null,null,{"$f":"SUBTOTAL(103,XC[Mem])","v":62},{"$f":"SUBTOTAL(103,XC[Gender])","v":62},null,{"$f":"SUBTOTAL(104,XC['# Events])","v":6},{"$f":"SUBTOTAL(103,XC[Total Points])","v":62},null,null,null,null,null,null,null,{"$f":"SUBTOTAL(103,XC[Royston Time2])","v":62},null,null,null,null,null,{"$f":"COUNTIFS(XC[Watford Mens Points],'Controls Page'!$B$1)","v":19},{"$f":"COUNTIFS(XC[Waftord Ladies Points],'Controls Page'!$B$1)","v":9},{"$f":"SUBTOTAL(103,XC[Watford Time])","v":62},{"$f":"SUBTOTAL(103,XC[Cheshunt  wtime])","v":34},null,null,null,null,{"$f":"COUNTIF(XC[Cheshunt Mens Points],\">0\")","v":26},{"$f":"COUNTIF(XC[Cheshunt Ladies Point],\">0\")","v":8},{"$f":"SUBTOTAL(103,XC[Watford Challenge Place])","v":7},null,null,null,null,null,null,null,null,null,null,{"$f":"SUBTOTAL(102,XC[Trent Park Pos])","v":31},{"$f":"COUNTIF(XC[Trent Park Mens Points],'Controls Page'!B1)","v":18},{"$f":"COUNTIF(XC[Trent Park Ladies Points],'Controls Page'!B1)","v":13}]

{"sheet":"Club 5K","index":2,"n_rows":94,"n_cols":17,"rows_kept":94,"cut":false,"hidden":false,"merged":[]}
[]
[null,"Club 5K"]
[]
[]
[null,"Num2","Name","Mem","Events","Total","Jan-13","Feb-13","Mar-13","Apr-13","May-13","Jun-13","Jul-13","Aug-13","Sep-13","Oct-13","Nov-13"]
[null,1,"Colin Wareham",{"$f":"IFERROR(VLOOKUP(Club5k[[#This Row],[Name]],members,2,0),\"\")","v":1},{"$f":"COUNT(Club5k[[#This Row],[Jan-13]:[Nov-13]])","v":1},{"$f":"SUM(Club5k[[#This Row],[Jan-13]:[Nov-13]])","v":5},null,null,null,5]
[null,{"$f":"Club5k[[#This Row],[Mem]]","v":9},"Simon Kitchener",{"$f":"IFERROR(VLOOKUP(Club5k[[#This Row],[Name]],members,2,0),\"\")","v":9},{"$f":"COUNT(Club5k[[#This Row],[Jan-13]:[Nov-13]])","v":3},{"$f":"SUM(Club5k[[#This Row],[Jan-13]:[Nov-13]])","v":15},null,5,null,null,null,null,null,5,null,5]
[null,{"$f":"Club5k[[#This Row],[Mem]]","v":12},"Georgie Hamilton",{"$f":"IFERROR(VLOOKUP(Club5k[[#This Row],[Name]],members,2,0),\"\")","v":12},{"$f":"COUNT(Club5k[[#This Row],[Jan-13]:[Nov-13]])","v":11},{"$f":"SUM(Club5k[[#This Row],[Jan-13]:[Nov-13]])","v":55},5,5,5,5,5,5,5,5,5,5,5]
[null,{"$f":"Club5k[[#This Row],[Mem]]","v":13},"Laura Nathan",{"$f":"IFERROR(VLOOKUP(Club5k[[#This Row],[Name]],members,2,0),\"\")","v":13},{"$f":"COUNT(Club5k[[#This Row],[Jan-13]:[Nov-13]])","v":2},{"$f":"SUM(Club5k[[#This Row],[Jan-13]:[Nov-13]])","v":10},null,null,5,null,null,null,null,null,5]
[null,32,"Michael Hessey",{"$f":"IFERROR(VLOOKUP(Club5k[[#This Row],[Name]],members,2,0),\"\")","v":32},{"$f":"COUNT(Club5k[[#This Row],[Jan-13]:[Nov-13]])","v":2},{"$f":"SUM(Club5k[[#This Row],[Jan-13]:[Nov-13]])","v":10},null,null,null,null,5,null,null,5]
[null,{"$f":"Club5k[[#This Row],[Mem]]","v":39},"Graham Harper",{"$f":"IFERROR(VLOOKUP(Club5k[[#This Row],[Name]],members,2,0),\"\")","v":39},{"$f":"COUNT(Club5k[[#This Row],[Jan-13]:[Nov-13]])","v":10},{"$f":"SUM(Club5k[[#This Row],[Jan-13]:[Nov-13]])","v":50},5,5,5,5,null,5,5,5,5,5,5]
[null,{"$f":"Club5k[[#This Row],[Mem]]","v":53},"Simon Speirs",{"$f":"IFERROR(VLOOKUP(Club5k[[#This Row],[Name]],members,2,0),\"\")","v":53},{"$f":"COUNT(Club5k[[#This Row],[Jan-13]:[Nov-13]])","v":3},{"$f":"SUM(Club5k[[#This Row],[Jan-13]:[Nov-13]])","v":15},null,null,5,null,5,null,null,null,null,null,5]
[null,{"$f":"Club5k[[#This Row],[Mem]]","v":54},"Hannah Turner",{"$f":"IFERROR(VLOOKUP(Club5k[[#This Row],[Name]],members,2,0),\"\")","v":54},{"$f":"COUNT(Club5k[[#This Row],[Jan-13]:[Nov-13]])","v":1},{"$f":"SUM(Club5k[[#This Row],[Jan-13]:[Nov-13]])","v":5},null,null,null,null,null,null,null,5]
[null,{"$f":"Club5k[[#This Row],[Mem]]","v":57},"Lee Scott",{"$f":"IFERROR(VLOOKUP(Club5k[[#This Row],[Name]],members,2,0),\"\")","v":57},{"$f":"COUNT(Club5k[[#This Row],[Jan-13]:[Nov-13]])","v":8},{"$f":"SUM(Club5k[[#This Row],[Jan-13]:[Nov-13]])","v":40},5,null,5,5,5,5,null,5,null,5,5]
[null,{"$f":"Club5k[[#This Row],[Mem]]","v":73},"David Green",{"$f":"IFERROR(VLOOKUP(Club5k[[#This Row],[Name]],members,2,0),\"\")","v":73},{"$f":"COUNT(Club5k[[#This Row],[Jan-13]:[Nov-13]])","v":6},{"$f":"SUM(Club5k[[#This Row],[Jan-13]:[Nov-13]])","v":30},5,null,null,null,5,null,5,null,5,5,5]
[null,{"$f":"Club5k[[#This Row],[Mem]]","v":77},"Sarah Dumbrill",{"$f":"IFERROR(VLOOKUP(Club5k[[#This Row],[Name]],members,2,0),\"\")","v":77},{"$f":"COUNT(Club5k[[#This Row],[Jan-13]:[Nov-13]])","v":10},{"$f":"SUM(Club5k[[#This Row],[Jan-13]:[Nov-13]])","v":50},5,5,5,5,5,5,5,5,5,5]
[null,{"$f":"Club5k[[#This Row],[Mem]]","v":79},"Clive Borthwick",{"$f":"IFERROR(VLOOKUP(Club5k[[#This Row],[Name]],members,2,0),\"\")","v":79},{"$f":"COUNT(Club5k[[#This Row],[Jan-13]:[Nov-13]])","v":5},{"$f":"SUM(Club5k[[#This Row],[Jan-13]:[Nov-13]])","v":25},5,5,5,5,5]
[null,{"$f":"Club5k[[#This Row],[Mem]]","v":93},"Norman Whitwood",{"$f":"IFERROR(VLOOKUP(Club5k[[#This Row],[Name]],members,2,0),\"\")","v":93},{"$f":"COUNT(Club5k[[#This Row],[Jan-13]:[Nov-13]])","v":1},{"$f":"SUM(Club5k[[#This Row],[Jan-13]:[Nov-13]])","v":5},null,null,null,null,null,null,null,5]
[null,{"$f":"Club5k[[#This Row],[Mem]]","v":94},"Jenny Birch",94,{"$f":"COUNT(Club5k[[#This Row],[Jan-13]:[Nov-13]])","v":7},{"$f":"SUM(Club5k[[#This Row],[Jan-13]:[Nov-13]])","v":35},5,5,5,null,5,null,5,null,null,5,5]
[null,{"$f":"Club5k[[#This Row],[Mem]]","v":97},"Jennifer Finlay",{"$f":"IFERROR(VLOOKUP(Club5k[[#This Row],[Name]],members,2,0),\"\")","v":97},{"$f":"COUNT(Club5k[[#This Row],[Jan-13]:[Nov-13]])","v":2},{"$f":"SUM(Club5k[[#This Row],[Jan-13]:[Nov-13]])","v":10},null,null,null,null,null,5,null,null,null,null,5]
[null,{"$f":"Club5k[[#This Row],[Mem]]","v":100},"Phil Jacobs",{"$f":"IFERROR(VLOOKUP(Club5k[[#This Row],[Name]],members,2,0),\"\")","v":100},{"$f":"COUNT(Club5k[[#This Row],[Jan-13]:[Nov-13]])","v":2},{"$f":"SUM(Club5k[[#This Row],[Jan-13]:[Nov-13]])","v":10},null,null,null,null,null,null,5,null,null,null,5]
[null,{"$f":"Club5k[[#This Row],[Mem]]","v":107},"Andy Wilkins",107,{"$f":"COUNT(Club5k[[#This Row],[Jan-13]:[Nov-13]])","v":5},{"$f":"SUM(Club5k[[#This Row],[Jan-13]:[Nov-13]])","v":25},null,null,5,5,5,5,null,null,5]
[null,{"$f":"Club5k[[#This Row],[Mem]]","v":110},"Elliott Lamb",{"$f":"IFERROR(VLOOKUP(Club5k[[#This Row],[Name]],members,2,0),\"\")","v":110},{"$f":"COUNT(Club5k[[#This Row],[Jan-13]:[Nov-13]])","v":4},{"$f":"SUM(Club5k[[#This Row],[Jan-13]:[Nov-13]])","v":20},5,null,null,null,5,null,null,null,null,5,5]
[null,114,"Craig Harper",{"$f":"IFERROR(VLOOKUP(Club5k[[#This Row],[Name]],members,2,0),\"\")","v":114},{"$f":"COUNT(Club5k[[#This Row],[Jan-13]:[Nov-13]])","v":1},{"$f":"SUM(Club5k[[#This Row],[Jan-13]:[Nov-13]])","v":5},null,null,null,null,null,null,null,null,5]
[null,{"$f":"Club5k[[#This Row],[Mem]]","v":116},"Karen Wilkins",{"$f":"IFERROR(VLOOKUP(Club5k[[#This Row],[Name]],members,2,0),\"\")","v":116},{"$f":"COUNT(Club5k[[#This Row],[Jan-13]:[Nov-13]])","v":2},{"$f":"SUM(Club5k[[#This Row],[Jan-13]:[Nov-13]])","v":10},5,null,null,5]
[null,{"$f":"Club5k[[#This Row],[Mem]]","v":119},"Louise Crosby",{"$f":"IFERROR(VLOOKUP(Club5k[[#This Row],[Name]],members,2,0),\"\")","v":119},{"$f":"COUNT(Club5k[[#This Row],[Jan-13]:[Nov-13]])","v":7},{"$f":"SUM(Club5k[[#This Row],[Jan-13]:[Nov-13]])","v":35},5,null,null,null,5,5,5,5,5,5]
[null,{"$f":"Club5k[[#This Row],[Mem]]","v":120},"Brian Yates",{"$f":"IFERROR(VLOOKUP(Club5k[[#This Row],[Name]],members,2,0),\"\")","v":120},{"$f":"COUNT(Club5k[[#This Row],[Jan-13]:[Nov-13]])","v":6},{"$f":"SUM(Club5k[[#This Row],[Jan-13]:[Nov-13]])","v":30},5,null,null,null,null,5,5,5,5,5]
[null,122,{"$f":"VLOOKUP(Club5k[[#This Row],[Num2]],Membynum,2,1)","v":"Richard Johnstone"},{"$f":"IFERROR(VLOOKUP(Club5k[[#This Row],[Name]],members,2,0),\"\")","v":122},{"$f":"COUNT(Club5k[[#This Row],[Jan-13]:[Nov-13]])","v":1},{"$f":"SUM(Club5k[[#This Row],[Jan-13]:[Nov-13]])","v":5},null,null,null,null,5]
[null,{"$f":"Club5k[[#This Row],[Mem]]","v":123},"Tina Pidgeon",{"$f":"IFERROR(VLOOKUP(Club5k[[#This Row],[Name]],members,2,0),\"\")","v":123},{"$f":"COUNT(Club5k[[#This Row],[Jan-13]:[Nov-13]])","v":1},{"$f":"SUM(Club5k[[#This Row],[Jan-13]:[Nov-13]])","v":5},null,null,5]
[null,{"$f":"Club5k[[#This Row],[Mem]]","v":124},"Colette Pidgeon",{"$f":"IFERROR(VLOOKUP(Club5k[[#This Row],[Name]],members,2,0),\"\")","v":124},{"$f":"COUNT(Club5k[[#This Row],[Jan-13]:[Nov-13]])","v":9},{"$f":"SUM(Club5k[[#This Row],[Jan-13]:[Nov-13]])","v":45},5,null,5,5,5,null,5,5,5,5,5]
[null,134,"Dennis Van Goldberdinge",{"$f":"IFERROR(VLOOKUP(Club5k[[#This Row],[Name]],members,2,0),\"\")","v":134},{"$f":"COUNT(Club5k[[#This Row],[Jan-13]:[Nov-13]])","v":1},{"$f":"SUM(Club5k[[#This Row],[Jan-13]:[Nov-13]])","v":5},null,null,null,null,null,null,null,null,5]
[null,{"$f":"Club5k[[#This Row],[Mem]]","v":138},"Emily Hooper",{"$f":"IFERROR(VLOOKUP(Club5k[[#This Row],[Name]],members,2,0),\"\")","v":138},{"$f":"COUNT(Club5k[[#This Row],[Jan-13]:[Nov-13]])","v":1},{"$f":"SUM(Club5k[[#This Row],[Jan-13]:[Nov-13]])","v":5},null,null,null,null,null,null,null,5]
[null,{"$f":"Club5k[[#This Row],[Mem]]","v":141},"James Bentall",{"$f":"IFERROR(VLOOKUP(Club5k[[#This Row],[Name]],members,2,0),\"\")","v":141},{"$f":"COUNT(Club5k[[#This Row],[Jan-13]:[Nov-13]])","v":3},{"$f":"SUM(Club5k[[#This Row],[Jan-13]:[Nov-13]])","v":15}," ",{"$f":"IFERROR(VLOOKUP(Club5k[[#This Row],[Jan-13]],members,2,0),\"\")","v":""},{"$f":"IFERROR(VLOOKUP(Club5k[[#This Row],[Feb-13]],members,2,0),\"\")","v":""},5,{"$f":"IFERROR(VLOOKUP(Club5k[[#This Row],[Apr-13]],members,2,0),\"\")","v":""},5,null,null,null,null,5]
[null,{"$f":"Club5k[[#This Row],[Mem]]","v":143},"Johanna Wood",{"$f":"IFERROR(VLOOKUP(Club5k[[#This Row],[Name]],members,2,0),\"\")","v":143},{"$f":"COUNT(Club5k[[#This Row],[Jan-13]:[Nov-13]])","v":5},{"$f":"SUM(Club5k[[#This Row],[Jan-13]:[Nov-13]])","v":25},null,null,5,5,5,5,null,5]
[null,{"$f":"Club5k[[#This Row],[Mem]]","v":149},"Joanne Richards",{"$f":"IFERROR(VLOOKUP(Club5k[[#This Row],[Name]],members,2,0),\"\")","v":149},{"$f":"COUNT(Club5k[[#This Row],[Jan-13]:[Nov-13]])","v":1},{"$f":"SUM(Club5k[[#This Row],[Jan-13]:[Nov-13]])","v":5},null,null,null,null,null,null,null,5]
[null,{"$f":"Club5k[[#This Row],[Mem]]","v":167},"Ian Long",{"$f":"IFERROR(VLOOKUP(Club5k[[#This Row],[Name]],members,2,0),\"\")","v":167},{"$f":"COUNT(Club5k[[#This Row],[Jan-13]:[Nov-13]])","v":1},{"$f":"SUM(Club5k[[#This Row],[Jan-13]:[Nov-13]])","v":5},null,null,5]
[null,{"$f":"Club5k[[#This Row],[Mem]]","v":171},"Amy Curtis",{"$f":"IFERROR(VLOOKUP(Club5k[[#This Row],[Name]],members,2,0),\"\")","v":171},{"$f":"COUNT(Club5k[[#This Row],[Jan-13]:[Nov-13]])","v":2},{"$f":"SUM(Club5k[[#This Row],[Jan-13]:[Nov-13]])","v":10},5,null,null,5]
[null,{"$f":"Club5k[[#This Row],[Mem]]","v":178},"Joolz Scott",{"$f":"IFERROR(VLOOKUP(Club5k[[#This Row],[Name]],members,2,0),\"\")","v":178},{"$f":"COUNT(Club5k[[#This Row],[Jan-13]:[Nov-13]])","v":6},{"$f":"SUM(Club5k[[#This Row],[Jan-13]:[Nov-13]])","v":30},5,null,null,5,5,null,5,5,null,5]
[null,{"$f":"Club5k[[#This Row],[Mem]]","v":185},"John Rowlands",{"$f":"IFERROR(VLOOKUP(Club5k[[#This Row],[Name]],members,2,0),\"\")","v":185},{"$f":"COUNT(Club5k[[#This Row],[Jan-13]:[Nov-13]])","v":2},{"$f":"SUM(Club5k[[#This Row],[Jan-13]:[Nov-13]])","v":10},null,null,null,null,null,null,5,null,5]
[null,{"$f":"Club5k[[#This Row],[Mem]]","v":187},"Paul Geary",{"$f":"IFERROR(VLOOKUP(Club5k[[#This Row],[Name]],members,2,0),\"\")","v":187},{"$f":"COUNT(Club5k[[#This Row],[Jan-13]:[Nov-13]])","v":1},{"$f":"SUM(Club5k[[#This Row],[Jan-13]:[Nov-13]])","v":5},null,null,null,null,null,null,5]
[null,{"$f":"Club5k[[#This Row],[Mem]]","v":192},"Paul Savage",{"$f":"IFERROR(VLOOKUP(Club5k[[#This Row],[Name]],members,2,0),\"\")","v":192},{"$f":"COUNT(Club5k[[#This Row],[Jan-13]:[Nov-13]])","v":1},{"$f":"SUM(Club5k[[#This Row],[Jan-13]:[Nov-13]])","v":5},null,null,null,null,null,null,null,5]
[null,{"$f":"Club5k[[#This Row],[Mem]]","v":194},"Paul Brewster",{"$f":"IFERROR(VLOOKUP(Club5k[[#This Row],[Name]],members,2,0),\"\")","v":194},{"$f":"COUNT(Club5k[[#This Row],[Jan-13]:[Nov-13]])","v":1},{"$f":"SUM(Club5k[[#This Row],[Jan-13]:[Nov-13]])","v":5},null,null,null,null,null,5]
[null,{"$f":"Club5k[[#This Row],[Mem]]","v":203},"Jamie Nathan",{"$f":"IFERROR(VLOOKUP(Club5k[[#This Row],[Name]],members,2,0),\"\")","v":203},{"$f":"COUNT(Club5k[[#This Row],[Jan-13]:[Nov-13]])","v":2},{"$f":"SUM(Club5k[[#This Row],[Jan-13]:[Nov-13]])","v":10},null,null,5,null,null,null,null,null,null,null,5]
[null,{"$f":"Club5k[[#This Row],[Mem]]","v":204},"Steff Bailey",204,{"$f":"COUNT(Club5k[[#This Row],[Jan-13]:[Nov-13]])","v":3},{"$f":"SUM(Club5k[[#This Row],[Jan-13]:[Nov-13]])","v":15},null,5,null,null,null,null,null,null,5,5]
[null,{"$f":"Club5k[[#This Row],[Mem]]","v":208},"Simon Townsend",{"$f":"IFERROR(VLOOKUP(Club5k[[#This Row],[Name]],members,2,0),\"\")","v":208},{"$f":"COUNT(Club5k[[#This Row],[Jan-13]:[Nov-13]])","v":4},{"$f":"SUM(Club5k[[#This Row],[Jan-13]:[Nov-13]])","v":20},5,5,5,null,null,null,null,5]
[null,{"$f":"Club5k[[#This Row],[Mem]]","v":212},"Andrew Cripps",{"$f":"IFERROR(VLOOKUP(Club5k[[#This Row],[Name]],members,2,0),\"\")","v":212},{"$f":"COUNT(Club5k[[#This Row],[Jan-13]:[Nov-13]])","v":5},{"$f":"SUM(Club5k[[#This Row],[Jan-13]:[Nov-13]])","v":25},5,null,5,5,5,null,null,5]
[null,{"$f":"Club5k[[#This Row],[Mem]]","v":219},"Lisa Long",{"$f":"IFERROR(VLOOKUP(Club5k[[#This Row],[Name]],members,2,0),\"\")","v":219},{"$f":"COUNT(Club5k[[#This Row],[Jan-13]:[Nov-13]])","v":1},{"$f":"SUM(Club5k[[#This Row],[Jan-13]:[Nov-13]])","v":5},null,null,5]
[null,{"$f":"Club5k[[#This Row],[Mem]]","v":223},"Steve Bowran",{"$f":"IFERROR(VLOOKUP(Club5k[[#This Row],[Name]],members,2,0),\"\")","v":223},{"$f":"COUNT(Club5k[[#This Row],[Jan-13]:[Nov-13]])","v":4},{"$f":"SUM(Club5k[[#This Row],[Jan-13]:[Nov-13]])","v":20},5,null,null,null,5,null,null,null,null,5,5]
[null,{"$f":"Club5k[[#This Row],[Mem]]","v":225},"Jennifer Cunniff",{"$f":"IFERROR(VLOOKUP(Club5k[[#This Row],[Name]],members,2,0),\"\")","v":225},{"$f":"COUNT(Club5k[[#This Row],[Jan-13]:[Nov-13]])","v":3},{"$f":"SUM(Club5k[[#This Row],[Jan-13]:[Nov-13]])","v":15},null,null,5,null,null,5,5]
[null,{"$f":"Club5k[[#This Row],[Mem]]","v":227},"Chris Cottle",{"$f":"IFERROR(VLOOKUP(Club5k[[#This Row],[Name]],members,2,0),\"\")","v":227},{"$f":"COUNT(Club5k[[#This Row],[Jan-13]:[Nov-13]])","v":3},{"$f":"SUM(Club5k[[#This Row],[Jan-13]:[Nov-13]])","v":15},null,5,null,null,null,null,null,null,null,5,5]
[null,{"$f":"Club5k[[#This Row],[Mem]]","v":231},"Ed Rhodes",231,{"$f":"COUNT(Club5k[[#This Row],[Jan-13]:[Nov-13]])","v":9},{"$f":"SUM(Club5k[[#This Row],[Jan-13]:[Nov-13]])","v":45},5,5,5,5,null,5,null,5,5,5,5]
[null,{"$f":"Club5k[[#This Row],[Mem]]","v":232},"Philippa O'Donovan",{"$f":"IFERROR(VLOOKUP(Club5k[[#This Row],[Name]],members,2,0),\"\")","v":232},{"$f":"COUNT(Club5k[[#This Row],[Jan-13]:[Nov-13]])","v":3},{"$f":"SUM(Club5k[[#This Row],[Jan-13]:[Nov-13]])","v":15},5,null,null,null,null,null,null,5,null,null,5]
[null,{"$f":"Club5k[[#This Row],[Mem]]","v":233},"Pierre-Louis Gatti",{"$f":"IFERROR(VLOOKUP(Club5k[[#This Row],[Name]],members,2,0),\"\")","v":233},{"$f":"COUNT(Club5k[[#This Row],[Jan-13]:[Nov-13]])","v":1},{"$f":"SUM(Club5k[[#This Row],[Jan-13]:[Nov-13]])","v":5},null,null,null,null,null,null,null,5]
[null,234,{"$f":"VLOOKUP(Club5k[[#This Row],[Num2]],Membynum,2,1)","v":"Catriona Davis"},{"$f":"IFERROR(VLOOKUP(Club5k[[#This Row],[Name]],members,2,0),\"\")","v":234},{"$f":"COUNT(Club5k[[#This Row],[Jan-13]:[Nov-13]])","v":1},{"$f":"SUM(Club5k[[#This Row],[Jan-13]:[Nov-13]])","v":5},null,null,null,null,null,null,null,5]
[null,237,{"$f":"VLOOKUP(Club5k[[#This Row],[Num2]],Membynum,2,1)","v":"Andrew Hazley-Payne"},{"$f":"IFERROR(VLOOKUP(Club5k[[#This Row],[Name]],members,2,0),\"\")","v":237},{"$f":"COUNT(Club5k[[#This Row],[Jan-13]:[Nov-13]])","v":1},{"$f":"SUM(Club5k[[#This Row],[Jan-13]:[Nov-13]])","v":5},null,null,null,null,null,null,null,null,null,5]
[null,{"$f":"Club5k[[#This Row],[Mem]]","v":238},"Chitra Dunn",{"$f":"IFERROR(VLOOKUP(Club5k[[#This Row],[Name]],members,2,0),\"\")","v":238},{"$f":"COUNT(Club5k[[#This Row],[Jan-13]:[Nov-13]])","v":11},{"$f":"SUM(Club5k[[#This Row],[Jan-13]:[Nov-13]])","v":55},5,5,5,5,5,5,5,5,5,5,5]
[null,{"$f":"Club5k[[#This Row],[Mem]]","v":239},"Andy Jordan",{"$f":"IFERROR(VLOOKUP(Club5k[[#This Row],[Name]],members,2,0),\"\")","v":239},{"$f":"COUNT(Club5k[[#This Row],[Jan-13]:[Nov-13]])","v":4},{"$f":"SUM(Club5k[[#This Row],[Jan-13]:[Nov-13]])","v":20},null,null,null,null,null,5,5,5,null,null,5]
[null,{"$f":"Club5k[[#This Row],[Mem]]","v":240},"Jamie Davies",{"$f":"IFERROR(VLOOKUP(Club5k[[#This Row],[Name]],members,2,0),\"\")","v":240},{"$f":"COUNT(Club5k[[#This Row],[Jan-13]:[Nov-13]])","v":9},{"$f":"SUM(Club5k[[#This Row],[Jan-13]:[Nov-13]])","v":45},5,5,null,5,5,null,5,5,5,5,5]
[null,{"$f":"Club5k[[#This Row],[Mem]]","v":243},"Julian Jones",{"$f":"IFERROR(VLOOKUP(Club5k[[#This Row],[Name]],members,2,0),\"\")","v":243},{"$f":"COUNT(Club5k[[#This Row],[Jan-13]:[Nov-13]])","v":5},{"$f":"SUM(Club5k[[#This Row],[Jan-13]:[Nov-13]])","v":25},5,null,null,5,null,5,5,5]
[null,{"$f":"Club5k[[#This Row],[Mem]]","v":252},"John Mercer",{"$f":"IFERROR(VLOOKUP(Club5k[[#This Row],[Name]],members,2,0),\"\")","v":252},{"$f":"COUNT(Club5k[[#This Row],[Jan-13]:[Nov-13]])","v":5},{"$f":"SUM(Club5k[[#This Row],[Jan-13]:[Nov-13]])","v":25},5,null,null,5,5,5,5]
[null,{"$f":"Club5k[[#This Row],[Mem]]","v":253},"Carl Batchelder",{"$f":"IFERROR(VLOOKUP(Club5k[[#This Row],[Name]],members,2,0),\"\")","v":253},{"$f":"COUNT(Club5k[[#This Row],[Jan-13]:[Nov-13]])","v":1},{"$f":"SUM(Club5k[[#This Row],[Jan-13]:[Nov-13]])","v":5},null,5]
[null,{"$f":"Club5k[[#This Row],[Mem]]","v":255},"Richard Saunders",{"$f":"IFERROR(VLOOKUP(Club5k[[#This Row],[Name]],members,2,0),\"\")","v":255},{"$f":"COUNT(Club5k[[#This Row],[Jan-13]:[Nov-13]])","v":1},{"$f":"SUM(Club5k[[#This Row],[Jan-13]:[Nov-13]])","v":5},5]
[null,256,"Alison Cole",256,{"$f":"COUNT(Club5k[[#This Row],[Jan-13]:[Nov-13]])","v":2},{"$f":"SUM(Club5k[[#This Row],[Jan-13]:[Nov-13]])","v":10},null,null,null,5,null,null,5]
[null,{"$f":"Club5k[[#This Row],[Mem]]","v":257},"Sarah Chilvers",{"$f":"IFERROR(VLOOKUP(Club5k[[#This Row],[Name]],members,2,0),\"\")","v":257},{"$f":"COUNT(Club5k[[#This Row],[Jan-13]:[Nov-13]])","v":3},{"$f":"SUM(Club5k[[#This Row],[Jan-13]:[Nov-13]])","v":15},null,5,null,null,null,5,null,5]
[null,{"$f":"Club5k[[#This Row],[Mem]]","v":259},"Alex Butterworth",{"$f":"IFERROR(VLOOKUP(Club5k[[#This Row],[Name]],members,2,0),\"\")","v":259},{"$f":"COUNT(Club5k[[#This Row],[Jan-13]:[Nov-13]])","v":1},{"$f":"SUM(Club5k[[#This Row],[Jan-13]:[Nov-13]])","v":5},5]
[null,{"$f":"Club5k[[#This Row],[Mem]]","v":260},"Ben Sweeting",{"$f":"IFERROR(VLOOKUP(Club5k[[#This Row],[Name]],members,2,0),\"\")","v":260},{"$f":"COUNT(Club5k[[#This Row],[Jan-13]:[Nov-13]])","v":1},{"$f":"SUM(Club5k[[#This Row],[Jan-13]:[Nov-13]])","v":5},null,5]
[null,{"$f":"Club5k[[#This Row],[Mem]]","v":262},"Gordon Alexander",{"$f":"IFERROR(VLOOKUP(Club5k[[#This Row],[Name]],members,2,0),\"\")","v":262},{"$f":"COUNT(Club5k[[#This Row],[Jan-13]:[Nov-13]])","v":1},{"$f":"SUM(Club5k[[#This Row],[Jan-13]:[Nov-13]])","v":5},null,5]
[null,{"$f":"Club5k[[#This Row],[Mem]]","v":263},"Jay Smith",263,{"$f":"COUNT(Club5k[[#This Row],[Jan-13]:[Nov-13]])","v":3},{"$f":"SUM(Club5k[[#This Row],[Jan-13]:[Nov-13]])","v":15},null,null,5,5,5]
[null,264,{"$f":"VLOOKUP(Club5k[[#This Row],[Num2]],Membynum,2,1)","v":"Derek Lambert"},{"$f":"IFERROR(VLOOKUP(Club5k[[#This Row],[Name]],members,2,0),\"\")","v":264},{"$f":"COUNT(Club5k[[#This Row],[Jan-13]:[Nov-13]])","v":4},{"$f":"SUM(Club5k[[#This Row],[Jan-13]:[Nov-13]])","v":20},null,null,null,null,5,null,5,null,null,5,5]
[null,{"$f":"Club5k[[#This Row],[Mem]]","v":266},"Ellen Colebrook",{"$f":"IFERROR(VLOOKUP(Club5k[[#This Row],[Name]],members,2,0),\"\")","v":266},{"$f":"COUNT(Club5k[[#This Row],[Jan-13]:[Nov-13]])","v":2},{"$f":"SUM(Club5k[[#This Row],[Jan-13]:[Nov-13]])","v":10},null,5,5]
[null,{"$f":"Club5k[[#This Row],[Mem]]","v":267},"Joanne Curtis",{"$f":"IFERROR(VLOOKUP(Club5k[[#This Row],[Name]],members,2,0),\"\")","v":267},{"$f":"COUNT(Club5k[[#This Row],[Jan-13]:[Nov-13]])","v":5},{"$f":"SUM(Club5k[[#This Row],[Jan-13]:[Nov-13]])","v":25},5,null,null,5,5,null,5,null,null,5]
[null,269,{"$f":"VLOOKUP(Club5k[[#This Row],[Num2]],Membynum,2,1)","v":"Patrick McGuinness"},{"$f":"IFERROR(VLOOKUP(Club5k[[#This Row],[Name]],members,2,0),\"\")","v":269},{"$f":"COUNT(Club5k[[#This Row],[Jan-13]:[Nov-13]])","v":4},{"$f":"SUM(Club5k[[#This Row],[Jan-13]:[Nov-13]])","v":20},null,null,null,null,5,5,5,5]
[null,{"$f":"Club5k[[#This Row],[Mem]]","v":270},"Christine Esson",{"$f":"IFERROR(VLOOKUP(Club5k[[#This Row],[Name]],members,2,0),\"\")","v":270},{"$f":"COUNT(Club5k[[#This Row],[Jan-13]:[Nov-13]])","v":3},{"$f":"SUM(Club5k[[#This Row],[Jan-13]:[Nov-13]])","v":15},5,5,null,null,5]
[null,{"$f":"Club5k[[#This Row],[Mem]]","v":275},"Victoria Johns",{"$f":"IFERROR(VLOOKUP(Club5k[[#This Row],[Name]],members,2,0),\"\")","v":275},{"$f":"COUNT(Club5k[[#This Row],[Jan-13]:[Nov-13]])","v":3},{"$f":"SUM(Club5k[[#This Row],[Jan-13]:[Nov-13]])","v":15},null,null,null,null,null,5,null,null,5,5]
[null,279,{"$f":"VLOOKUP(Club5k[[#This Row],[Num2]],Membynum,2,1)","v":"Jonathan Budge"},{"$f":"IFERROR(VLOOKUP(Club5k[[#This Row],[Name]],members,2,0),\"\")","v":279},{"$f":"COUNT(Club5k[[#This Row],[Jan-13]:[Nov-13]])","v":1},{"$f":"SUM(Club5k[[#This Row],[Jan-13]:[Nov-13]])","v":5},null,null,null,null,5]
[null,{"$f":"Club5k[[#This Row],[Mem]]","v":282},"Helen MacFarlane",{"$f":"IFERROR(VLOOKUP(Club5k[[#This Row],[Name]],members,2,0),\"\")","v":282},{"$f":"COUNT(Club5k[[#This Row],[Jan-13]:[Nov-13]])","v":1},{"$f":"SUM(Club5k[[#This Row],[Jan-13]:[Nov-13]])","v":5},null,null,null,null,null,null,5]
[null,283,{"$f":"VLOOKUP(Club5k[[#This Row],[Num2]],Membynum,2,1)","v":"Richard Moreton"},{"$f":"IFERROR(VLOOKUP(Club5k[[#This Row],[Name]],members,2,0),\"\")","v":283},{"$f":"COUNT(Club5k[[#This Row],[Jan-13]:[Nov-13]])","v":6},{"$f":"SUM(Club5k[[#This Row],[Jan-13]:[Nov-13]])","v":30},null,null,null,null,5,null,5,5,5,5,5]
[null,{"$f":"Club5k[[#This Row],[Mem]]","v":284},"Iona Aitken",{"$f":"IFERROR(VLOOKUP(Club5k[[#This Row],[Name]],members,2,0),\"\")","v":284},{"$f":"COUNT(Club5k[[#This Row],[Jan-13]:[Nov-13]])","v":2},{"$f":"SUM(Club5k[[#This Row],[Jan-13]:[Nov-13]])","v":10},null,null,null,null,null,null,5,null,null,null,5]
[null,285,{"$f":"VLOOKUP(Club5k[[#This Row],[Num2]],Membynum,2,1)","v":"Philip Wigg"},{"$f":"IFERROR(VLOOKUP(Club5k[[#This Row],[Name]],members,2,0),\"\")","v":285},{"$f":"COUNT(Club5k[[#This Row],[Jan-13]:[Nov-13]])","v":4},{"$f":"SUM(Club5k[[#This Row],[Jan-13]:[Nov-13]])","v":20},null,null,null,null,5,null,5,5,null,null,5]
[null,{"$f":"Club5k[[#This Row],[Mem]]","v":287},"Paul Hill",{"$f":"IFERROR(VLOOKUP(Club5k[[#This Row],[Name]],members,2,0),\"\")","v":287},{"$f":"COUNT(Club5k[[#This Row],[Jan-13]:[Nov-13]])","v":1},{"$f":"SUM(Club5k[[#This Row],[Jan-13]:[Nov-13]])","v":5},null,null,null,null,null,null,null,5]
[null,{"$f":"Club5k[[#This Row],[Mem]]","v":288},"Theo Green",{"$f":"IFERROR(VLOOKUP(Club5k[[#This Row],[Name]],members,2,0),\"\")","v":288},{"$f":"COUNT(Club5k[[#This Row],[Jan-13]:[Nov-13]])","v":1},{"$f":"SUM(Club5k[[#This Row],[Jan-13]:[Nov-13]])","v":5},null,null,null,null,null,null,5]
[null,{"$f":"Club5k[[#This Row],[Mem]]","v":289},"Gordon Ray",{"$f":"IFERROR(VLOOKUP(Club5k[[#This Row],[Name]],members,2,0),\"\")","v":289},{"$f":"COUNT(Club5k[[#This Row],[Jan-13]:[Nov-13]])","v":1},{"$f":"SUM(Club5k[[#This Row],[Jan-13]:[Nov-13]])","v":5},null,null,null,null,null,null,5]
[null,{"$f":"Club5k[[#This Row],[Mem]]","v":290},"David Salmon",{"$f":"IFERROR(VLOOKUP(Club5k[[#This Row],[Name]],members,2,0),\"\")","v":290},{"$f":"COUNT(Club5k[[#This Row],[Jan-13]:[Nov-13]])","v":3},{"$f":"SUM(Club5k[[#This Row],[Jan-13]:[Nov-13]])","v":15},null,null,null,null,null,null,null,5,5,5]
[null,291,"Iain O'Kane",{"$f":"IFERROR(VLOOKUP(Club5k[[#This Row],[Name]],members,2,0),\"\")","v":291},{"$f":"COUNT(Club5k[[#This Row],[Jan-13]:[Nov-13]])","v":1},{"$f":"SUM(Club5k[[#This Row],[Jan-13]:[Nov-13]])","v":5},null,null,null,null,null,null,null,null,5]
[null,{"$f":"Club5k[[#This Row],[Mem]]","v":292},"Justin Busby",{"$f":"IFERROR(VLOOKUP(Club5k[[#This Row],[Name]],members,2,0),\"\")","v":292},{"$f":"COUNT(Club5k[[#This Row],[Jan-13]:[Nov-13]])","v":1},{"$f":"SUM(Club5k[[#This Row],[Jan-13]:[Nov-13]])","v":5},null,null,null,null,null,null,null,5]
[null,{"$f":"Club5k[[#This Row],[Mem]]","v":293},"Tom Flett",{"$f":"IFERROR(VLOOKUP(Club5k[[#This Row],[Name]],members,2,0),\"\")","v":293},{"$f":"COUNT(Club5k[[#This Row],[Jan-13]:[Nov-13]])","v":1},{"$f":"SUM(Club5k[[#This Row],[Jan-13]:[Nov-13]])","v":5},null,null,null,null,null,null,null,null,5]
[null,295,"Colette Gissane",{"$f":"IFERROR(VLOOKUP(Club5k[[#This Row],[Name]],members,2,0),\"\")","v":295},{"$f":"COUNT(Club5k[[#This Row],[Jan-13]:[Nov-13]])","v":1},{"$f":"SUM(Club5k[[#This Row],[Jan-13]:[Nov-13]])","v":5},null,null,null,null,null,null,null,null,5]
[null,298,"Dan Winfield",{"$f":"IFERROR(VLOOKUP(Club5k[[#This Row],[Name]],members,2,0),\"\")","v":298},{"$f":"COUNT(Club5k[[#This Row],[Jan-13]:[Nov-13]])","v":1},{"$f":"SUM(Club5k[[#This Row],[Jan-13]:[Nov-13]])","v":5},null,null,null,null,null,null,null,5]
[null,303,{"$f":"VLOOKUP(Club5k[[#This Row],[Num2]],Membynum,2,1)","v":"Ross Gissane"},{"$f":"IFERROR(VLOOKUP(Club5k[[#This Row],[Name]],members,2,0),\"\")","v":303},{"$f":"COUNT(Club5k[[#This Row],[Jan-13]:[Nov-13]])","v":1},{"$f":"SUM(Club5k[[#This Row],[Jan-13]:[Nov-13]])","v":5},null,null,null,null,null,null,null,null,null,null,5]
[null,306,{"$f":"VLOOKUP(Club5k[[#This Row],[Num2]],Membynum,2,1)","v":"Kate Kitchener"},{"$f":"IFERROR(VLOOKUP(Club5k[[#This Row],[Name]],members,2,0),\"\")","v":306},{"$f":"COUNT(Club5k[[#This Row],[Jan-13]:[Nov-13]])","v":1},{"$f":"SUM(Club5k[[#This Row],[Jan-13]:[Nov-13]])","v":5},null,null,null,null,null,null,null,null,null,5]
[null,309,"Robin Harris ",309,{"$f":"COUNT(Club5k[[#This Row],[Jan-13]:[Nov-13]])","v":1},{"$f":"SUM(Club5k[[#This Row],[Jan-13]:[Nov-13]])","v":5},null,null,null,null,null,null,null,null,null,5]
[null,315,{"$f":"VLOOKUP(Club5k[[#This Row],[Num2]],Membynum,2,1)","v":"Warrick Raath"},{"$f":"IFERROR(VLOOKUP(Club5k[[#This Row],[Name]],members,2,0),\"\")","v":315},{"$f":"COUNT(Club5k[[#This Row],[Jan-13]:[Nov-13]])","v":1},{"$f":"SUM(Club5k[[#This Row],[Jan-13]:[Nov-13]])","v":5},null,null,null,null,null,null,null,null,null,null,5]
[null,316,{"$f":"VLOOKUP(Club5k[[#This Row],[Num2]],Membynum,2,1)","v":"Riana Walsh"},{"$f":"IFERROR(VLOOKUP(Club5k[[#This Row],[Name]],members,2,0),\"\")","v":316},{"$f":"COUNT(Club5k[[#This Row],[Jan-13]:[Nov-13]])","v":1},{"$f":"SUM(Club5k[[#This Row],[Jan-13]:[Nov-13]])","v":5},null,null,null,null,null,null,null,null,null,null,5]
[null,null,{"$f":"SUBTOTAL(103,Club5k[Name])","v":88},null,{"$f":"SUBTOTAL(104,Club5k[Events])","v":11},{"$f":"SUBTOTAL(102,Club5k[Total])","v":88},{"$f":"SUBTOTAL(103,Club5k[Jan-13])","v":28},{"$f":"SUBTOTAL(103,Club5k[Feb-13])","v":19},{"$f":"SUBTOTAL(103,Club5k[Mar-13])","v":23},{"$f":"SUBTOTAL(103,Club5k[Apr-13])","v":22},{"$f":"SUBTOTAL(103,Club5k[May-13])","v":29},{"$f":"SUBTOTAL(103,Club5k[Jun-13])","v":20},{"$f":"SUBTOTAL(102,Club5k[Jul-13])","v":28},{"$f":"SUBTOTAL(103,Club5k[Aug-13])","v":34},{"$f":"SUBTOTAL(103,Club5k[Sep-13])","v":22},{"$f":"SUBTOTAL(103,Club5k[Oct-13])","v":26},{"$f":"SUBTOTAL(103,Club5k[Nov-13])","v":26}]

{"sheet":"Parkrun Results","index":3,"n_rows":54,"n_cols":11,"rows_kept":54,"cut":false,"hidden":false,"merged":[]}
[null,"Parkrun Best time in 2013",null,null,null,null,"`"]
[null,null,null,null,null,null,null,null,null,null,""]
[null,"Parkrun number","Name","Age Group","PB Date"," WAVA","PB Time","Points"]
[null,141774,"Jennifer FINLAY","VW40-44","2013-04-27",0.74660000000000004,"20:55",49]
[null,157874,"Jamie FISHER","VM40-44","2013-07-20",0.68420000000000003,"19:57",33]
[null,214862,"Simon SPEIRS","VM40-44","2013-09-14",0.80840000000000001,"17:24",50]
[null,220217,"Ian LONG","SM35-39","2013-01-12",0.61450000000000005,"22:03",25]
[null,224770,"Georgie HAMILTON","VW65-69","2013-01-05",0.78259999999999996,"27:59",39]
[null,235751,"David Adam MORITZ","SM30-34","2013-05-18",0.69220000000000004,"18:41",45]
[null,237510,"Andy JORDAN","VM50-54","2013-12-21",0.7853,"18:47",43]
[null,248706,"John ROWLANDS","VM60-64","2013-09-21",0.68569999999999998,"23:23",22]
[null,284465,"Richard JOHNSTONE","VM40-44","2013-08-17",0.68879999999999997,"19:49",35]
[null,285599,"Ronjon CHAKRAVERTY","VM45-49","2013-10-05",0.72099999999999997,"20:08",32]
[null,287478,"Graham HARPER","VM55-59","2013-08-10",0.66379999999999995,"23:21",23]
[null,287650,"Louise CROSBY","VW50-54","2013-05-25",0.7863,"22:09",46]
[null,295116,"Julian JONES","VM40-44","2013-06-15",0.70789999999999997,"19:17",40]
[null,295914,"Lee SCOTT","VM45-49","2013-06-29",0.77010000000000001,"18:25",46]
[null,309770,"David GREEN","VM50-54","2013-07-06",0.84609999999999996,"17:45",49]
[null,318081,"Emily HOOPER","VW35-39","2013-07-06",0.6724,"22:14",45]
[null,327723,"Brian YATES","VM65-69","2013-09-14",0.66039999999999999,"26:24",17]
[null,332519,"Andrew CRIPPS","VM45-49","2013-11-30",0.73370000000000002,"19:28",38]
[null,341924,"Joanne RICHARDS","VW40-44","2013-09-07",0.61539999999999995,"25:34",42]
[null,345899,"Philippa O'DONOVAN","SW30-34","2013-10-12",0.623,"23:47",44]
[null,346162,"Chitra DUNN","VM50-54","2013-09-14",0.64410000000000001,"23:39",20]
[null,349302,"Phil JACOBS","VM40-44","2013-09-28",0.72550000000000003,"19:15",41]
[null,350062,"Hannah TURNER","VW35-39","2013-09-07",0.77129999999999999,"19:23",50]
[null,350198,"Andy WILKINS","VM40-44","2013-08-31",0.71619999999999995,"19:30",37]
[null,351148,"Pierre-Louis GATTI","SM30-34","2013-02-09",0.4899,"26:22",18]
[null,353174,"Simon TOWNSEND","VM45-49","2013-12-14",0.67390000000000005,"21:22",26]
[null,353523,"Michael HESSEY","VM45-49","2013-07-06",0.68569999999999998,"21:00",27]
[null,357345,"Jamie Patrick DAVIES","SM35-39","2013-05-25",0.56969999999999998,"23:26",21]
[null,406813,"Stephen J BOWRAN","VM45-49","2013-11-23",0.7349,"19:18",39]
[null,407032,"Alexandra O'DONOVAN","SW30-34","2013-08-17",0.69289999999999996,"21:23",48]
[null,418961,"Sarah CHILVERS","VW50-54","2013-03-30",0.70630000000000004,"24:58",43]
[null,422513,"Colette Michelle PIDGEON","VW35-39","2013-04-13",0.55500000000000005,"27:16",40]
[null,425723,"Tina PIDGEON","VW35-39","2013-09-07",0.49890000000000001,"29:58",36]
[null,430429,"Christine ESSON","VW45-49","2013-08-10",0.56799999999999995,"28:49",37]
[null,462397,"Gordon ALEXANDER","VM45-49","2013-03-09",0.74160000000000004,"19:44",36]
[null,489298,"Paul GOODWIN","SM30-34","2013-12-14",0.72599999999999998,"18:04",47]
[null,506127,"James BENTALL","VM40-44","2013-08-17",0.62839999999999996,"22:23",24]
[null,516185,"Benjamin TURNER","VM40-44","2013-08-31",0.59230000000000005,"23:45",19]
[null,561973,"Patrick MCGUINNESS","VM45-49","2013-08-10",0.76060000000000005,"18:56",42]
[null,580161,"Theo GREEN","SM20-24","2013-09-07",0.62560000000000004,"20:50",29]
[null,610402,"Sarah DUMBRILL","SW30-34","2013-08-03",0.67320000000000002,"22:08",47]
[null,637644,"Paul SAVAGE","VM45-49","2013-09-07",0.69220000000000004,"20:38",30]
[null,640951,"Ed RHODES","VM40-44","2013-08-31",0.70750000000000002,"19:53",34]
[null,645231,"Norman WHITWOOD","VM65-69","2013-11-30",0.59330000000000005,"29:23",16]
[null,646541,"Richard MORETON","VM40-44","2013-09-07",0.66559999999999997,"20:59",28]
[null,652961,"Ammon PIEPGRASS","SM35-39","2013-11-23",0.73839999999999995,"17:58",48]
[null,653726,"Iain TUCKER","SM35-39","2013-10-19",0.71860000000000002,"18:43",44]
[null,687568,"Kay GREENWAY","VW45-49","2013-11-23",0.55669999999999997,"28:32",38]
[null,738705,"Jillian RUSSELL","VW45-49","2013-11-23",0.63600000000000001,"26:03",41]
[null,755680,"Chris COTTLE","SM30-34","2013-12-07",0.64239999999999997,"20:25",31]
[null,"Total",null,null,null,null,null,{"$f":"SUBTOTAL(103,Parkrun[Points])","v":50}]

{"sheet":"Half Marathon Results","index":4,"n_rows":70,"n_cols":34,"rows_kept":70,"cut":false,"hidden":false,"merged":[]}
[null,"Half Marathon"]
[]
[null,"Name","Mem","# Eevnts","Gender","Points","GentsBestTime","Ladies Best Time","Watford Secs","Watchip","watfordplace","watfordwava","WatfordChip","Silverstonesecs","Silverstonetime2","Silverstone Place","Silverstone Time","Berkosecs","Berko time2","Berko Place","Berko Time","STA Place","STASecs","St Albans Points","St Albans time","MK half Place","MK Half time","MK Secs","St Neots Half  Place","St Neots Half Time","St Neots Seconds"]
[null,"Georgie Hamilton",{"$f":"VLOOKUP(Halfmarathon[[#This Row],[Name]],members,2,FALSE)","v":12},{"$f":"COUNT(Halfmarathon[[#This Row],[watfordplace]],Halfmarathon[[#This Row],[Silverstone Place]],Halfmarathon[[#This Row],[Berko Place]],Halfmarathon[[#This Row],[STA Place]],Halfmarathon[[#This Row],[St Neots Half  Place]])","v":2},"F",{"$f":"IFERROR(IF(Halfmarathon[[#This Row],[Gender]]=\"M\",50-(RANK(Halfmarathon[[#This Row],[GentsBestTime]],Halfmarathon[GentsBestTime],1))+1,50-(RANK(Halfmarathon[[#This Row],[Ladies Best Time]],Halfmarathon[Ladies Best Time],1))+1)+Halfmarathon[[#This Row],[St Albans Points]],Halfmarathon[[#This Row],[St Albans Points]])","v":45},{"$f":"IF(Halfmarathon[[#This Row],[Gender]]=\"M\",IF(SUM($I4,$N4,$R4,$AB4,Halfmarathon[[#This Row],[St Neots Seconds]])=499995,\"\",(MIN($I4,$N4,$R4,$AB4,Halfmarathon[[#This Row],[St Neots Seconds]]))/86400),\"\")","v":""},{"$f":"IF(Halfmarathon[[#This Row],[Gender]]=\"F\",IF(SUM($I4,$N4,$R4,$AB4,Halfmarathon[[#This Row],[St Neots Seconds]])=499995,\"\",(MIN($I4,$N4,$S4,$AB4,Halfmarathon[[#This Row],[St Neots Seconds]]))/86400),\"\")","v":"02:02:10"},{"$f":"IFERROR((HOUR(Halfmarathon[[#This Row],[Watchip]])*3600)+MINUTE(Halfmarathon[[#This Row],[Watchip]])*60+SECOND(Halfmarathon[[#This Row],[Watchip]]),99999)","v":8026},{"$f":"Hatime(Halfmarathon[[#This Row],[WatfordChip]])","v":"02:13:46"},1552,67.930000000000007,"02:13:46",{"$f":"IFERROR((HOUR(Halfmarathon[[#This Row],[Silverstonetime2]])*3600)+MINUTE(Halfmarathon[[#This Row],[Silverstonetime2]])*60+SECOND(Halfmarathon[[#This Row],[Silverstonetime2]]),99999)","v":99999},{"$f":"Hatime(Halfmarathon[[#This Row],[Silverstone Time]])","v":""},null,null,{"$f":"IFERROR(HOUR(Halfmarathon[[#This Row],[Berko time2]])*3600+MINUTE(Halfmarathon[[#This Row],[Berko time2]])*60+SECOND(Halfmarathon[[#This Row],[Berko time2]]),99999)","v":99999},{"$f":"Hatime(Halfmarathon[[#This Row],[Berko Time]])","v":""},null,null,null,{"$f":"IFERROR(HOUR(Halfmarathon[St Albans time])*3600+MINUTE(Halfmarathon[St Albans time])*60+SECOND(Halfmarathon[St Albans time]),99999)","v":99999},{"$f":"IFERROR(VLOOKUP(Halfmarathon[[#This Row],[Mem]],STAPoints[[MEM]:[Points]],4,FALSE),0)","v":0}," ",null," ",{"$f":"IFERROR(HOUR(Halfmarathon[MK Half time])*3600+MINUTE(Halfmarathon[MK Half time])*60+SECOND(Halfmarathon[MK Half time]),99999)","v":99999},746,"02:02:10",{"$f":"IFERROR(HOUR(Halfmarathon[St Neots Half Time])*3600+MINUTE(Halfmarathon[St Neots Half Time])*60+SECOND(Halfmarathon[St Neots Half Time]),99999)","v":7330}]
[null,"Darren MCGRATH",{"$f":"VLOOKUP(Halfmarathon[[#This Row],[Name]],members,2,FALSE)","v":28},{"$f":"COUNT(Halfmarathon[[#This Row],[watfordplace]],Halfmarathon[[#This Row],[Silverstone Place]],Halfmarathon[[#This Row],[Berko Place]],Halfmarathon[[#This Row],[STA Place]],Halfmarathon[[#This Row],[St Neots Half  Place]])","v":1},"M",{"$f":"IFERROR(IF(Halfmarathon[[#This Row],[Gender]]=\"M\",50-(RANK(Halfmarathon[[#This Row],[GentsBestTime]],Halfmarathon[GentsBestTime],1))+1,50-(RANK(Halfmarathon[[#This Row],[Ladies Best Time]],Halfmarathon[Ladies Best Time],1))+1)+Halfmarathon[[#This Row],[St Albans Points]],Halfmarathon[[#This Row],[St Albans Points]])","v":45},{"$f":"IF(Halfmarathon[[#This Row],[Gender]]=\"M\",IF(SUM($I5,$N5,$R5,$AB5,Halfmarathon[[#This Row],[St Neots Seconds]])=499995,\"\",(MIN($I5,$N5,$R5,$AB5,Halfmarathon[[#This Row],[St Neots Seconds]]))/86400),\"\")","v":"01:27:42"},{"$f":"IF(Halfmarathon[[#This Row],[Gender]]=\"F\",IF(SUM($I5,$N5,$R5,$AB5,Halfmarathon[[#This Row],[St Neots Seconds]])=499995,\"\",(MIN($I5,$N5,$S5,$AB5,Halfmarathon[[#This Row],[St Neots Seconds]]))/86400),\"\")","v":""},{"$f":"IFERROR((HOUR(Halfmarathon[[#This Row],[Watchip]])*3600)+MINUTE(Halfmarathon[[#This Row],[Watchip]])*60+SECOND(Halfmarathon[[#This Row],[Watchip]]),99999)","v":99999},{"$f":"Hatime(Halfmarathon[[#This Row],[WatfordChip]])","v":""},null,null,null,{"$f":"IFERROR((HOUR(Halfmarathon[[#This Row],[Silverstonetime2]])*3600)+MINUTE(Halfmarathon[[#This Row],[Silverstonetime2]])*60+SECOND(Halfmarathon[[#This Row],[Silverstonetime2]]),99999)","v":99999},{"$f":"Hatime(Halfmarathon[[#This Row],[Silverstone Time]])","v":""},null,null,{"$f":"IFERROR(HOUR(Halfmarathon[[#This Row],[Berko time2]])*3600+MINUTE(Halfmarathon[[#This Row],[Berko time2]])*60+SECOND(Halfmarathon[[#This Row],[Berko time2]]),99999)","v":99999},{"$f":"Hatime(Halfmarathon[[#This Row],[Berko Time]])","v":""},null,null,null,{"$f":"IFERROR(HOUR(Halfmarathon[St Albans time])*3600+MINUTE(Halfmarathon[St Albans time])*60+SECOND(Halfmarathon[St Albans time]),99999)","v":99999},{"$f":"IFERROR(VLOOKUP(Halfmarathon[[#This Row],[Mem]],STAPoints[[MEM]:[Points]],4,FALSE),0)","v":0}," ",null," ",{"$f":"IFERROR(HOUR(Halfmarathon[MK Half time])*3600+MINUTE(Halfmarathon[MK Half time])*60+SECOND(Halfmarathon[MK Half time]),99999)","v":99999},104,"01:27:42",{"$f":"IFERROR(HOUR(Halfmarathon[St Neots Half Time])*3600+MINUTE(Halfmarathon[St Neots Half Time])*60+SECOND(Halfmarathon[St Neots Half Time]),99999)","v":5262}]
[null,"Michael Hessey",{"$f":"VLOOKUP(Halfmarathon[[#This Row],[Name]],members,2,FALSE)","v":32},{"$f":"COUNT(Halfmarathon[[#This Row],[watfordplace]],Halfmarathon[[#This Row],[Silverstone Place]],Halfmarathon[[#This Row],[Berko Place]],Halfmarathon[[#This Row],[STA Place]],Halfmarathon[[#This Row],[St Neots Half  Place]])","v":2},"M",{"$f":"IFERROR(IF(Halfmarathon[[#This Row],[Gender]]=\"M\",50-(RANK(Halfmarathon[[#This Row],[GentsBestTime]],Halfmarathon[GentsBestTime],1))+1,50-(RANK(Halfmarathon[[#This Row],[Ladies Best Time]],Halfmarathon[Ladies Best Time],1))+1)+Halfmarathon[[#This Row],[St Albans Points]],Halfmarathon[[#This Row],[St Albans Points]])","v":32},{"$f":"IF(Halfmarathon[[#This Row],[Gender]]=\"M\",IF(SUM($I6,$N6,$R6,$AB6,Halfmarathon[[#This Row],[St Neots Seconds]])=499995,\"\",(MIN($I6,$N6,$R6,$AB6,Halfmarathon[[#This Row],[St Neots Seconds]]))/86400),\"\")","v":"01:37:57"},{"$f":"IF(Halfmarathon[[#This Row],[Gender]]=\"F\",IF(SUM($I6,$N6,$R6,$AB6,Halfmarathon[[#This Row],[St Neots Seconds]])=499995,\"\",(MIN($I6,$N6,$S6,$AB6,Halfmarathon[[#This Row],[St Neots Seconds]]))/86400),\"\")","v":""},{"$f":"IFERROR((HOUR(Halfmarathon[[#This Row],[Watchip]])*3600)+MINUTE(Halfmarathon[[#This Row],[Watchip]])*60+SECOND(Halfmarathon[[#This Row],[Watchip]]),99999)","v":99999},{"$f":"Hatime(Halfmarathon[[#This Row],[WatfordChip]])","v":""},null,null,null,{"$f":"IFERROR((HOUR(Halfmarathon[[#This Row],[Silverstonetime2]])*3600)+MINUTE(Halfmarathon[[#This Row],[Silverstonetime2]])*60+SECOND(Halfmarathon[[#This Row],[Silverstonetime2]]),99999)","v":5877},{"$f":"Hatime(Halfmarathon[[#This Row],[Silverstone Time]])","v":"01:37:57"},622,"01:37:57",{"$f":"IFERROR(HOUR(Halfmarathon[[#This Row],[Berko time2]])*3600+MINUTE(Halfmarathon[[#This Row],[Berko time2]])*60+SECOND(Halfmarathon[[#This Row],[Berko time2]]),99999)","v":99999},{"$f":"Hatime(Halfmarathon[[#This Row],[Berko Time]])","v":""},null,null,null,{"$f":"IFERROR(HOUR(Halfmarathon[St Albans time])*3600+MINUTE(Halfmarathon[St Albans time])*60+SECOND(Halfmarathon[St Albans time]),99999)","v":99999},{"$f":"IFERROR(VLOOKUP(Halfmarathon[[#This Row],[Mem]],STAPoints[[MEM]:[Points]],4,FALSE),0)","v":0}," "," "," ",{"$f":"IFERROR(HOUR(Halfmarathon[MK Half time])*3600+MINUTE(Halfmarathon[MK Half time])*60+SECOND(Halfmarathon[MK Half time]),99999)","v":99999},326,"01:40:16",{"$f":"IFERROR(HOUR(Halfmarathon[St Neots Half Time])*3600+MINUTE(Halfmarathon[St Neots Half Time])*60+SECOND(Halfmarathon[St Neots Half Time]),99999)","v":6016}]
[null,"Graham Harper",{"$f":"VLOOKUP(Halfmarathon[[#This Row],[Name]],members,2,FALSE)","v":39},{"$f":"COUNT(Halfmarathon[[#This Row],[watfordplace]],Halfmarathon[[#This Row],[Silverstone Place]],Halfmarathon[[#This Row],[Berko Place]],Halfmarathon[[#This Row],[STA Place]],Halfmarathon[[#This Row],[St Neots Half  Place]])","v":4},"M",{"$f":"IFERROR(IF(Halfmarathon[[#This Row],[Gender]]=\"M\",50-(RANK(Halfmarathon[[#This Row],[GentsBestTime]],Halfmarathon[GentsBestTime],1))+1,50-(RANK(Halfmarathon[[#This Row],[Ladies Best Time]],Halfmarathon[Ladies Best Time],1))+1)+Halfmarathon[[#This Row],[St Albans Points]],Halfmarathon[[#This Row],[St Albans Points]])","v":68},{"$f":"IF(Halfmarathon[[#This Row],[Gender]]=\"M\",IF(SUM($I7,$N7,$R7,$AB7,Halfmarathon[[#This Row],[St Neots Seconds]])=499995,\"\",(MIN($I7,$N7,$R7,$AB7,Halfmarathon[[#This Row],[St Neots Seconds]]))/86400),\"\")","v":"01:44:18"},{"$f":"IF(Halfmarathon[[#This Row],[Gender]]=\"F\",IF(SUM($I7,$N7,$R7,$AB7,Halfmarathon[[#This Row],[St Neots Seconds]])=499995,\"\",(MIN($I7,$N7,$S7,$AB7,Halfmarathon[[#This Row],[St Neots Seconds]]))/86400),\"\")","v":""},{"$f":"IFERROR((HOUR(Halfmarathon[[#This Row],[Watchip]])*3600)+MINUTE(Halfmarathon[[#This Row],[Watchip]])*60+SECOND(Halfmarathon[[#This Row],[Watchip]]),99999)","v":6728},{"$f":"Hatime(Halfmarathon[[#This Row],[WatfordChip]])","v":"01:52:08"},959,61.53,"01:52:08",{"$f":"IFERROR((HOUR(Halfmarathon[[#This Row],[Silverstonetime2]])*3600)+MINUTE(Halfmarathon[[#This Row],[Silverstonetime2]])*60+SECOND(Halfmarathon[[#This Row],[Silverstonetime2]]),99999)","v":6559},{"$f":"Hatime(Halfmarathon[[#This Row],[Silverstone Time]])","v":"01:49:19"},1673,"01:49:19",{"$f":"IFERROR(HOUR(Halfmarathon[[#This Row],[Berko time2]])*3600+MINUTE(Halfmarathon[[#This Row],[Berko time2]])*60+SECOND(Halfmarathon[[#This Row],[Berko time2]]),99999)","v":99999},{"$f":"Hatime(Halfmarathon[[#This Row],[Berko Time]])","v":""},null,null,1,{"$f":"IFERROR(HOUR(Halfmarathon[St Albans time])*3600+MINUTE(Halfmarathon[St Albans time])*60+SECOND(Halfmarathon[St Albans time]),99999)","v":6649},{"$f":"IFERROR(VLOOKUP(Halfmarathon[[#This Row],[Mem]],STAPoints[[MEM]:[Points]],4,FALSE),0)","v":39},"01:50:49",466,"02:05:58",{"$f":"IFERROR(HOUR(Halfmarathon[MK Half time])*3600+MINUTE(Halfmarathon[MK Half time])*60+SECOND(Halfmarathon[MK Half time]),99999)","v":7558},418,"01:44:18",{"$f":"IFERROR(HOUR(Halfmarathon[St Neots Half Time])*3600+MINUTE(Halfmarathon[St Neots Half Time])*60+SECOND(Halfmarathon[St Neots Half Time]),99999)","v":6258}]
[null,"Simon Speirs",{"$f":"VLOOKUP(Halfmarathon[[#This Row],[Name]],members,2,FALSE)","v":53},{"$f":"COUNT(Halfmarathon[[#This Row],[watfordplace]],Halfmarathon[[#This Row],[Silverstone Place]],Halfmarathon[[#This Row],[Berko Place]],Halfmarathon[[#This Row],[STA Place]],Halfmarathon[[#This Row],[St Neots Half  Place]])","v":1},"M",{"$f":"IFERROR(IF(Halfmarathon[[#This Row],[Gender]]=\"M\",50-(RANK(Halfmarathon[[#This Row],[GentsBestTime]],Halfmarathon[GentsBestTime],1))+1,50-(RANK(Halfmarathon[[#This Row],[Ladies Best Time]],Halfmarathon[Ladies Best Time],1))+1)+Halfmarathon[[#This Row],[St Albans Points]],Halfmarathon[[#This Row],[St Albans Points]])","v":50},{"$f":"IF(Halfmarathon[[#This Row],[Gender]]=\"M\",IF(SUM($I8,$N8,$R8,$AB8,Halfmarathon[[#This Row],[St Neots Seconds]])=499995,\"\",(MIN($I8,$N8,$R8,$AB8,Halfmarathon[[#This Row],[St Neots Seconds]]))/86400),\"\")","v":"01:18:00"},{"$f":"IF(Halfmarathon[[#This Row],[Gender]]=\"F\",IF(SUM($I8,$N8,$R8,$AB8,Halfmarathon[[#This Row],[St Neots Seconds]])=499995,\"\",(MIN($I8,$N8,$S8,$AB8,Halfmarathon[[#This Row],[St Neots Seconds]]))/86400),\"\")","v":""},{"$f":"IFERROR((HOUR(Halfmarathon[[#This Row],[Watchip]])*3600)+MINUTE(Halfmarathon[[#This Row],[Watchip]])*60+SECOND(Halfmarathon[[#This Row],[Watchip]]),99999)","v":99999},{"$f":"Hatime(Halfmarathon[[#This Row],[WatfordChip]])","v":""},null,null,null,{"$f":"IFERROR((HOUR(Halfmarathon[[#This Row],[Silverstonetime2]])*3600)+MINUTE(Halfmarathon[[#This Row],[Silverstonetime2]])*60+SECOND(Halfmarathon[[#This Row],[Silverstonetime2]]),99999)","v":99999},{"$f":"Hatime(Halfmarathon[[#This Row],[Silverstone Time]])","v":""},null,null,{"$f":"IFERROR(HOUR(Halfmarathon[[#This Row],[Berko time2]])*3600+MINUTE(Halfmarathon[[#This Row],[Berko time2]])*60+SECOND(Halfmarathon[[#This Row],[Berko time2]]),99999)","v":4680},{"$f":"Hatime(Halfmarathon[[#This Row],[Berko Time]])","v":"01:18:00"},4,"01:18:00",null,{"$f":"IFERROR(HOUR(Halfmarathon[St Albans time])*3600+MINUTE(Halfmarathon[St Albans time])*60+SECOND(Halfmarathon[St Albans time]),99999)","v":99999},{"$f":"IFERROR(VLOOKUP(Halfmarathon[[#This Row],[Mem]],STAPoints[[MEM]:[Points]],4,FALSE),0)","v":0}," ",null," ",{"$f":"IFERROR(HOUR(Halfmarathon[MK Half time])*3600+MINUTE(Halfmarathon[MK Half time])*60+SECOND(Halfmarathon[MK Half time]),99999)","v":99999},null," ",{"$f":"IFERROR(HOUR(Halfmarathon[St Neots Half Time])*3600+MINUTE(Halfmarathon[St Neots Half Time])*60+SECOND(Halfmarathon[St Neots Half Time]),99999)","v":99999}]
[null,"Hannah TURNER",{"$f":"VLOOKUP(Halfmarathon[[#This Row],[Name]],members,2,FALSE)","v":54},{"$f":"COUNT(Halfmarathon[[#This Row],[watfordplace]],Halfmarathon[[#This Row],[Silverstone Place]],Halfmarathon[[#This Row],[Berko Place]],Halfmarathon[[#This Row],[STA Place]],Halfmarathon[[#This Row],[St Neots Half  Place]])","v":1},"F",{"$f":"IFERROR(IF(Halfmarathon[[#This Row],[Gender]]=\"M\",50-(RANK(Halfmarathon[[#This Row],[GentsBestTime]],Halfmarathon[GentsBestTime],1))+1,50-(RANK(Halfmarathon[[#This Row],[Ladies Best Time]],Halfmarathon[Ladies Best Time],1))+1)+Halfmarathon[[#This Row],[St Albans Points]],Halfmarathon[[#This Row],[St Albans Points]])","v":50},{"$f":"IF(Halfmarathon[[#This Row],[Gender]]=\"M\",IF(SUM($I9,$N9,$R9,$AB9,Halfmarathon[[#This Row],[St Neots Seconds]])=499995,\"\",(MIN($I9,$N9,$R9,$AB9,Halfmarathon[[#This Row],[St Neots Seconds]]))/86400),\"\")","v":""},{"$f":"IF(Halfmarathon[[#This Row],[Gender]]=\"F\",IF(SUM($I9,$N9,$R9,$AB9,Halfmarathon[[#This Row],[St Neots Seconds]])=499995,\"\",(MIN($I9,$N9,$S9,$AB9,Halfmarathon[[#This Row],[St Neots Seconds]]))/86400),\"\")","v":"01:27:44"},{"$f":"IFERROR((HOUR(Halfmarathon[[#This Row],[Watchip]])*3600)+MINUTE(Halfmarathon[[#This Row],[Watchip]])*60+SECOND(Halfmarathon[[#This Row],[Watchip]]),99999)","v":99999},{"$f":"Hatime(Halfmarathon[[#This Row],[WatfordChip]])","v":""},null,null,null,{"$f":"IFERROR((HOUR(Halfmarathon[[#This Row],[Silverstonetime2]])*3600)+MINUTE(Halfmarathon[[#This Row],[Silverstonetime2]])*60+SECOND(Halfmarathon[[#This Row],[Silverstonetime2]]),99999)","v":99999},{"$f":"Hatime(Halfmarathon[[#This Row],[Silverstone Time]])","v":""},null,null,{"$f":"IFERROR(HOUR(Halfmarathon[[#This Row],[Berko time2]])*3600+MINUTE(Halfmarathon[[#This Row],[Berko time2]])*60+SECOND(Halfmarathon[[#This Row],[Berko time2]]),99999)","v":99999},{"$f":"Hatime(Halfmarathon[[#This Row],[Berko Time]])","v":""},null,null,null,{"$f":"IFERROR(HOUR(Halfmarathon[St Albans time])*3600+MINUTE(Halfmarathon[St Albans time])*60+SECOND(Halfmarathon[St Albans time]),99999)","v":99999},{"$f":"IFERROR(VLOOKUP(Halfmarathon[[#This Row],[Mem]],STAPoints[[MEM]:[Points]],4,FALSE),0)","v":0}," ",null," ",{"$f":"IFERROR(HOUR(Halfmarathon[MK Half time])*3600+MINUTE(Halfmarathon[MK Half time])*60+SECOND(Halfmarathon[MK Half time]),99999)","v":99999},105,"01:27:44",{"$f":"IFERROR(HOUR(Halfmarathon[St Neots Half Time])*3600+MINUTE(Halfmarathon[St Neots Half Time])*60+SECOND(Halfmarathon[St Neots Half Time]),99999)","v":5264}]
[null,"Lee Scott",57,{"$f":"COUNT(Halfmarathon[[#This Row],[watfordplace]],Halfmarathon[[#This Row],[Silverstone Place]],Halfmarathon[[#This Row],[Berko Place]],Halfmarathon[[#This Row],[STA Place]],Halfmarathon[[#This Row],[St Neots Half  Place]])","v":1},"M",{"$f":"IFERROR(IF(Halfmarathon[[#This Row],[Gender]]=\"M\",50-(RANK(Halfmarathon[[#This Row],[GentsBestTime]],Halfmarathon[GentsBestTime],1))+1,50-(RANK(Halfmarathon[[#This Row],[Ladies Best Time]],Halfmarathon[Ladies Best Time],1))+1)+Halfmarathon[[#This Row],[St Albans Points]],Halfmarathon[[#This Row],[St Albans Points]])","v":43},{"$f":"IF(Halfmarathon[[#This Row],[Gender]]=\"M\",IF(SUM($I10,$N10,$R10,$AB10,Halfmarathon[[#This Row],[St Neots Seconds]])=499995,\"\",(MIN($I10,$N10,$R10,$AB10,Halfmarathon[[#This Row],[St Neots Seconds]]))/86400),\"\")","v":"01:28:19"},{"$f":"IF(Halfmarathon[[#This Row],[Gender]]=\"F\",IF(SUM($I10,$N10,$R10,$AB10,Halfmarathon[[#This Row],[St Neots Seconds]])=499995,\"\",(MIN($I10,$N10,$S10,$AB10,Halfmarathon[[#This Row],[St Neots Seconds]]))/86400),\"\")","v":""},{"$f":"IFERROR((HOUR(Halfmarathon[[#This Row],[Watchip]])*3600)+MINUTE(Halfmarathon[[#This Row],[Watchip]])*60+SECOND(Halfmarathon[[#This Row],[Watchip]]),99999)","v":5299},"01:28:19",170,71.819999999999993,"01:28:10",{"$f":"IFERROR((HOUR(Halfmarathon[[#This Row],[Silverstonetime2]])*3600)+MINUTE(Halfmarathon[[#This Row],[Silverstonetime2]])*60+SECOND(Halfmarathon[[#This Row],[Silverstonetime2]]),99999)","v":99999},{"$f":"Hatime(Halfmarathon[[#This Row],[Silverstone Time]])","v":""},null,null,{"$f":"IFERROR(HOUR(Halfmarathon[[#This Row],[Berko time2]])*3600+MINUTE(Halfmarathon[[#This Row],[Berko time2]])*60+SECOND(Halfmarathon[[#This Row],[Berko time2]]),99999)","v":99999},{"$f":"Hatime(Halfmarathon[[#This Row],[Berko Time]])","v":""},null,null,null,{"$f":"IFERROR(HOUR(Halfmarathon[St Albans time])*3600+MINUTE(Halfmarathon[St Albans time])*60+SECOND(Halfmarathon[St Albans time]),99999)","v":99999},{"$f":"IFERROR(VLOOKUP(Halfmarathon[[#This Row],[Mem]],STAPoints[[MEM]:[Points]],4,FALSE),0)","v":0}," ",null," ",{"$f":"IFERROR(HOUR(Halfmarathon[MK Half time])*3600+MINUTE(Halfmarathon[MK Half time])*60+SECOND(Halfmarathon[MK Half time]),99999)","v":99999},null," ",{"$f":"IFERROR(HOUR(Halfmarathon[St Neots Half Time])*3600+MINUTE(Halfmarathon[St Neots Half Time])*60+SECOND(Halfmarathon[St Neots Half Time]),99999)","v":99999}]
[null,"Ian Smart",{"$f":"VLOOKUP(Halfmarathon[[#This Row],[Name]],members,2,FALSE)","v":60},{"$f":"COUNT(Halfmarathon[[#This Row],[watfordplace]],Halfmarathon[[#This Row],[Silverstone Place]],Halfmarathon[[#This Row],[Berko Place]],Halfmarathon[[#This Row],[STA Place]],Halfmarathon[[#This Row],[St Neots Half  Place]])","v":2},"M",{"$f":"IFERROR(IF(Halfmarathon[[#This Row],[Gender]]=\"M\",50-(RANK(Halfmarathon[[#This Row],[GentsBestTime]],Halfmarathon[GentsBestTime],1))+1,50-(RANK(Halfmarathon[[#This Row],[Ladies Best Time]],Halfmarathon[Ladies Best Time],1))+1)+Halfmarathon[[#This Row],[St Albans Points]],Halfmarathon[[#This Row],[St Albans Points]])","v":38},{"$f":"IF(Halfmarathon[[#This Row],[Gender]]=\"M\",IF(SUM($I11,$N11,$R11,$AB11,Halfmarathon[[#This Row],[St Neots Seconds]])=499995,\"\",(MIN($I11,$N11,$R11,$AB11,Halfmarathon[[#This Row],[St Neots Seconds]]))/86400),\"\")","v":"01:30:45"},{"$f":"IF(Halfmarathon[[#This Row],[Gender]]=\"F\",IF(SUM($I11,$N11,$R11,$AB11,Halfmarathon[[#This Row],[St Neots Seconds]])=499995,\"\",(MIN($I11,$N11,$S11,$AB11,Halfmarathon[[#This Row],[St Neots Seconds]]))/86400),\"\")","v":""},{"$f":"IFERROR((HOUR(Halfmarathon[[#This Row],[Watchip]])*3600)+MINUTE(Halfmarathon[[#This Row],[Watchip]])*60+SECOND(Halfmarathon[[#This Row],[Watchip]]),99999)","v":99999},{"$f":"Hatime(Halfmarathon[[#This Row],[WatfordChip]])","v":""},null,null,null,{"$f":"IFERROR((HOUR(Halfmarathon[[#This Row],[Silverstonetime2]])*3600)+MINUTE(Halfmarathon[[#This Row],[Silverstonetime2]])*60+SECOND(Halfmarathon[[#This Row],[Silverstonetime2]]),99999)","v":99999},{"$f":"Hatime(Halfmarathon[[#This Row],[Silverstone Time]])","v":""},null,null,{"$f":"IFERROR(HOUR(Halfmarathon[[#This Row],[Berko time2]])*3600+MINUTE(Halfmarathon[[#This Row],[Berko time2]])*60+SECOND(Halfmarathon[[#This Row],[Berko time2]]),99999)","v":5629},{"$f":"Hatime(Halfmarathon[[#This Row],[Berko Time]])","v":"01:33:49"},127,"01:33:49",null,{"$f":"IFERROR(HOUR(Halfmarathon[St Albans time])*3600+MINUTE(Halfmarathon[St Albans time])*60+SECOND(Halfmarathon[St Albans time]),99999)","v":99999},{"$f":"IFERROR(VLOOKUP(Halfmarathon[[#This Row],[Mem]],STAPoints[[MEM]:[Points]],4,FALSE),0)","v":0}," ",null," ",{"$f":"IFERROR(HOUR(Halfmarathon[MK Half time])*3600+MINUTE(Halfmarathon[MK Half time])*60+SECOND(Halfmarathon[MK Half time]),99999)","v":99999},160,"01:30:45",{"$f":"IFERROR(HOUR(Halfmarathon[St Neots Half Time])*3600+MINUTE(Halfmarathon[St Neots Half Time])*60+SECOND(Halfmarathon[St Neots Half Time]),99999)","v":5445}]
[null,"Ronjon Chakraverty",72,{"$f":"COUNT(Halfmarathon[[#This Row],[watfordplace]],Halfmarathon[[#This Row],[Silverstone Place]],Halfmarathon[[#This Row],[Berko Place]],Halfmarathon[[#This Row],[STA Place]],Halfmarathon[[#This Row],[St Neots Half  Place]])","v":1},"M",{"$f":"IFERROR(IF(Halfmarathon[[#This Row],[Gender]]=\"M\",50-(RANK(Halfmarathon[[#This Row],[GentsBestTime]],Halfmarathon[GentsBestTime],1))+1,50-(RANK(Halfmarathon[[#This Row],[Ladies Best Time]],Halfmarathon[Ladies Best Time],1))+1)+Halfmarathon[[#This Row],[St Albans Points]],Halfmarathon[[#This Row],[St Albans Points]])","v":37},{"$f":"IF(Halfmarathon[[#This Row],[Gender]]=\"M\",IF(SUM($I12,$N12,$R12,$AB12,Halfmarathon[[#This Row],[St Neots Seconds]])=499995,\"\",(MIN($I12,$N12,$R12,$AB12,Halfmarathon[[#This Row],[St Neots Seconds]]))/86400),\"\")","v":"01:31:44"},{"$f":"IF(Halfmarathon[[#This Row],[Gender]]=\"F\",IF(SUM($I12,$N12,$R12,$AB12,Halfmarathon[[#This Row],[St Neots Seconds]])=499995,\"\",(MIN($I12,$N12,$S12,$AB12,Halfmarathon[[#This Row],[St Neots Seconds]]))/86400),\"\")","v":""},{"$f":"IFERROR((HOUR(Halfmarathon[[#This Row],[Watchip]])*3600)+MINUTE(Halfmarathon[[#This Row],[Watchip]])*60+SECOND(Halfmarathon[[#This Row],[Watchip]]),99999)","v":99999},{"$f":"Hatime(Halfmarathon[[#This Row],[WatfordChip]])","v":""},null,null,null,{"$f":"IFERROR((HOUR(Halfmarathon[[#This Row],[Silverstonetime2]])*3600)+MINUTE(Halfmarathon[[#This Row],[Silverstonetime2]])*60+SECOND(Halfmarathon[[#This Row],[Silverstonetime2]]),99999)","v":99999},{"$f":"Hatime(Halfmarathon[[#This Row],[Silverstone Time]])","v":""},null,null,{"$f":"IFERROR(HOUR(Halfmarathon[[#This Row],[Berko time2]])*3600+MINUTE(Halfmarathon[[#This Row],[Berko time2]])*60+SECOND(Halfmarathon[[#This Row],[Berko time2]]),99999)","v":99999},{"$f":"Hatime(Halfmarathon[[#This Row],[Berko Time]])","v":""},null,null,null,{"$f":"IFERROR(HOUR(Halfmarathon[St Albans time])*3600+MINUTE(Halfmarathon[St Albans time])*60+SECOND(Halfmarathon[St Albans time]),99999)","v":99999},{"$f":"IFERROR(VLOOKUP(Halfmarathon[[#This Row],[Mem]],STAPoints[[MEM]:[Points]],4,FALSE),0)","v":0}," ",null," ",{"$f":"IFERROR(HOUR(Halfmarathon[MK Half time])*3600+MINUTE(Halfmarathon[MK Half time])*60+SECOND(Halfmarathon[MK Half time]),99999)","v":99999},170,"01:31:44",{"$f":"IFERROR(HOUR(Halfmarathon[St Neots Half Time])*3600+MINUTE(Halfmarathon[St Neots Half Time])*60+SECOND(Halfmarathon[St Neots Half Time]),99999)","v":5504}]
[null,"David Green",{"$f":"VLOOKUP(B13,members,2,FALSE)","v":73},{"$f":"COUNT(Halfmarathon[[#This Row],[watfordplace]],Halfmarathon[[#This Row],[Silverstone Place]],Halfmarathon[[#This Row],[Berko Place]],Halfmarathon[[#This Row],[STA Place]],Halfmarathon[[#This Row],[St Neots Half  Place]])","v":2},"M",{"$f":"IFERROR(IF(Halfmarathon[[#This Row],[Gender]]=\"M\",50-(RANK(Halfmarathon[[#This Row],[GentsBestTime]],Halfmarathon[GentsBestTime],1))+1,50-(RANK(Halfmarathon[[#This Row],[Ladies Best Time]],Halfmarathon[Ladies Best Time],1))+1)+Halfmarathon[[#This Row],[St Albans Points]],Halfmarathon[[#This Row],[St Albans Points]])","v":99},{"$f":"IF(Halfmarathon[[#This Row],[Gender]]=\"M\",IF(SUM($I13,$N13,$R13,$AB13,Halfmarathon[[#This Row],[St Neots Seconds]])=499995,\"\",(MIN($I13,$N13,$R13,$AB13,Halfmarathon[[#This Row],[St Neots Seconds]]))/86400),\"\")","v":"01:21:13"},{"$f":"IF(Halfmarathon[[#This Row],[Gender]]=\"F\",IF(SUM($I13,$N13,$R13,$AB13,Halfmarathon[[#This Row],[St Neots Seconds]])=499995,\"\",(MIN($I13,$N13,$S13,$AB13,Halfmarathon[[#This Row],[St Neots Seconds]]))/86400),\"\")","v":""},{"$f":"IFERROR((HOUR(Halfmarathon[[#This Row],[Watchip]])*3600)+MINUTE(Halfmarathon[[#This Row],[Watchip]])*60+SECOND(Halfmarathon[[#This Row],[Watchip]]),99999)","v":99999},{"$f":"Hatime(Halfmarathon[[#This Row],[WatfordChip]])","v":""},null,null,null,{"$f":"IFERROR((HOUR(Halfmarathon[[#This Row],[Silverstonetime2]])*3600)+MINUTE(Halfmarathon[[#This Row],[Silverstonetime2]])*60+SECOND(Halfmarathon[[#This Row],[Silverstonetime2]]),99999)","v":99999},{"$f":"Hatime(Halfmarathon[[#This Row],[Silverstone Time]])","v":""},null,null,{"$f":"IFERROR(HOUR(Halfmarathon[[#This Row],[Berko time2]])*3600+MINUTE(Halfmarathon[[#This Row],[Berko time2]])*60+SECOND(Halfmarathon[[#This Row],[Berko time2]]),99999)","v":99999},{"$f":"Hatime(Halfmarathon[[#This Row],[Berko Time]])","v":""},null,null,1,{"$f":"IFERROR(HOUR(Halfmarathon[St Albans time])*3600+MINUTE(Halfmarathon[St Albans time])*60+SECOND(Halfmarathon[St Albans time]),99999)","v":5115},{"$f":"IFERROR(VLOOKUP(Halfmarathon[[#This Row],[Mem]],STAPoints[[MEM]:[Points]],4,FALSE),0)","v":50},"01:25:15",null," ",{"$f":"IFERROR(HOUR(Halfmarathon[MK Half time])*3600+MINUTE(Halfmarathon[MK Half time])*60+SECOND(Halfmarathon[MK Half time]),99999)","v":99999},32,"01:21:13",{"$f":"IFERROR(HOUR(Halfmarathon[St Neots Half Time])*3600+MINUTE(Halfmarathon[St Neots Half Time])*60+SECOND(Halfmarathon[St Neots Half Time]),99999)","v":4873}]
[null,"Jennifer Finlay",{"$f":"VLOOKUP(Halfmarathon[[#This Row],[Name]],members,2,FALSE)","v":97},{"$f":"COUNT(Halfmarathon[[#This Row],[watfordplace]],Halfmarathon[[#This Row],[Silverstone Place]],Halfmarathon[[#This Row],[Berko Place]],Halfmarathon[[#This Row],[STA Place]],Halfmarathon[[#This Row],[St Neots Half  Place]])","v":2},"F",{"$f":"IFERROR(IF(Halfmarathon[[#This Row],[Gender]]=\"M\",50-(RANK(Halfmarathon[[#This Row],[GentsBestTime]],Halfmarathon[GentsBestTime],1))+1,50-(RANK(Halfmarathon[[#This Row],[Ladies Best Time]],Halfmarathon[Ladies Best Time],1))+1)+Halfmarathon[[#This Row],[St Albans Points]],Halfmarathon[[#This Row],[St Albans Points]])","v":48},{"$f":"IF(Halfmarathon[[#This Row],[Gender]]=\"M\",IF(SUM($I14,$N14,$R14,$AB14,Halfmarathon[[#This Row],[St Neots Seconds]])=499995,\"\",(MIN($I14,$N14,$R14,$AB14,Halfmarathon[[#This Row],[St Neots Seconds]]))/86400),\"\")","v":""},{"$f":"IF(Halfmarathon[[#This Row],[Gender]]=\"F\",IF(SUM($I14,$N14,$R14,$AB14,Halfmarathon[[#This Row],[St Neots Seconds]])=499995,\"\",(MIN($I14,$N14,$S14,$AB14,Halfmarathon[[#This Row],[St Neots Seconds]]))/86400),\"\")","v":"01:40:38"},{"$f":"IFERROR((HOUR(Halfmarathon[[#This Row],[Watchip]])*3600)+MINUTE(Halfmarathon[[#This Row],[Watchip]])*60+SECOND(Halfmarathon[[#This Row],[Watchip]]),99999)","v":6185},{"$f":"Hatime(Halfmarathon[[#This Row],[WatfordChip]])","v":"01:43:05"},623,67.459999999999994,"01:43:05",{"$f":"IFERROR((HOUR(Halfmarathon[[#This Row],[Silverstonetime2]])*3600)+MINUTE(Halfmarathon[[#This Row],[Silverstonetime2]])*60+SECOND(Halfmarathon[[#This Row],[Silverstonetime2]]),99999)","v":99999},{"$f":"Hatime(Halfmarathon[[#This Row],[Silverstone Time]])","v":""},null,null,{"$f":"IFERROR(HOUR(Halfmarathon[[#This Row],[Berko time2]])*3600+MINUTE(Halfmarathon[[#This Row],[Berko time2]])*60+SECOND(Halfmarathon[[#This Row],[Berko time2]]),99999)","v":99999},{"$f":"Hatime(Halfmarathon[[#This Row],[Berko Time]])","v":""},null,null,null,{"$f":"IFERROR(HOUR(Halfmarathon[St Albans time])*3600+MINUTE(Halfmarathon[St Albans time])*60+SECOND(Halfmarathon[St Albans time]),99999)","v":99999},{"$f":"IFERROR(VLOOKUP(Halfmarathon[[#This Row],[Mem]],STAPoints[[MEM]:[Points]],4,FALSE),0)","v":0}," ",null," ",{"$f":"IFERROR(HOUR(Halfmarathon[MK Half time])*3600+MINUTE(Halfmarathon[MK Half time])*60+SECOND(Halfmarathon[MK Half time]),99999)","v":99999},339,"01:40:38",{"$f":"IFERROR(HOUR(Halfmarathon[St Neots Half Time])*3600+MINUTE(Halfmarathon[St Neots Half Time])*60+SECOND(Halfmarathon[St Neots Half Time]),99999)","v":6038}]
[null,"Phil Jacobs",{"$f":"VLOOKUP(Halfmarathon[[#This Row],[Name]],members,2,FALSE)","v":100},{"$f":"COUNT(Halfmarathon[[#This Row],[watfordplace]],Halfmarathon[[#This Row],[Silverstone Place]],Halfmarathon[[#This Row],[Berko Place]],Halfmarathon[[#This Row],[STA Place]],Halfmarathon[[#This Row],[St Neots Half  Place]])","v":1},"M",{"$f":"IFERROR(IF(Halfmarathon[[#This Row],[Gender]]=\"M\",50-(RANK(Halfmarathon[[#This Row],[GentsBestTime]],Halfmarathon[GentsBestTime],1))+1,50-(RANK(Halfmarathon[[#This Row],[Ladies Best Time]],Halfmarathon[Ladies Best Time],1))+1)+Halfmarathon[[#This Row],[St Albans Points]],Halfmarathon[[#This Row],[St Albans Points]])","v":41},{"$f":"IF(Halfmarathon[[#This Row],[Gender]]=\"M\",IF(SUM($I15,$N15,$R15,$AB15,Halfmarathon[[#This Row],[St Neots Seconds]])=499995,\"\",(MIN($I15,$N15,$R15,$AB15,Halfmarathon[[#This Row],[St Neots Seconds]]))/86400),\"\")","v":"01:29:11"},{"$f":"IF(Halfmarathon[[#This Row],[Gender]]=\"F\",IF(SUM($I15,$N15,$R15,$AB15,Halfmarathon[[#This Row],[St Neots Seconds]])=499995,\"\",(MIN($I15,$N15,$S15,$AB15,Halfmarathon[[#This Row],[St Neots Seconds]]))/86400),\"\")","v":""},{"$f":"IFERROR((HOUR(Halfmarathon[[#This Row],[Watchip]])*3600)+MINUTE(Halfmarathon[[#This Row],[Watchip]])*60+SECOND(Halfmarathon[[#This Row],[Watchip]]),99999)","v":99999},{"$f":"Hatime(Halfmarathon[[#This Row],[WatfordChip]])","v":""},null,null,null,{"$f":"IFERROR((HOUR(Halfmarathon[[#This Row],[Silverstonetime2]])*3600)+MINUTE(Halfmarathon[[#This Row],[Silverstonetime2]])*60+SECOND(Halfmarathon[[#This Row],[Silverstonetime2]]),99999)","v":99999},{"$f":"Hatime(Halfmarathon[[#This Row],[Silverstone Time]])","v":""},null,null,{"$f":"IFERROR(HOUR(Halfmarathon[[#This Row],[Berko time2]])*3600+MINUTE(Halfmarathon[[#This Row],[Berko time2]])*60+SECOND(Halfmarathon[[#This Row],[Berko time2]]),99999)","v":5351},{"$f":"Hatime(Halfmarathon[[#This Row],[Berko Time]])","v":"01:29:11"},76,"01:29:11",null,{"$f":"IFERROR(HOUR(Halfmarathon[St Albans time])*3600+MINUTE(Halfmarathon[St Albans time])*60+SECOND(Halfmarathon[St Albans time]),99999)","v":99999},{"$f":"IFERROR(VLOOKUP(Halfmarathon[[#This Row],[Mem]],STAPoints[[MEM]:[Points]],4,FALSE),0)","v":0}," ",null," ",{"$f":"IFERROR(HOUR(Halfmarathon[MK Half time])*3600+MINUTE(Halfmarathon[MK Half time])*60+SECOND(Halfmarathon[MK Half time]),99999)","v":99999},null," ",{"$f":"IFERROR(HOUR(Halfmarathon[St Neots Half Time])*3600+MINUTE(Halfmarathon[St Neots Half Time])*60+SECOND(Halfmarathon[St Neots Half Time]),99999)","v":99999}]
[null,"Andy Wilkins",107,{"$f":"COUNT(Halfmarathon[[#This Row],[watfordplace]],Halfmarathon[[#This Row],[Silverstone Place]],Halfmarathon[[#This Row],[Berko Place]],Halfmarathon[[#This Row],[STA Place]],Halfmarathon[[#This Row],[St Neots Half  Place]])","v":1},"M",{"$f":"IFERROR(IF(Halfmarathon[[#This Row],[Gender]]=\"M\",50-(RANK(Halfmarathon[[#This Row],[GentsBestTime]],Halfmarathon[GentsBestTime],1))+1,50-(RANK(Halfmarathon[[#This Row],[Ladies Best Time]],Halfmarathon[Ladies Best Time],1))+1)+Halfmarathon[[#This Row],[St Albans Points]],Halfmarathon[[#This Row],[St Albans Points]])","v":42},{"$f":"IF(Halfmarathon[[#This Row],[Gender]]=\"M\",IF(SUM($I16,$N16,$R16,$AB16,Halfmarathon[[#This Row],[St Neots Seconds]])=499995,\"\",(MIN($I16,$N16,$R16,$AB16,Halfmarathon[[#This Row],[St Neots Seconds]]))/86400),\"\")","v":"01:28:56"},{"$f":"IF(Halfmarathon[[#This Row],[Gender]]=\"F\",IF(SUM($I16,$N16,$R16,$AB16,Halfmarathon[[#This Row],[St Neots Seconds]])=499995,\"\",(MIN($I16,$N16,$S16,$AB16,Halfmarathon[[#This Row],[St Neots Seconds]]))/86400),\"\")","v":""},{"$f":"IFERROR((HOUR(Halfmarathon[[#This Row],[Watchip]])*3600)+MINUTE(Halfmarathon[[#This Row],[Watchip]])*60+SECOND(Halfmarathon[[#This Row],[Watchip]]),99999)","v":99999},{"$f":"Hatime(Halfmarathon[[#This Row],[WatfordChip]])","v":""},null,null,null,{"$f":"IFERROR((HOUR(Halfmarathon[[#This Row],[Silverstonetime2]])*3600)+MINUTE(Halfmarathon[[#This Row],[Silverstonetime2]])*60+SECOND(Halfmarathon[[#This Row],[Silverstonetime2]]),99999)","v":5336},{"$f":"Hatime(Halfmarathon[[#This Row],[Silverstone Time]])","v":"01:28:56"},161,"01:28:56",{"$f":"IFERROR(HOUR(Halfmarathon[[#This Row],[Berko time2]])*3600+MINUTE(Halfmarathon[[#This Row],[Berko time2]])*60+SECOND(Halfmarathon[[#This Row],[Berko time2]]),99999)","v":99999},{"$f":"Hatime(Halfmarathon[[#This Row],[Berko Time]])","v":""},null,null,null,{"$f":"IFERROR(HOUR(Halfmarathon[St Albans time])*3600+MINUTE(Halfmarathon[St Albans time])*60+SECOND(Halfmarathon[St Albans time]),99999)","v":99999},{"$f":"IFERROR(VLOOKUP(Halfmarathon[[#This Row],[Mem]],STAPoints[[MEM]:[Points]],4,FALSE),0)","v":0}," ",null," ",{"$f":"IFERROR(HOUR(Halfmarathon[MK Half time])*3600+MINUTE(Halfmarathon[MK Half time])*60+SECOND(Halfmarathon[MK Half time]),99999)","v":99999},null," ",{"$f":"IFERROR(HOUR(Halfmarathon[St Neots Half Time])*3600+MINUTE(Halfmarathon[St Neots Half Time])*60+SECOND(Halfmarathon[St Neots Half Time]),99999)","v":99999}]
[null,"Elliott Lamb",{"$f":"VLOOKUP(Halfmarathon[[#This Row],[Name]],members,2,FALSE)","v":110},{"$f":"COUNT(Halfmarathon[[#This Row],[watfordplace]],Halfmarathon[[#This Row],[Silverstone Place]],Halfmarathon[[#This Row],[Berko Place]],Halfmarathon[[#This Row],[STA Place]],Halfmarathon[[#This Row],[St Neots Half  Place]])","v":2},"M",{"$f":"IFERROR(IF(Halfmarathon[[#This Row],[Gender]]=\"M\",50-(RANK(Halfmarathon[[#This Row],[GentsBestTime]],Halfmarathon[GentsBestTime],1))+1,50-(RANK(Halfmarathon[[#This Row],[Ladies Best Time]],Halfmarathon[Ladies Best Time],1))+1)+Halfmarathon[[#This Row],[St Albans Points]],Halfmarathon[[#This Row],[St Albans Points]])","v":44},{"$f":"IF(Halfmarathon[[#This Row],[Gender]]=\"M\",IF(SUM($I17,$N17,$R17,$AB17,Halfmarathon[[#This Row],[St Neots Seconds]])=499995,\"\",(MIN($I17,$N17,$R17,$AB17,Halfmarathon[[#This Row],[St Neots Seconds]]))/86400),\"\")","v":"01:28:15"},{"$f":"IF(Halfmarathon[[#This Row],[Gender]]=\"F\",IF(SUM($I17,$N17,$R17,$AB17,Halfmarathon[[#This Row],[St Neots Seconds]])=499995,\"\",(MIN($I17,$N17,$S17,$AB17,Halfmarathon[[#This Row],[St Neots Seconds]]))/86400),\"\")","v":""},{"$f":"IFERROR((HOUR(Halfmarathon[[#This Row],[Watchip]])*3600)+MINUTE(Halfmarathon[[#This Row],[Watchip]])*60+SECOND(Halfmarathon[[#This Row],[Watchip]]),99999)","v":99999},{"$f":"Hatime(Halfmarathon[[#This Row],[WatfordChip]])","v":""},null,null,null,{"$f":"IFERROR((HOUR(Halfmarathon[[#This Row],[Silverstonetime2]])*3600)+MINUTE(Halfmarathon[[#This Row],[Silverstonetime2]])*60+SECOND(Halfmarathon[[#This Row],[Silverstonetime2]]),99999)","v":5402},{"$f":"Hatime(Halfmarathon[[#This Row],[Silverstone Time]])","v":"01:30:02"},223,"01:30:02",{"$f":"IFERROR(HOUR(Halfmarathon[[#This Row],[Berko time2]])*3600+MINUTE(Halfmarathon[[#This Row],[Berko time2]])*60+SECOND(Halfmarathon[[#This Row],[Berko time2]]),99999)","v":99999},{"$f":"Hatime(Halfmarathon[[#This Row],[Berko Time]])","v":""},null,null,null,{"$f":"IFERROR(HOUR(Halfmarathon[St Albans time])*3600+MINUTE(Halfmarathon[St Albans time])*60+SECOND(Halfmarathon[St Albans time]),99999)","v":99999},{"$f":"IFERROR(VLOOKUP(Halfmarathon[[#This Row],[Mem]],STAPoints[[MEM]:[Points]],4,FALSE),0)","v":0}," ",null," ",{"$f":"IFERROR(HOUR(Halfmarathon[MK Half time])*3600+MINUTE(Halfmarathon[MK Half time])*60+SECOND(Halfmarathon[MK Half time]),99999)","v":99999},116,"01:28:15",{"$f":"IFERROR(HOUR(Halfmarathon[St Neots Half Time])*3600+MINUTE(Halfmarathon[St Neots Half Time])*60+SECOND(Halfmarathon[St Neots Half Time]),99999)","v":5295}]
[null,"Karen Wilkins",{"$f":"VLOOKUP(Halfmarathon[[#This Row],[Name]],members,2,FALSE)","v":116},{"$f":"COUNT(Halfmarathon[[#This Row],[watfordplace]],Halfmarathon[[#This Row],[Silverstone Place]],Halfmarathon[[#This Row],[Berko Place]],Halfmarathon[[#This Row],[STA Place]],Halfmarathon[[#This Row],[St Neots Half  Place]])","v":1},"F",{"$f":"IFERROR(IF(Halfmarathon[[#This Row],[Gender]]=\"M\",50-(RANK(Halfmarathon[[#This Row],[GentsBestTime]],Halfmarathon[GentsBestTime],1))+1,50-(RANK(Halfmarathon[[#This Row],[Ladies Best Time]],Halfmarathon[Ladies Best Time],1))+1)+Halfmarathon[[#This Row],[St Albans Points]],Halfmarathon[[#This Row],[St Albans Points]])","v":49},{"$f":"IF(Halfmarathon[[#This Row],[Gender]]=\"M\",IF(SUM($I18,$N18,$R18,$AB18,Halfmarathon[[#This Row],[St Neots Seconds]])=499995,\"\",(MIN($I18,$N18,$R18,$AB18,Halfmarathon[[#This Row],[St Neots Seconds]]))/86400),\"\")","v":""},{"$f":"IF(Halfmarathon[[#This Row],[Gender]]=\"F\",IF(SUM($I18,$N18,$R18,$AB18,Halfmarathon[[#This Row],[St Neots Seconds]])=499995,\"\",(MIN($I18,$N18,$S18,$AB18,Halfmarathon[[#This Row],[St Neots Seconds]]))/86400),\"\")","v":"01:35:39"},{"$f":"IFERROR((HOUR(Halfmarathon[[#This Row],[Watchip]])*3600)+MINUTE(Halfmarathon[[#This Row],[Watchip]])*60+SECOND(Halfmarathon[[#This Row],[Watchip]]),99999)","v":99999},{"$f":"Hatime(Halfmarathon[[#This Row],[WatfordChip]])","v":""},null,null,null,{"$f":"IFERROR((HOUR(Halfmarathon[[#This Row],[Silverstonetime2]])*3600)+MINUTE(Halfmarathon[[#This Row],[Silverstonetime2]])*60+SECOND(Halfmarathon[[#This Row],[Silverstonetime2]]),99999)","v":5739},{"$f":"Hatime(Halfmarathon[[#This Row],[Silverstone Time]])","v":"01:35:39"},467,"01:35:39",{"$f":"IFERROR(HOUR(Halfmarathon[[#This Row],[Berko time2]])*3600+MINUTE(Halfmarathon[[#This Row],[Berko time2]])*60+SECOND(Halfmarathon[[#This Row],[Berko time2]]),99999)","v":99999},{"$f":"Hatime(Halfmarathon[[#This Row],[Berko Time]])","v":""},null,null,null,{"$f":"IFERROR(HOUR(Halfmarathon[St Albans time])*3600+MINUTE(Halfmarathon[St Albans time])*60+SECOND(Halfmarathon[St Albans time]),99999)","v":99999},{"$f":"IFERROR(VLOOKUP(Halfmarathon[[#This Row],[Mem]],STAPoints[[MEM]:[Points]],4,FALSE),0)","v":0}," ",null," ",{"$f":"IFERROR(HOUR(Halfmarathon[MK Half time])*3600+MINUTE(Halfmarathon[MK Half time])*60+SECOND(Halfmarathon[MK Half time]),99999)","v":99999},null," ",{"$f":"IFERROR(HOUR(Halfmarathon[St Neots Half Time])*3600+MINUTE(Halfmarathon[St Neots Half Time])*60+SECOND(Halfmarathon[St Neots Half Time]),99999)","v":99999}]
[null,"Louise Crosby",{"$f":"VLOOKUP(B19,members,2,FALSE)","v":119},{"$f":"COUNT(Halfmarathon[[#This Row],[watfordplace]],Halfmarathon[[#This Row],[Silverstone Place]],Halfmarathon[[#This Row],[Berko Place]],Halfmarathon[[#This Row],[STA Place]],Halfmarathon[[#This Row],[St Neots Half  Place]])","v":1},"F",{"$f":"IFERROR(IF(Halfmarathon[[#This Row],[Gender]]=\"M\",50-(RANK(Halfmarathon[[#This Row],[GentsBestTime]],Halfmarathon[GentsBestTime],1))+1,50-(RANK(Halfmarathon[[#This Row],[Ladies Best Time]],Halfmarathon[Ladies Best Time],1))+1)+Halfmarathon[[#This Row],[St Albans Points]],Halfmarathon[[#This Row],[St Albans Points]])","v":50},{"$f":"IF(Halfmarathon[[#This Row],[Gender]]=\"M\",IF(SUM($I19,$N19,$R19,$AB19,Halfmarathon[[#This Row],[St Neots Seconds]])=499995,\"\",(MIN($I19,$N19,$R19,$AB19,Halfmarathon[[#This Row],[St Neots Seconds]]))/86400),\"\")","v":""},{"$f":"IF(Halfmarathon[[#This Row],[Gender]]=\"F\",IF(SUM($I19,$N19,$R19,$AB19,Halfmarathon[[#This Row],[St Neots Seconds]])=499995,\"\",(MIN($I19,$N19,$S19,$AB19,Halfmarathon[[#This Row],[St Neots Seconds]]))/86400),\"\")","v":""},{"$f":"IFERROR((HOUR(Halfmarathon[[#This Row],[Watchip]])*3600)+MINUTE(Halfmarathon[[#This Row],[Watchip]])*60+SECOND(Halfmarathon[[#This Row],[Watchip]]),99999)","v":99999},{"$f":"Hatime(Halfmarathon[[#This Row],[WatfordChip]])","v":""},null,null,null,{"$f":"IFERROR((HOUR(Halfmarathon[[#This Row],[Silverstonetime2]])*3600)+MINUTE(Halfmarathon[[#This Row],[Silverstonetime2]])*60+SECOND(Halfmarathon[[#This Row],[Silverstonetime2]]),99999)","v":99999},{"$f":"Hatime(Halfmarathon[[#This Row],[Silverstone Time]])","v":""},null,null,{"$f":"IFERROR(HOUR(Halfmarathon[[#This Row],[Berko time2]])*3600+MINUTE(Halfmarathon[[#This Row],[Berko time2]])*60+SECOND(Halfmarathon[[#This Row],[Berko time2]]),99999)","v":99999},{"$f":"Hatime(Halfmarathon[[#This Row],[Berko Time]])","v":""},null,null,1,{"$f":"IFERROR(HOUR(Halfmarathon[St Albans time])*3600+MINUTE(Halfmarathon[St Albans time])*60+SECOND(Halfmarathon[St Albans time]),99999)","v":6287},{"$f":"IFERROR(VLOOKUP(Halfmarathon[[#This Row],[Mem]],STAPoints[[MEM]:[Points]],4,FALSE),0)","v":50},"01:44:47",null," ",{"$f":"IFERROR(HOUR(Halfmarathon[MK Half time])*3600+MINUTE(Halfmarathon[MK Half time])*60+SECOND(Halfmarathon[MK Half time]),99999)","v":99999},null," ",{"$f":"IFERROR(HOUR(Halfmarathon[St Neots Half Time])*3600+MINUTE(Halfmarathon[St Neots Half Time])*60+SECOND(Halfmarathon[St Neots Half Time]),99999)","v":99999}]
[null,"Richard JOHNSTONE",{"$f":"VLOOKUP(Halfmarathon[[#This Row],[Name]],members,2,FALSE)","v":122},{"$f":"COUNT(Halfmarathon[[#This Row],[watfordplace]],Halfmarathon[[#This Row],[Silverstone Place]],Halfmarathon[[#This Row],[Berko Place]],Halfmarathon[[#This Row],[STA Place]],Halfmarathon[[#This Row],[St Neots Half  Place]])","v":1},"M",{"$f":"IFERROR(IF(Halfmarathon[[#This Row],[Gender]]=\"M\",50-(RANK(Halfmarathon[[#This Row],[GentsBestTime]],Halfmarathon[GentsBestTime],1))+1,50-(RANK(Halfmarathon[[#This Row],[Ladies Best Time]],Halfmarathon[Ladies Best Time],1))+1)+Halfmarathon[[#This Row],[St Albans Points]],Halfmarathon[[#This Row],[St Albans Points]])","v":36},{"$f":"IF(Halfmarathon[[#This Row],[Gender]]=\"M\",IF(SUM($I20,$N20,$R20,$AB20,Halfmarathon[[#This Row],[St Neots Seconds]])=499995,\"\",(MIN($I20,$N20,$R20,$AB20,Halfmarathon[[#This Row],[St Neots Seconds]]))/86400),\"\")","v":"01:33:37"},{"$f":"IF(Halfmarathon[[#This Row],[Gender]]=\"F\",IF(SUM($I20,$N20,$R20,$AB20,Halfmarathon[[#This Row],[St Neots Seconds]])=499995,\"\",(MIN($I20,$N20,$S20,$AB20,Halfmarathon[[#This Row],[St Neots Seconds]]))/86400),\"\")","v":""},{"$f":"IFERROR((HOUR(Halfmarathon[[#This Row],[Watchip]])*3600)+MINUTE(Halfmarathon[[#This Row],[Watchip]])*60+SECOND(Halfmarathon[[#This Row],[Watchip]]),99999)","v":99999},{"$f":"Hatime(Halfmarathon[[#This Row],[WatfordChip]])","v":""},null,null,null,{"$f":"IFERROR((HOUR(Halfmarathon[[#This Row],[Silverstonetime2]])*3600)+MINUTE(Halfmarathon[[#This Row],[Silverstonetime2]])*60+SECOND(Halfmarathon[[#This Row],[Silverstonetime2]]),99999)","v":99999},{"$f":"Hatime(Halfmarathon[[#This Row],[Silverstone Time]])","v":""},null,null,{"$f":"IFERROR(HOUR(Halfmarathon[[#This Row],[Berko time2]])*3600+MINUTE(Halfmarathon[[#This Row],[Berko time2]])*60+SECOND(Halfmarathon[[#This Row],[Berko time2]]),99999)","v":99999},{"$f":"Hatime(Halfmarathon[[#This Row],[Berko Time]])","v":""},null,null,null,{"$f":"IFERROR(HOUR(Halfmarathon[St Albans time])*3600+MINUTE(Halfmarathon[St Albans time])*60+SECOND(Halfmarathon[St Albans time]),99999)","v":99999},{"$f":"IFERROR(VLOOKUP(Halfmarathon[[#This Row],[Mem]],STAPoints[[MEM]:[Points]],4,FALSE),0)","v":0}," ",null," ",{"$f":"IFERROR(HOUR(Halfmarathon[MK Half time])*3600+MINUTE(Halfmarathon[MK Half time])*60+SECOND(Halfmarathon[MK Half time]),99999)","v":99999},200,"01:33:37",{"$f":"IFERROR(HOUR(Halfmarathon[St Neots Half Time])*3600+MINUTE(Halfmarathon[St Neots Half Time])*60+SECOND(Halfmarathon[St Neots Half Time]),99999)","v":5617}]
[null,"Emily Hooper",{"$f":"VLOOKUP(B21,members,2,FALSE)","v":138},{"$f":"COUNT(Halfmarathon[[#This Row],[watfordplace]],Halfmarathon[[#This Row],[Silverstone Place]],Halfmarathon[[#This Row],[Berko Place]],Halfmarathon[[#This Row],[STA Place]],Halfmarathon[[#This Row],[St Neots Half  Place]])","v":1},"F",{"$f":"IFERROR(IF(Halfmarathon[[#This Row],[Gender]]=\"M\",50-(RANK(Halfmarathon[[#This Row],[GentsBestTime]],Halfmarathon[GentsBestTime],1))+1,50-(RANK(Halfmarathon[[#This Row],[Ladies Best Time]],Halfmarathon[Ladies Best Time],1))+1)+Halfmarathon[[#This Row],[St Albans Points]],Halfmarathon[[#This Row],[St Albans Points]])","v":48},{"$f":"IF(Halfmarathon[[#This Row],[Gender]]=\"M\",IF(SUM($I21,$N21,$R21,$AB21,Halfmarathon[[#This Row],[St Neots Seconds]])=499995,\"\",(MIN($I21,$N21,$R21,$AB21,Halfmarathon[[#This Row],[St Neots Seconds]]))/86400),\"\")","v":""},{"$f":"IF(Halfmarathon[[#This Row],[Gender]]=\"F\",IF(SUM($I21,$N21,$R21,$AB21,Halfmarathon[[#This Row],[St Neots Seconds]])=499995,\"\",(MIN($I21,$N21,$S21,$AB21,Halfmarathon[[#This Row],[St Neots Seconds]]))/86400),\"\")","v":""},{"$f":"IFERROR((HOUR(Halfmarathon[[#This Row],[Watchip]])*3600)+MINUTE(Halfmarathon[[#This Row],[Watchip]])*60+SECOND(Halfmarathon[[#This Row],[Watchip]]),99999)","v":99999},{"$f":"Hatime(Halfmarathon[[#This Row],[WatfordChip]])","v":""},null,null,null,{"$f":"IFERROR((HOUR(Halfmarathon[[#This Row],[Silverstonetime2]])*3600)+MINUTE(Halfmarathon[[#This Row],[Silverstonetime2]])*60+SECOND(Halfmarathon[[#This Row],[Silverstonetime2]]),99999)","v":99999},{"$f":"Hatime(Halfmarathon[[#This Row],[Silverstone Time]])","v":""},null,null,{"$f":"IFERROR(HOUR(Halfmarathon[[#This Row],[Berko time2]])*3600+MINUTE(Halfmarathon[[#This Row],[Berko time2]])*60+SECOND(Halfmarathon[[#This Row],[Berko time2]]),99999)","v":99999},{"$f":"Hatime(Halfmarathon[[#This Row],[Berko Time]])","v":""},null,null,1,{"$f":"IFERROR(HOUR(Halfmarathon[St Albans time])*3600+MINUTE(Halfmarathon[St Albans time])*60+SECOND(Halfmarathon[St Albans time]),99999)","v":6339},{"$f":"IFERROR(VLOOKUP(Halfmarathon[[#This Row],[Mem]],STAPoints[[MEM]:[Points]],4,FALSE),0)","v":48},"01:45:39",null," ",{"$f":"IFERROR(HOUR(Halfmarathon[MK Half time])*3600+MINUTE(Halfmarathon[MK Half time])*60+SECOND(Halfmarathon[MK Half time]),99999)","v":99999},null," ",{"$f":"IFERROR(HOUR(Halfmarathon[St Neots Half Time])*3600+MINUTE(Halfmarathon[St Neots Half Time])*60+SECOND(Halfmarathon[St Neots Half Time]),99999)","v":99999}]
[null,"Dawn Burr",{"$f":"VLOOKUP(Halfmarathon[[#This Row],[Name]],members,2,FALSE)","v":140},{"$f":"COUNT(Halfmarathon[[#This Row],[watfordplace]],Halfmarathon[[#This Row],[Silverstone Place]],Halfmarathon[[#This Row],[Berko Place]],Halfmarathon[[#This Row],[STA Place]],Halfmarathon[[#This Row],[St Neots Half  Place]])","v":3},"F",{"$f":"IFERROR(IF(Halfmarathon[[#This Row],[Gender]]=\"M\",50-(RANK(Halfmarathon[[#This Row],[GentsBestTime]],Halfmarathon[GentsBestTime],1))+1,50-(RANK(Halfmarathon[[#This Row],[Ladies Best Time]],Halfmarathon[Ladies Best Time],1))+1)+Halfmarathon[[#This Row],[St Albans Points]],Halfmarathon[[#This Row],[St Albans Points]])","v":96},{"$f":"IF(Halfmarathon[[#This Row],[Gender]]=\"M\",IF(SUM($I22,$N22,$R22,$AB22,Halfmarathon[[#This Row],[St Neots Seconds]])=499995,\"\",(MIN($I22,$N22,$R22,$AB22,Halfmarathon[[#This Row],[St Neots Seconds]]))/86400),\"\")","v":""},{"$f":"IF(Halfmarathon[[#This Row],[Gender]]=\"F\",IF(SUM($I22,$N22,$R22,$AB22,Halfmarathon[[#This Row],[St Neots Seconds]])=499995,\"\",(MIN($I22,$N22,$S22,$AB22,Halfmarathon[[#This Row],[St Neots Seconds]]))/86400),\"\")","v":"01:42:57"},{"$f":"IFERROR((HOUR(Halfmarathon[[#This Row],[Watchip]])*3600)+MINUTE(Halfmarathon[[#This Row],[Watchip]])*60+SECOND(Halfmarathon[[#This Row],[Watchip]]),99999)","v":99999},{"$f":"Hatime(Halfmarathon[[#This Row],[WatfordChip]])","v":""},null,null,null,{"$f":"IFERROR((HOUR(Halfmarathon[[#This Row],[Silverstonetime2]])*3600)+MINUTE(Halfmarathon[[#This Row],[Silverstonetime2]])*60+SECOND(Halfmarathon[[#This Row],[Silverstonetime2]]),99999)","v":6193},{"$f":"Hatime(Halfmarathon[[#This Row],[Silverstone Time]])","v":"01:43:13"},1058,"01:43:13",{"$f":"IFERROR(HOUR(Halfmarathon[[#This Row],[Berko time2]])*3600+MINUTE(Halfmarathon[[#This Row],[Berko time2]])*60+SECOND(Halfmarathon[[#This Row],[Berko time2]]),99999)","v":99999},{"$f":"Hatime(Halfmarathon[[#This Row],[Berko Time]])","v":""},null,null,1,{"$f":"IFERROR(HOUR(Halfmarathon[St Albans time])*3600+MINUTE(Halfmarathon[St Albans time])*60+SECOND(Halfmarathon[St Albans time]),99999)","v":6332},{"$f":"IFERROR(VLOOKUP(Halfmarathon[[#This Row],[Mem]],STAPoints[[MEM]:[Points]],4,FALSE),0)","v":49},"01:45:32",null," ",{"$f":"IFERROR(HOUR(Halfmarathon[MK Half time])*3600+MINUTE(Halfmarathon[MK Half time])*60+SECOND(Halfmarathon[MK Half time]),99999)","v":99999},384,"01:42:57",{"$f":"IFERROR(HOUR(Halfmarathon[St Neots Half Time])*3600+MINUTE(Halfmarathon[St Neots Half Time])*60+SECOND(Halfmarathon[St Neots Half Time]),99999)","v":6177}]
[null,"James Bentall",{"$f":"VLOOKUP(Halfmarathon[[#This Row],[Name]],members,2,FALSE)","v":141},{"$f":"COUNT(Halfmarathon[[#This Row],[watfordplace]],Halfmarathon[[#This Row],[Silverstone Place]],Halfmarathon[[#This Row],[Berko Place]],Halfmarathon[[#This Row],[STA Place]],Halfmarathon[[#This Row],[St Neots Half  Place]])","v":2},"M",{"$f":"IFERROR(IF(Halfmarathon[[#This Row],[Gender]]=\"M\",50-(RANK(Halfmarathon[[#This Row],[GentsBestTime]],Halfmarathon[GentsBestTime],1))+1,50-(RANK(Halfmarathon[[#This Row],[Ladies Best Time]],Halfmarathon[Ladies Best Time],1))+1)+Halfmarathon[[#This Row],[St Albans Points]],Halfmarathon[[#This Row],[St Albans Points]])","v":80},{"$f":"IF(Halfmarathon[[#This Row],[Gender]]=\"M\",IF(SUM($I23,$N23,$R23,$AB23,Halfmarathon[[#This Row],[St Neots Seconds]])=499995,\"\",(MIN($I23,$N23,$R23,$AB23,Halfmarathon[[#This Row],[St Neots Seconds]]))/86400),\"\")","v":"01:35:34"},{"$f":"IF(Halfmarathon[[#This Row],[Gender]]=\"F\",IF(SUM($I23,$N23,$R23,$AB23,Halfmarathon[[#This Row],[St Neots Seconds]])=499995,\"\",(MIN($I23,$N23,$S23,$AB23,Halfmarathon[[#This Row],[St Neots Seconds]]))/86400),\"\")","v":""},{"$f":"IFERROR((HOUR(Halfmarathon[[#This Row],[Watchip]])*3600)+MINUTE(Halfmarathon[[#This Row],[Watchip]])*60+SECOND(Halfmarathon[[#This Row],[Watchip]]),99999)","v":99999},{"$f":"Hatime(Halfmarathon[[#This Row],[WatfordChip]])","v":""},null,null,null,{"$f":"IFERROR((HOUR(Halfmarathon[[#This Row],[Silverstonetime2]])*3600)+MINUTE(Halfmarathon[[#This Row],[Silverstonetime2]])*60+SECOND(Halfmarathon[[#This Row],[Silverstonetime2]]),99999)","v":5734},{"$f":"Hatime(Halfmarathon[[#This Row],[Silverstone Time]])","v":"01:35:34"},463,"01:35:34",{"$f":"IFERROR(HOUR(Halfmarathon[[#This Row],[Berko time2]])*3600+MINUTE(Halfmarathon[[#This Row],[Berko time2]])*60+SECOND(Halfmarathon[[#This Row],[Berko time2]]),99999)","v":99999},{"$f":"Hatime(Halfmarathon[[#This Row],[Berko Time]])","v":""},null,null,1,{"$f":"IFERROR(HOUR(Halfmarathon[St Albans time])*3600+MINUTE(Halfmarathon[St Albans time])*60+SECOND(Halfmarathon[St Albans time]),99999)","v":5792},{"$f":"IFERROR(VLOOKUP(Halfmarathon[[#This Row],[Mem]],STAPoints[[MEM]:[Points]],4,FALSE),0)","v":46},"01:36:32",null," ",{"$f":"IFERROR(HOUR(Halfmarathon[MK Half time])*3600+MINUTE(Halfmarathon[MK Half time])*60+SECOND(Halfmarathon[MK Half time]),99999)","v":99999},null," ",{"$f":"IFERROR(HOUR(Halfmarathon[St Neots Half Time])*3600+MINUTE(Halfmarathon[St Neots Half Time])*60+SECOND(Halfmarathon[St Neots Half Time]),99999)","v":99999}]
[null,"Joanne Richards",{"$f":"VLOOKUP(B24,members,2,FALSE)","v":149},{"$f":"COUNT(Halfmarathon[[#This Row],[watfordplace]],Halfmarathon[[#This Row],[Silverstone Place]],Halfmarathon[[#This Row],[Berko Place]],Halfmarathon[[#This Row],[STA Place]],Halfmarathon[[#This Row],[St Neots Half  Place]])","v":1},"F",{"$f":"IFERROR(IF(Halfmarathon[[#This Row],[Gender]]=\"M\",50-(RANK(Halfmarathon[[#This Row],[GentsBestTime]],Halfmarathon[GentsBestTime],1))+1,50-(RANK(Halfmarathon[[#This Row],[Ladies Best Time]],Halfmarathon[Ladies Best Time],1))+1)+Halfmarathon[[#This Row],[St Albans Points]],Halfmarathon[[#This Row],[St Albans Points]])","v":47},{"$f":"IF(Halfmarathon[[#This Row],[Gender]]=\"M\",IF(SUM($I24,$N24,$R24,$AB24,Halfmarathon[[#This Row],[St Neots Seconds]])=499995,\"\",(MIN($I24,$N24,$R24,$AB24,Halfmarathon[[#This Row],[St Neots Seconds]]))/86400),\"\")","v":""},{"$f":"IF(Halfmarathon[[#This Row],[Gender]]=\"F\",IF(SUM($I24,$N24,$R24,$AB24,Halfmarathon[[#This Row],[St Neots Seconds]])=499995,\"\",(MIN($I24,$N24,$S24,$AB24,Halfmarathon[[#This Row],[St Neots Seconds]]))/86400),\"\")","v":""},{"$f":"IFERROR((HOUR(Halfmarathon[[#This Row],[Watchip]])*3600)+MINUTE(Halfmarathon[[#This Row],[Watchip]])*60+SECOND(Halfmarathon[[#This Row],[Watchip]]),99999)","v":99999},{"$f":"Hatime(Halfmarathon[[#This Row],[WatfordChip]])","v":""},null,null,null,{"$f":"IFERROR((HOUR(Halfmarathon[[#This Row],[Silverstonetime2]])*3600)+MINUTE(Halfmarathon[[#This Row],[Silverstonetime2]])*60+SECOND(Halfmarathon[[#This Row],[Silverstonetime2]]),99999)","v":99999},{"$f":"Hatime(Halfmarathon[[#This Row],[Silverstone Time]])","v":""},null,null,{"$f":"IFERROR(HOUR(Halfmarathon[[#This Row],[Berko time2]])*3600+MINUTE(Halfmarathon[[#This Row],[Berko time2]])*60+SECOND(Halfmarathon[[#This Row],[Berko time2]]),99999)","v":99999},{"$f":"Hatime(Halfmarathon[[#This Row],[Berko Time]])","v":""},null,null,1,{"$f":"IFERROR(HOUR(Halfmarathon[St Albans time])*3600+MINUTE(Halfmarathon[St Albans time])*60+SECOND(Halfmarathon[St Albans time]),99999)","v":7231},{"$f":"IFERROR(VLOOKUP(Halfmarathon[[#This Row],[Mem]],STAPoints[[MEM]:[Points]],4,FALSE),0)","v":47},"02:00:31",null," ",{"$f":"IFERROR(HOUR(Halfmarathon[MK Half time])*3600+MINUTE(Halfmarathon[MK Half time])*60+SECOND(Halfmarathon[MK Half time]),99999)","v":99999},null," ",{"$f":"IFERROR(HOUR(Halfmarathon[St Neots Half Time])*3600+MINUTE(Halfmarathon[St Neots Half Time])*60+SECOND(Halfmarathon[St Neots Half Time]),99999)","v":99999}]
[null,"Joolz Scott",178,{"$f":"COUNT(Halfmarathon[[#This Row],[watfordplace]],Halfmarathon[[#This Row],[Silverstone Place]],Halfmarathon[[#This Row],[Berko Place]],Halfmarathon[[#This Row],[STA Place]],Halfmarathon[[#This Row],[St Neots Half  Place]])","v":1},"F",{"$f":"IFERROR(IF(Halfmarathon[[#This Row],[Gender]]=\"M\",50-(RANK(Halfmarathon[[#This Row],[GentsBestTime]],Halfmarathon[GentsBestTime],1))+1,50-(RANK(Halfmarathon[[#This Row],[Ladies Best Time]],Halfmarathon[Ladies Best Time],1))+1)+Halfmarathon[[#This Row],[St Albans Points]],Halfmarathon[[#This Row],[St Albans Points]])","v":44},{"$f":"IF(Halfmarathon[[#This Row],[Gender]]=\"M\",IF(SUM($I25,$N25,$R25,$AB25,Halfmarathon[[#This Row],[St Neots Seconds]])=499995,\"\",(MIN($I25,$N25,$R25,$AB25,Halfmarathon[[#This Row],[St Neots Seconds]]))/86400),\"\")","v":""},{"$f":"IF(Halfmarathon[[#This Row],[Gender]]=\"F\",IF(SUM($I25,$N25,$R25,$AB25,Halfmarathon[[#This Row],[St Neots Seconds]])=499995,\"\",(MIN($I25,$N25,$S25,$AB25,Halfmarathon[[#This Row],[St Neots Seconds]]))/86400),\"\")","v":1.1573958333333334},{"$f":"IFERROR((HOUR(Halfmarathon[[#This Row],[Watchip]])*3600)+MINUTE(Halfmarathon[[#This Row],[Watchip]])*60+SECOND(Halfmarathon[[#This Row],[Watchip]]),99999)","v":99999},{"$f":"Hatime(Halfmarathon[[#This Row],[WatfordChip]])","v":""},null,null,null,{"$f":"IFERROR((HOUR(Halfmarathon[[#This Row],[Silverstonetime2]])*3600)+MINUTE(Halfmarathon[[#This Row],[Silverstonetime2]])*60+SECOND(Halfmarathon[[#This Row],[Silverstonetime2]]),99999)","v":99999},{"$f":"Hatime(Halfmarathon[[#This Row],[Silverstone Time]])","v":""},null,null,{"$f":"IFERROR(HOUR(Halfmarathon[[#This Row],[Berko time2]])*3600+MINUTE(Halfmarathon[[#This Row],[Berko time2]])*60+SECOND(Halfmarathon[[#This Row],[Berko time2]]),99999)","v":7049},{"$f":"Hatime(Halfmarathon[[#This Row],[Berko Time]])","v":"01:57:29"},624,"01:57:29",null,{"$f":"IFERROR(HOUR(Halfmarathon[St Albans time])*3600+MINUTE(Halfmarathon[St Albans time])*60+SECOND(Halfmarathon[St Albans time]),99999)","v":99999},{"$f":"IFERROR(VLOOKUP(Halfmarathon[[#This Row],[Mem]],STAPoints[[MEM]:[Points]],4,FALSE),0)","v":0}," ",null," ",{"$f":"IFERROR(HOUR(Halfmarathon[MK Half time])*3600+MINUTE(Halfmarathon[MK Half time])*60+SECOND(Halfmarathon[MK Half time]),99999)","v":99999},null," ",{"$f":"IFERROR(HOUR(Halfmarathon[St Neots Half Time])*3600+MINUTE(Halfmarathon[St Neots Half Time])*60+SECOND(Halfmarathon[St Neots Half Time]),99999)","v":99999}]
[null,"Paul Geary",{"$f":"VLOOKUP(Halfmarathon[[#This Row],[Name]],members,2,FALSE)","v":187},{"$f":"COUNT(Halfmarathon[[#This Row],[watfordplace]],Halfmarathon[[#This Row],[Silverstone Place]],Halfmarathon[[#This Row],[Berko Place]],Halfmarathon[[#This Row],[STA Place]],Halfmarathon[[#This Row],[St Neots Half  Place]])","v":2},"M",{"$f":"IFERROR(IF(Halfmarathon[[#This Row],[Gender]]=\"M\",50-(RANK(Halfmarathon[[#This Row],[GentsBestTime]],Halfmarathon[GentsBestTime],1))+1,50-(RANK(Halfmarathon[[#This Row],[Ladies Best Time]],Halfmarathon[Ladies Best Time],1))+1)+Halfmarathon[[#This Row],[St Albans Points]],Halfmarathon[[#This Row],[St Albans Points]])","v":72},{"$f":"IF(Halfmarathon[[#This Row],[Gender]]=\"M\",IF(SUM($I26,$N26,$R26,$AB26,Halfmarathon[[#This Row],[St Neots Seconds]])=499995,\"\",(MIN($I26,$N26,$R26,$AB26,Halfmarathon[[#This Row],[St Neots Seconds]]))/86400),\"\")","v":"01:43:52"},{"$f":"IF(Halfmarathon[[#This Row],[Gender]]=\"F\",IF(SUM($I26,$N26,$R26,$AB26,Halfmarathon[[#This Row],[St Neots Seconds]])=499995,\"\",(MIN($I26,$N26,$S26,$AB26,Halfmarathon[[#This Row],[St Neots Seconds]]))/86400),\"\")","v":""},{"$f":"IFERROR((HOUR(Halfmarathon[[#This Row],[Watchip]])*3600)+MINUTE(Halfmarathon[[#This Row],[Watchip]])*60+SECOND(Halfmarathon[[#This Row],[Watchip]]),99999)","v":99999},{"$f":"Hatime(Halfmarathon[[#This Row],[WatfordChip]])","v":""},null,null,null,{"$f":"IFERROR((HOUR(Halfmarathon[[#This Row],[Silverstonetime2]])*3600)+MINUTE(Halfmarathon[[#This Row],[Silverstonetime2]])*60+SECOND(Halfmarathon[[#This Row],[Silverstonetime2]]),99999)","v":99999},{"$f":"Hatime(Halfmarathon[[#This Row],[Silverstone Time]])","v":""},null,null,{"$f":"IFERROR(HOUR(Halfmarathon[[#This Row],[Berko time2]])*3600+MINUTE(Halfmarathon[[#This Row],[Berko time2]])*60+SECOND(Halfmarathon[[#This Row],[Berko time2]]),99999)","v":6232},{"$f":"Hatime(Halfmarathon[[#This Row],[Berko Time]])","v":"01:43:52"},321,"01:43:52",1,{"$f":"IFERROR(HOUR(Halfmarathon[St Albans time])*3600+MINUTE(Halfmarathon[St Albans time])*60+SECOND(Halfmarathon[St Albans time]),99999)","v":6187},{"$f":"IFERROR(VLOOKUP(Halfmarathon[[#This Row],[Mem]],STAPoints[[MEM]:[Points]],4,FALSE),0)","v":42},"01:43:07",null," ",{"$f":"IFERROR(HOUR(Halfmarathon[MK Half time])*3600+MINUTE(Halfmarathon[MK Half time])*60+SECOND(Halfmarathon[MK Half time]),99999)","v":99999},null," ",{"$f":"IFERROR(HOUR(Halfmarathon[St Neots Half Time])*3600+MINUTE(Halfmarathon[St Neots Half Time])*60+SECOND(Halfmarathon[St Neots Half Time]),99999)","v":99999}]
[null,"Simon Townsend",{"$f":"VLOOKUP(Halfmarathon[[#This Row],[Name]],members,2,FALSE)","v":208},{"$f":"COUNT(Halfmarathon[[#This Row],[watfordplace]],Halfmarathon[[#This Row],[Silverstone Place]],Halfmarathon[[#This Row],[Berko Place]],Halfmarathon[[#This Row],[STA Place]],Halfmarathon[[#This Row],[St Neots Half  Place]])","v":1},"M",{"$f":"IFERROR(IF(Halfmarathon[[#This Row],[Gender]]=\"M\",50-(RANK(Halfmarathon[[#This Row],[GentsBestTime]],Halfmarathon[GentsBestTime],1))+1,50-(RANK(Halfmarathon[[#This Row],[Ladies Best Time]],Halfmarathon[Ladies Best Time],1))+1)+Halfmarathon[[#This Row],[St Albans Points]],Halfmarathon[[#This Row],[St Albans Points]])","v":31},{"$f":"IF(Halfmarathon[[#This Row],[Gender]]=\"M\",IF(SUM($I27,$N27,$R27,$AB27,Halfmarathon[[#This Row],[St Neots Seconds]])=499995,\"\",(MIN($I27,$N27,$R27,$AB27,Halfmarathon[[#This Row],[St Neots Seconds]]))/86400),\"\")","v":"01:39:01"},{"$f":"IF(Halfmarathon[[#This Row],[Gender]]=\"F\",IF(SUM($I27,$N27,$R27,$AB27,Halfmarathon[[#This Row],[St Neots Seconds]])=499995,\"\",(MIN($I27,$N27,$S27,$AB27,Halfmarathon[[#This Row],[St Neots Seconds]]))/86400),\"\")","v":""},{"$f":"IFERROR((HOUR(Halfmarathon[[#This Row],[Watchip]])*3600)+MINUTE(Halfmarathon[[#This Row],[Watchip]])*60+SECOND(Halfmarathon[[#This Row],[Watchip]]),99999)","v":99999},{"$f":"Hatime(Halfmarathon[[#This Row],[WatfordChip]])","v":""},null,null,null,{"$f":"IFERROR((HOUR(Halfmarathon[[#This Row],[Silverstonetime2]])*3600)+MINUTE(Halfmarathon[[#This Row],[Silverstonetime2]])*60+SECOND(Halfmarathon[[#This Row],[Silverstonetime2]]),99999)","v":5941},{"$f":"Hatime(Halfmarathon[[#This Row],[Silverstone Time]])","v":"01:39:01"},706,"01:39:01",{"$f":"IFERROR(HOUR(Halfmarathon[[#This Row],[Berko time2]])*3600+MINUTE(Halfmarathon[[#This Row],[Berko time2]])*60+SECOND(Halfmarathon[[#This Row],[Berko time2]]),99999)","v":99999},{"$f":"Hatime(Halfmarathon[[#This Row],[Berko Time]])","v":""},null,null,null,{"$f":"IFERROR(HOUR(Halfmarathon[St Albans time])*3600+MINUTE(Halfmarathon[St Albans time])*60+SECOND(Halfmarathon[St Albans time]),99999)","v":99999},{"$f":"IFERROR(VLOOKUP(Halfmarathon[[#This Row],[Mem]],STAPoints[[MEM]:[Points]],4,FALSE),0)","v":0}," ",null," ",{"$f":"IFERROR(HOUR(Halfmarathon[MK Half time])*3600+MINUTE(Halfmarathon[MK Half time])*60+SECOND(Halfmarathon[MK Half time]),99999)","v":99999},null," ",{"$f":"IFERROR(HOUR(Halfmarathon[St Neots Half Time])*3600+MINUTE(Halfmarathon[St Neots Half Time])*60+SECOND(Halfmarathon[St Neots Half Time]),99999)","v":99999}]
[null,"Andrew Cripps",{"$f":"VLOOKUP(B28,members,2,FALSE)","v":212},{"$f":"COUNT(Halfmarathon[[#This Row],[watfordplace]],Halfmarathon[[#This Row],[Silverstone Place]],Halfmarathon[[#This Row],[Berko Place]],Halfmarathon[[#This Row],[STA Place]],Halfmarathon[[#This Row],[St Neots Half  Place]])","v":2},"M",{"$f":"IFERROR(IF(Halfmarathon[[#This Row],[Gender]]=\"M\",50-(RANK(Halfmarathon[[#This Row],[GentsBestTime]],Halfmarathon[GentsBestTime],1))+1,50-(RANK(Halfmarathon[[#This Row],[Ladies Best Time]],Halfmarathon[Ladies Best Time],1))+1)+Halfmarathon[[#This Row],[St Albans Points]],Halfmarathon[[#This Row],[St Albans Points]])","v":86},{"$f":"IF(Halfmarathon[[#This Row],[Gender]]=\"M\",IF(SUM($I28,$N28,$R28,$AB28,Halfmarathon[[#This Row],[St Neots Seconds]])=499995,\"\",(MIN($I28,$N28,$R28,$AB28,Halfmarathon[[#This Row],[St Neots Seconds]]))/86400),\"\")","v":"01:30:00"},{"$f":"IF(Halfmarathon[[#This Row],[Gender]]=\"F\",IF(SUM($I28,$N28,$R28,$AB28,Halfmarathon[[#This Row],[St Neots Seconds]])=499995,\"\",(MIN($I28,$N28,$S28,$AB28,Halfmarathon[[#This Row],[St Neots Seconds]]))/86400),\"\")","v":""},{"$f":"IFERROR((HOUR(Halfmarathon[[#This Row],[Watchip]])*3600)+MINUTE(Halfmarathon[[#This Row],[Watchip]])*60+SECOND(Halfmarathon[[#This Row],[Watchip]]),99999)","v":99999},{"$f":"Hatime(Halfmarathon[[#This Row],[WatfordChip]])","v":""},null,null,null,{"$f":"IFERROR((HOUR(Halfmarathon[[#This Row],[Silverstonetime2]])*3600)+MINUTE(Halfmarathon[[#This Row],[Silverstonetime2]])*60+SECOND(Halfmarathon[[#This Row],[Silverstonetime2]]),99999)","v":99999},{"$f":"Hatime(Halfmarathon[[#This Row],[Silverstone Time]])","v":""},null,null,{"$f":"IFERROR(HOUR(Halfmarathon[[#This Row],[Berko time2]])*3600+MINUTE(Halfmarathon[[#This Row],[Berko time2]])*60+SECOND(Halfmarathon[[#This Row],[Berko time2]]),99999)","v":99999},{"$f":"Hatime(Halfmarathon[[#This Row],[Berko Time]])","v":""},null,null,1,{"$f":"IFERROR(HOUR(Halfmarathon[St Albans time])*3600+MINUTE(Halfmarathon[St Albans time])*60+SECOND(Halfmarathon[St Albans time]),99999)","v":5525},{"$f":"IFERROR(VLOOKUP(Halfmarathon[[#This Row],[Mem]],STAPoints[[MEM]:[Points]],4,FALSE),0)","v":47},"01:32:05",null," ",{"$f":"IFERROR(HOUR(Halfmarathon[MK Half time])*3600+MINUTE(Halfmarathon[MK Half time])*60+SECOND(Halfmarathon[MK Half time]),99999)","v":99999},153,"01:30:00",{"$f":"IFERROR(HOUR(Halfmarathon[St Neots Half Time])*3600+MINUTE(Halfmarathon[St Neots Half Time])*60+SECOND(Halfmarathon[St Neots Half Time]),99999)","v":5400}]
[null,"Paul Goodwin",{"$f":"VLOOKUP(Halfmarathon[[#This Row],[Name]],members,2,FALSE)","v":222},{"$f":"COUNT(Halfmarathon[[#This Row],[watfordplace]],Halfmarathon[[#This Row],[Silverstone Place]],Halfmarathon[[#This Row],[Berko Place]],Halfmarathon[[#This Row],[STA Place]],Halfmarathon[[#This Row],[St Neots Half  Place]])","v":1},"M",{"$f":"IFERROR(IF(Halfmarathon[[#This Row],[Gender]]=\"M\",50-(RANK(Halfmarathon[[#This Row],[GentsBestTime]],Halfmarathon[GentsBestTime],1))+1,50-(RANK(Halfmarathon[[#This Row],[Ladies Best Time]],Halfmarathon[Ladies Best Time],1))+1)+Halfmarathon[[#This Row],[St Albans Points]],Halfmarathon[[#This Row],[St Albans Points]])","v":48},{"$f":"IF(Halfmarathon[[#This Row],[Gender]]=\"M\",IF(SUM($I29,$N29,$R29,$AB29,Halfmarathon[[#This Row],[St Neots Seconds]])=499995,\"\",(MIN($I29,$N29,$R29,$AB29,Halfmarathon[[#This Row],[St Neots Seconds]]))/86400),\"\")","v":"01:24:30"},{"$f":"IF(Halfmarathon[[#This Row],[Gender]]=\"F\",IF(SUM($I29,$N29,$R29,$AB29,Halfmarathon[[#This Row],[St Neots Seconds]])=499995,\"\",(MIN($I29,$N29,$S29,$AB29,Halfmarathon[[#This Row],[St Neots Seconds]]))/86400),\"\")","v":""},{"$f":"IFERROR((HOUR(Halfmarathon[[#This Row],[Watchip]])*3600)+MINUTE(Halfmarathon[[#This Row],[Watchip]])*60+SECOND(Halfmarathon[[#This Row],[Watchip]]),99999)","v":99999},{"$f":"Hatime(Halfmarathon[[#This Row],[WatfordChip]])","v":""},null,null,null,{"$f":"IFERROR((HOUR(Halfmarathon[[#This Row],[Silverstonetime2]])*3600)+MINUTE(Halfmarathon[[#This Row],[Silverstonetime2]])*60+SECOND(Halfmarathon[[#This Row],[Silverstonetime2]]),99999)","v":99999},{"$f":"Hatime(Halfmarathon[[#This Row],[Silverstone Time]])","v":""},null,null,{"$f":"IFERROR(HOUR(Halfmarathon[[#This Row],[Berko time2]])*3600+MINUTE(Halfmarathon[[#This Row],[Berko time2]])*60+SECOND(Halfmarathon[[#This Row],[Berko time2]]),99999)","v":5070},{"$f":"Hatime(Halfmarathon[[#This Row],[Berko Time]])","v":"01:24:30"},31,"01:24:30",null,{"$f":"IFERROR(HOUR(Halfmarathon[St Albans time])*3600+MINUTE(Halfmarathon[St Albans time])*60+SECOND(Halfmarathon[St Albans time]),99999)","v":99999},{"$f":"IFERROR(VLOOKUP(Halfmarathon[[#This Row],[Mem]],STAPoints[[MEM]:[Points]],4,FALSE),0)","v":0}," ",null," ",{"$f":"IFERROR(HOUR(Halfmarathon[MK Half time])*3600+MINUTE(Halfmarathon[MK Half time])*60+SECOND(Halfmarathon[MK Half time]),99999)","v":99999},null," ",{"$f":"IFERROR(HOUR(Halfmarathon[St Neots Half Time])*3600+MINUTE(Halfmarathon[St Neots Half Time])*60+SECOND(Halfmarathon[St Neots Half Time]),99999)","v":99999}]
[null,"Steve BOWRAN",{"$f":"VLOOKUP(Halfmarathon[[#This Row],[Name]],members,2,FALSE)","v":223},{"$f":"COUNT(Halfmarathon[[#This Row],[watfordplace]],Halfmarathon[[#This Row],[Silverstone Place]],Halfmarathon[[#This Row],[Berko Place]],Halfmarathon[[#This Row],[STA Place]],Halfmarathon[[#This Row],[St Neots Half  Place]])","v":1},"M",{"$f":"IFERROR(IF(Halfmarathon[[#This Row],[Gender]]=\"M\",50-(RANK(Halfmarathon[[#This Row],[GentsBestTime]],Halfmarathon[GentsBestTime],1))+1,50-(RANK(Halfmarathon[[#This Row],[Ladies Best Time]],Halfmarathon[Ladies Best Time],1))+1)+Halfmarathon[[#This Row],[St Albans Points]],Halfmarathon[[#This Row],[St Albans Points]])","v":40},{"$f":"IF(Halfmarathon[[#This Row],[Gender]]=\"M\",IF(SUM($I30,$N30,$R30,$AB30,Halfmarathon[[#This Row],[St Neots Seconds]])=499995,\"\",(MIN($I30,$N30,$R30,$AB30,Halfmarathon[[#This Row],[St Neots Seconds]]))/86400),\"\")","v":"01:29:23"},{"$f":"IF(Halfmarathon[[#This Row],[Gender]]=\"F\",IF(SUM($I30,$N30,$R30,$AB30,Halfmarathon[[#This Row],[St Neots Seconds]])=499995,\"\",(MIN($I30,$N30,$S30,$AB30,Halfmarathon[[#This Row],[St Neots Seconds]]))/86400),\"\")","v":""},{"$f":"IFERROR((HOUR(Halfmarathon[[#This Row],[Watchip]])*3600)+MINUTE(Halfmarathon[[#This Row],[Watchip]])*60+SECOND(Halfmarathon[[#This Row],[Watchip]]),99999)","v":99999},{"$f":"Hatime(Halfmarathon[[#This Row],[WatfordChip]])","v":""},null,null,null,{"$f":"IFERROR((HOUR(Halfmarathon[[#This Row],[Silverstonetime2]])*3600)+MINUTE(Halfmarathon[[#This Row],[Silverstonetime2]])*60+SECOND(Halfmarathon[[#This Row],[Silverstonetime2]]),99999)","v":99999},{"$f":"Hatime(Halfmarathon[[#This Row],[Silverstone Time]])","v":""},null,null,{"$f":"IFERROR(HOUR(Halfmarathon[[#This Row],[Berko time2]])*3600+MINUTE(Halfmarathon[[#This Row],[Berko time2]])*60+SECOND(Halfmarathon[[#This Row],[Berko time2]]),99999)","v":99999},{"$f":"Hatime(Halfmarathon[[#This Row],[Berko Time]])","v":""},null,null,null,{"$f":"IFERROR(HOUR(Halfmarathon[St Albans time])*3600+MINUTE(Halfmarathon[St Albans time])*60+SECOND(Halfmarathon[St Albans time]),99999)","v":99999},{"$f":"IFERROR(VLOOKUP(Halfmarathon[[#This Row],[Mem]],STAPoints[[MEM]:[Points]],4,FALSE),0)","v":0}," ",null," ",{"$f":"IFERROR(HOUR(Halfmarathon[MK Half time])*3600+MINUTE(Halfmarathon[MK Half time])*60+SECOND(Halfmarathon[MK Half time]),99999)","v":99999},137,"01:29:23",{"$f":"IFERROR(HOUR(Halfmarathon[St Neots Half Time])*3600+MINUTE(Halfmarathon[St Neots Half Time])*60+SECOND(Halfmarathon[St Neots Half Time]),99999)","v":5363}]
[null,"Chris Cottle",{"$f":"VLOOKUP(B31,members,2,FALSE)","v":227},{"$f":"COUNT(Halfmarathon[[#This Row],[watfordplace]],Halfmarathon[[#This Row],[Silverstone Place]],Halfmarathon[[#This Row],[Berko Place]],Halfmarathon[[#This Row],[STA Place]],Halfmarathon[[#This Row],[St Neots Half  Place]])","v":1},"M",{"$f":"IFERROR(IF(Halfmarathon[[#This Row],[Gender]]=\"M\",50-(RANK(Halfmarathon[[#This Row],[GentsBestTime]],Halfmarathon[GentsBestTime],1))+1,50-(RANK(Halfmarathon[[#This Row],[Ladies Best Time]],Halfmarathon[Ladies Best Time],1))+1)+Halfmarathon[[#This Row],[St Albans Points]],Halfmarathon[[#This Row],[St Albans Points]])","v":41},{"$f":"IF(Halfmarathon[[#This Row],[Gender]]=\"M\",IF(SUM($I31,$N31,$R31,$AB31,Halfmarathon[[#This Row],[St Neots Seconds]])=499995,\"\",(MIN($I31,$N31,$R31,$AB31,Halfmarathon[[#This Row],[St Neots Seconds]]))/86400),\"\")","v":""},{"$f":"IF(Halfmarathon[[#This Row],[Gender]]=\"F\",IF(SUM($I31,$N31,$R31,$AB31,Halfmarathon[[#This Row],[St Neots Seconds]])=499995,\"\",(MIN($I31,$N31,$S31,$AB31,Halfmarathon[[#This Row],[St Neots Seconds]]))/86400),\"\")","v":""},{"$f":"IFERROR((HOUR(Halfmarathon[[#This Row],[Watchip]])*3600)+MINUTE(Halfmarathon[[#This Row],[Watchip]])*60+SECOND(Halfmarathon[[#This Row],[Watchip]]),99999)","v":99999},{"$f":"Hatime(Halfmarathon[[#This Row],[WatfordChip]])","v":""},null,null,null,{"$f":"IFERROR((HOUR(Halfmarathon[[#This Row],[Silverstonetime2]])*3600)+MINUTE(Halfmarathon[[#This Row],[Silverstonetime2]])*60+SECOND(Halfmarathon[[#This Row],[Silverstonetime2]]),99999)","v":99999},{"$f":"Hatime(Halfmarathon[[#This Row],[Silverstone Time]])","v":""},null,null,{"$f":"IFERROR(HOUR(Halfmarathon[[#This Row],[Berko time2]])*3600+MINUTE(Halfmarathon[[#This Row],[Berko time2]])*60+SECOND(Halfmarathon[[#This Row],[Berko time2]]),99999)","v":99999},{"$f":"Hatime(Halfmarathon[[#This Row],[Berko Time]])","v":""},null,null,1,{"$f":"IFERROR(HOUR(Halfmarathon[St Albans time])*3600+MINUTE(Halfmarathon[St Albans time])*60+SECOND(Halfmarathon[St Albans time]),99999)","v":6205},{"$f":"IFERROR(VLOOKUP(Halfmarathon[[#This Row],[Mem]],STAPoints[[MEM]:[Points]],4,FALSE),0)","v":41},"01:43:25",null," ",{"$f":"IFERROR(HOUR(Halfmarathon[MK Half time])*3600+MINUTE(Halfmarathon[MK Half time])*60+SECOND(Halfmarathon[MK Half time]),99999)","v":99999},null," ",{"$f":"IFERROR(HOUR(Halfmarathon[St Neots Half Time])*3600+MINUTE(Halfmarathon[St Neots Half Time])*60+SECOND(Halfmarathon[St Neots Half Time]),99999)","v":99999}]
[null,"Dee Bretnall",{"$f":"VLOOKUP(Halfmarathon[[#This Row],[Name]],members,2,FALSE)","v":230},{"$f":"COUNT(Halfmarathon[[#This Row],[watfordplace]],Halfmarathon[[#This Row],[Silverstone Place]],Halfmarathon[[#This Row],[Berko Place]],Halfmarathon[[#This Row],[STA Place]],Halfmarathon[[#This Row],[St Neots Half  Place]])","v":1},"F",{"$f":"IFERROR(IF(Halfmarathon[[#This Row],[Gender]]=\"M\",50-(RANK(Halfmarathon[[#This Row],[GentsBestTime]],Halfmarathon[GentsBestTime],1))+1,50-(RANK(Halfmarathon[[#This Row],[Ladies Best Time]],Halfmarathon[Ladies Best Time],1))+1)+Halfmarathon[[#This Row],[St Albans Points]],Halfmarathon[[#This Row],[St Albans Points]])","v":44},{"$f":"IF(Halfmarathon[[#This Row],[Gender]]=\"M\",IF(SUM($I32,$N32,$R32,$AB32,Halfmarathon[[#This Row],[St Neots Seconds]])=499995,\"\",(MIN($I32,$N32,$R32,$AB32,Halfmarathon[[#This Row],[St Neots Seconds]]))/86400),\"\")","v":""},{"$f":"IF(Halfmarathon[[#This Row],[Gender]]=\"F\",IF(SUM($I32,$N32,$R32,$AB32,Halfmarathon[[#This Row],[St Neots Seconds]])=499995,\"\",(MIN($I32,$N32,$S32,$AB32,Halfmarathon[[#This Row],[St Neots Seconds]]))/86400),\"\")","v":1.1573958333333334},{"$f":"IFERROR((HOUR(Halfmarathon[[#This Row],[Watchip]])*3600)+MINUTE(Halfmarathon[[#This Row],[Watchip]])*60+SECOND(Halfmarathon[[#This Row],[Watchip]]),99999)","v":99999},{"$f":"Hatime(Halfmarathon[[#This Row],[WatfordChip]])","v":""},null,null,null,{"$f":"IFERROR((HOUR(Halfmarathon[[#This Row],[Silverstonetime2]])*3600)+MINUTE(Halfmarathon[[#This Row],[Silverstonetime2]])*60+SECOND(Halfmarathon[[#This Row],[Silverstonetime2]]),99999)","v":99999},{"$f":"Hatime(Halfmarathon[[#This Row],[Silverstone Time]])","v":""},null,null,{"$f":"IFERROR(HOUR(Halfmarathon[[#This Row],[Berko time2]])*3600+MINUTE(Halfmarathon[[#This Row],[Berko time2]])*60+SECOND(Halfmarathon[[#This Row],[Berko time2]]),99999)","v":6960},{"$f":"Hatime(Halfmarathon[[#This Row],[Berko Time]])","v":"01:56:00"},577,"01:56:00",null,{"$f":"IFERROR(HOUR(Halfmarathon[St Albans time])*3600+MINUTE(Halfmarathon[St Albans time])*60+SECOND(Halfmarathon[St Albans time]),99999)","v":99999},{"$f":"IFERROR(VLOOKUP(Halfmarathon[[#This Row],[Mem]],STAPoints[[MEM]:[Points]],4,FALSE),0)","v":0}," ",null," ",{"$f":"IFERROR(HOUR(Halfmarathon[MK Half time])*3600+MINUTE(Halfmarathon[MK Half time])*60+SECOND(Halfmarathon[MK Half time]),99999)","v":99999},null," ",{"$f":"IFERROR(HOUR(Halfmarathon[St Neots Half Time])*3600+MINUTE(Halfmarathon[St Neots Half Time])*60+SECOND(Halfmarathon[St Neots Half Time]),99999)","v":99999}]
[null,"Pierre-Louis Gatti",{"$f":"VLOOKUP(Halfmarathon[[#This Row],[Name]],members,2,FALSE)","v":233},{"$f":"COUNT(Halfmarathon[[#This Row],[watfordplace]],Halfmarathon[[#This Row],[Silverstone Place]],Halfmarathon[[#This Row],[Berko Place]],Halfmarathon[[#This Row],[STA Place]],Halfmarathon[[#This Row],[St Neots Half  Place]])","v":1},"M",{"$f":"IFERROR(IF(Halfmarathon[[#This Row],[Gender]]=\"M\",50-(RANK(Halfmarathon[[#This Row],[GentsBestTime]],Halfmarathon[GentsBestTime],1))+1,50-(RANK(Halfmarathon[[#This Row],[Ladies Best Time]],Halfmarathon[Ladies Best Time],1))+1)+Halfmarathon[[#This Row],[St Albans Points]],Halfmarathon[[#This Row],[St Albans Points]])","v":26},{"$f":"IF(Halfmarathon[[#This Row],[Gender]]=\"M\",IF(SUM($I33,$N33,$R33,$AB33,Halfmarathon[[#This Row],[St Neots Seconds]])=499995,\"\",(MIN($I33,$N33,$R33,$AB33,Halfmarathon[[#This Row],[St Neots Seconds]]))/86400),\"\")","v":"02:11:52"},{"$f":"IF(Halfmarathon[[#This Row],[Gender]]=\"F\",IF(SUM($I33,$N33,$R33,$AB33,Halfmarathon[[#This Row],[St Neots Seconds]])=499995,\"\",(MIN($I33,$N33,$S33,$AB33,Halfmarathon[[#This Row],[St Neots Seconds]]))/86400),\"\")","v":""},{"$f":"IFERROR((HOUR(Halfmarathon[[#This Row],[Watchip]])*3600)+MINUTE(Halfmarathon[[#This Row],[Watchip]])*60+SECOND(Halfmarathon[[#This Row],[Watchip]]),99999)","v":99999},{"$f":"Hatime(Halfmarathon[[#This Row],[WatfordChip]])","v":""},null,null,null,{"$f":"IFERROR((HOUR(Halfmarathon[[#This Row],[Silverstonetime2]])*3600)+MINUTE(Halfmarathon[[#This Row],[Silverstonetime2]])*60+SECOND(Halfmarathon[[#This Row],[Silverstonetime2]]),99999)","v":99999},{"$f":"Hatime(Halfmarathon[[#This Row],[Silverstone Time]])","v":""},null,null,{"$f":"IFERROR(HOUR(Halfmarathon[[#This Row],[Berko time2]])*3600+MINUTE(Halfmarathon[[#This Row],[Berko time2]])*60+SECOND(Halfmarathon[[#This Row],[Berko time2]]),99999)","v":7912},{"$f":"Hatime(Halfmarathon[[#This Row],[Berko Time]])","v":"02:11:52"},861,"02:11:52",null,{"$f":"IFERROR(HOUR(Halfmarathon[St Albans time])*3600+MINUTE(Halfmarathon[St Albans time])*60+SECOND(Halfmarathon[St Albans time]),99999)","v":99999},{"$f":"IFERROR(VLOOKUP(Halfmarathon[[#This Row],[Mem]],STAPoints[[MEM]:[Points]],4,FALSE),0)","v":0}," ",null," ",{"$f":"IFERROR(HOUR(Halfmarathon[MK Half time])*3600+MINUTE(Halfmarathon[MK Half time])*60+SECOND(Halfmarathon[MK Half time]),99999)","v":99999},null," ",{"$f":"IFERROR(HOUR(Halfmarathon[St Neots Half Time])*3600+MINUTE(Halfmarathon[St Neots Half Time])*60+SECOND(Halfmarathon[St Neots Half Time]),99999)","v":99999}]
[null,"Andy Jordan",{"$f":"VLOOKUP(B34,members,2,FALSE)","v":239},{"$f":"COUNT(Halfmarathon[[#This Row],[watfordplace]],Halfmarathon[[#This Row],[Silverstone Place]],Halfmarathon[[#This Row],[Berko Place]],Halfmarathon[[#This Row],[STA Place]],Halfmarathon[[#This Row],[St Neots Half  Place]])","v":2},"M",{"$f":"IFERROR(IF(Halfmarathon[[#This Row],[Gender]]=\"M\",50-(RANK(Halfmarathon[[#This Row],[GentsBestTime]],Halfmarathon[GentsBestTime],1))+1,50-(RANK(Halfmarathon[[#This Row],[Ladies Best Time]],Halfmarathon[Ladies Best Time],1))+1)+Halfmarathon[[#This Row],[St Albans Points]],Halfmarathon[[#This Row],[St Albans Points]])","v":96},{"$f":"IF(Halfmarathon[[#This Row],[Gender]]=\"M\",IF(SUM($I34,$N34,$R34,$AB34,Halfmarathon[[#This Row],[St Neots Seconds]])=499995,\"\",(MIN($I34,$N34,$R34,$AB34,Halfmarathon[[#This Row],[St Neots Seconds]]))/86400),\"\")","v":"01:24:37"},{"$f":"IF(Halfmarathon[[#This Row],[Gender]]=\"F\",IF(SUM($I34,$N34,$R34,$AB34,Halfmarathon[[#This Row],[St Neots Seconds]])=499995,\"\",(MIN($I34,$N34,$S34,$AB34,Halfmarathon[[#This Row],[St Neots Seconds]]))/86400),\"\")","v":""},{"$f":"IFERROR((HOUR(Halfmarathon[[#This Row],[Watchip]])*3600)+MINUTE(Halfmarathon[[#This Row],[Watchip]])*60+SECOND(Halfmarathon[[#This Row],[Watchip]]),99999)","v":99999},{"$f":"Hatime(Halfmarathon[[#This Row],[WatfordChip]])","v":""},null,null,null,{"$f":"IFERROR((HOUR(Halfmarathon[[#This Row],[Silverstonetime2]])*3600)+MINUTE(Halfmarathon[[#This Row],[Silverstonetime2]])*60+SECOND(Halfmarathon[[#This Row],[Silverstonetime2]]),99999)","v":99999},{"$f":"Hatime(Halfmarathon[[#This Row],[Silverstone Time]])","v":""},null,null,{"$f":"IFERROR(HOUR(Halfmarathon[[#This Row],[Berko time2]])*3600+MINUTE(Halfmarathon[[#This Row],[Berko time2]])*60+SECOND(Halfmarathon[[#This Row],[Berko time2]]),99999)","v":99999},{"$f":"Hatime(Halfmarathon[[#This Row],[Berko Time]])","v":""},null,null,1,{"$f":"IFERROR(HOUR(Halfmarathon[St Albans time])*3600+MINUTE(Halfmarathon[St Albans time])*60+SECOND(Halfmarathon[St Albans time]),99999)","v":5259},{"$f":"IFERROR(VLOOKUP(Halfmarathon[[#This Row],[Mem]],STAPoints[[MEM]:[Points]],4,FALSE),0)","v":49},"01:27:39",null," ",{"$f":"IFERROR(HOUR(Halfmarathon[MK Half time])*3600+MINUTE(Halfmarathon[MK Half time])*60+SECOND(Halfmarathon[MK Half time]),99999)","v":99999},74,"01:24:37",{"$f":"IFERROR(HOUR(Halfmarathon[St Neots Half Time])*3600+MINUTE(Halfmarathon[St Neots Half Time])*60+SECOND(Halfmarathon[St Neots Half Time]),99999)","v":5077}]
[null,"Jamie Davies",{"$f":"VLOOKUP(B35,members,2,FALSE)","v":240},{"$f":"COUNT(Halfmarathon[[#This Row],[watfordplace]],Halfmarathon[[#This Row],[Silverstone Place]],Halfmarathon[[#This Row],[Berko Place]],Halfmarathon[[#This Row],[STA Place]],Halfmarathon[[#This Row],[St Neots Half  Place]])","v":2},"M",{"$f":"IFERROR(IF(Halfmarathon[[#This Row],[Gender]]=\"M\",50-(RANK(Halfmarathon[[#This Row],[GentsBestTime]],Halfmarathon[GentsBestTime],1))+1,50-(RANK(Halfmarathon[[#This Row],[Ladies Best Time]],Halfmarathon[Ladies Best Time],1))+1)+Halfmarathon[[#This Row],[St Albans Points]],Halfmarathon[[#This Row],[St Albans Points]])","v":65},{"$f":"IF(Halfmarathon[[#This Row],[Gender]]=\"M\",IF(SUM($I35,$N35,$R35,$AB35,Halfmarathon[[#This Row],[St Neots Seconds]])=499995,\"\",(MIN($I35,$N35,$R35,$AB35,Halfmarathon[[#This Row],[St Neots Seconds]]))/86400),\"\")","v":"01:55:33"},{"$f":"IF(Halfmarathon[[#This Row],[Gender]]=\"F\",IF(SUM($I35,$N35,$R35,$AB35,Halfmarathon[[#This Row],[St Neots Seconds]])=499995,\"\",(MIN($I35,$N35,$S35,$AB35,Halfmarathon[[#This Row],[St Neots Seconds]]))/86400),\"\")","v":""},{"$f":"IFERROR((HOUR(Halfmarathon[[#This Row],[Watchip]])*3600)+MINUTE(Halfmarathon[[#This Row],[Watchip]])*60+SECOND(Halfmarathon[[#This Row],[Watchip]]),99999)","v":99999},{"$f":"Hatime(Halfmarathon[[#This Row],[WatfordChip]])","v":""},null,null,null,{"$f":"IFERROR((HOUR(Halfmarathon[[#This Row],[Silverstonetime2]])*3600)+MINUTE(Halfmarathon[[#This Row],[Silverstonetime2]])*60+SECOND(Halfmarathon[[#This Row],[Silverstonetime2]]),99999)","v":99999},{"$f":"Hatime(Halfmarathon[[#This Row],[Silverstone Time]])","v":""},null,null,{"$f":"IFERROR(HOUR(Halfmarathon[[#This Row],[Berko time2]])*3600+MINUTE(Halfmarathon[[#This Row],[Berko time2]])*60+SECOND(Halfmarathon[[#This Row],[Berko time2]]),99999)","v":99999},{"$f":"Hatime(Halfmarathon[[#This Row],[Berko Time]])","v":""},null,null,1,{"$f":"IFERROR(HOUR(Halfmarathon[St Albans time])*3600+MINUTE(Halfmarathon[St Albans time])*60+SECOND(Halfmarathon[St Albans time]),99999)","v":7176},{"$f":"IFERROR(VLOOKUP(Halfmarathon[[#This Row],[Mem]],STAPoints[[MEM]:[Points]],4,FALSE),0)","v":38},"01:59:36",null," ",{"$f":"IFERROR(HOUR(Halfmarathon[MK Half time])*3600+MINUTE(Halfmarathon[MK Half time])*60+SECOND(Halfmarathon[MK Half time]),99999)","v":99999},619,"01:55:33",{"$f":"IFERROR(HOUR(Halfmarathon[St Neots Half Time])*3600+MINUTE(Halfmarathon[St Neots Half Time])*60+SECOND(Halfmarathon[St Neots Half Time]),99999)","v":6933}]
[null,"Julian Jones",{"$f":"VLOOKUP(B36,members,2,FALSE)","v":243},{"$f":"COUNT(Halfmarathon[[#This Row],[watfordplace]],Halfmarathon[[#This Row],[Silverstone Place]],Halfmarathon[[#This Row],[Berko Place]],Halfmarathon[[#This Row],[STA Place]],Halfmarathon[[#This Row],[St Neots Half  Place]])","v":1},"M",{"$f":"IFERROR(IF(Halfmarathon[[#This Row],[Gender]]=\"M\",50-(RANK(Halfmarathon[[#This Row],[GentsBestTime]],Halfmarathon[GentsBestTime],1))+1,50-(RANK(Halfmarathon[[#This Row],[Ladies Best Time]],Halfmarathon[Ladies Best Time],1))+1)+Halfmarathon[[#This Row],[St Albans Points]],Halfmarathon[[#This Row],[St Albans Points]])","v":44},{"$f":"IF(Halfmarathon[[#This Row],[Gender]]=\"M\",IF(SUM($I36,$N36,$R36,$AB36,Halfmarathon[[#This Row],[St Neots Seconds]])=499995,\"\",(MIN($I36,$N36,$R36,$AB36,Halfmarathon[[#This Row],[St Neots Seconds]]))/86400),\"\")","v":""},{"$f":"IF(Halfmarathon[[#This Row],[Gender]]=\"F\",IF(SUM($I36,$N36,$R36,$AB36,Halfmarathon[[#This Row],[St Neots Seconds]])=499995,\"\",(MIN($I36,$N36,$S36,$AB36,Halfmarathon[[#This Row],[St Neots Seconds]]))/86400),\"\")","v":""},{"$f":"IFERROR((HOUR(Halfmarathon[[#This Row],[Watchip]])*3600)+MINUTE(Halfmarathon[[#This Row],[Watchip]])*60+SECOND(Halfmarathon[[#This Row],[Watchip]]),99999)","v":99999},{"$f":"Hatime(Halfmarathon[[#This Row],[WatfordChip]])","v":""},null,null,null,{"$f":"IFERROR((HOUR(Halfmarathon[[#This Row],[Silverstonetime2]])*3600)+MINUTE(Halfmarathon[[#This Row],[Silverstonetime2]])*60+SECOND(Halfmarathon[[#This Row],[Silverstonetime2]]),99999)","v":99999},{"$f":"Hatime(Halfmarathon[[#This Row],[Silverstone Time]])","v":""},null,null,{"$f":"IFERROR(HOUR(Halfmarathon[[#This Row],[Berko time2]])*3600+MINUTE(Halfmarathon[[#This Row],[Berko time2]])*60+SECOND(Halfmarathon[[#This Row],[Berko time2]]),99999)","v":99999},{"$f":"Hatime(Halfmarathon[[#This Row],[Berko Time]])","v":""},null,null,1,{"$f":"IFERROR(HOUR(Halfmarathon[St Albans time])*3600+MINUTE(Halfmarathon[St Albans time])*60+SECOND(Halfmarathon[St Albans time]),99999)","v":6007},{"$f":"IFERROR(VLOOKUP(Halfmarathon[[#This Row],[Mem]],STAPoints[[MEM]:[Points]],4,FALSE),0)","v":44},"01:40:07",null," ",{"$f":"IFERROR(HOUR(Halfmarathon[MK Half time])*3600+MINUTE(Halfmarathon[MK Half time])*60+SECOND(Halfmarathon[MK Half time]),99999)","v":99999},null," ",{"$f":"IFERROR(HOUR(Halfmarathon[St Neots Half Time])*3600+MINUTE(Halfmarathon[St Neots Half Time])*60+SECOND(Halfmarathon[St Neots Half Time]),99999)","v":99999}]
[null,"John Mercer",{"$f":"VLOOKUP(Halfmarathon[[#This Row],[Name]],members,2,FALSE)","v":252},{"$f":"COUNT(Halfmarathon[[#This Row],[watfordplace]],Halfmarathon[[#This Row],[Silverstone Place]],Halfmarathon[[#This Row],[Berko Place]],Halfmarathon[[#This Row],[STA Place]],Halfmarathon[[#This Row],[St Neots Half  Place]])","v":2},"M",{"$f":"IFERROR(IF(Halfmarathon[[#This Row],[Gender]]=\"M\",50-(RANK(Halfmarathon[[#This Row],[GentsBestTime]],Halfmarathon[GentsBestTime],1))+1,50-(RANK(Halfmarathon[[#This Row],[Ladies Best Time]],Halfmarathon[Ladies Best Time],1))+1)+Halfmarathon[[#This Row],[St Albans Points]],Halfmarathon[[#This Row],[St Albans Points]])","v":68},{"$f":"IF(Halfmarathon[[#This Row],[Gender]]=\"M\",IF(SUM($I37,$N37,$R37,$AB37,Halfmarathon[[#This Row],[St Neots Seconds]])=499995,\"\",(MIN($I37,$N37,$R37,$AB37,Halfmarathon[[#This Row],[St Neots Seconds]]))/86400),\"\")","v":"01:48:58"},{"$f":"IF(Halfmarathon[[#This Row],[Gender]]=\"F\",IF(SUM($I37,$N37,$R37,$AB37,Halfmarathon[[#This Row],[St Neots Seconds]])=499995,\"\",(MIN($I37,$N37,$S37,$AB37,Halfmarathon[[#This Row],[St Neots Seconds]]))/86400),\"\")","v":""},{"$f":"IFERROR((HOUR(Halfmarathon[[#This Row],[Watchip]])*3600)+MINUTE(Halfmarathon[[#This Row],[Watchip]])*60+SECOND(Halfmarathon[[#This Row],[Watchip]]),99999)","v":99999},{"$f":"Hatime(Halfmarathon[[#This Row],[WatfordChip]])","v":""},null,null,null,{"$f":"IFERROR((HOUR(Halfmarathon[[#This Row],[Silverstonetime2]])*3600)+MINUTE(Halfmarathon[[#This Row],[Silverstonetime2]])*60+SECOND(Halfmarathon[[#This Row],[Silverstonetime2]]),99999)","v":99999},{"$f":"Hatime(Halfmarathon[[#This Row],[Silverstone Time]])","v":""},null,null,{"$f":"IFERROR(HOUR(Halfmarathon[[#This Row],[Berko time2]])*3600+MINUTE(Halfmarathon[[#This Row],[Berko time2]])*60+SECOND(Halfmarathon[[#This Row],[Berko time2]]),99999)","v":6538},{"$f":"Hatime(Halfmarathon[[#This Row],[Berko Time]])","v":"01:48:58"},419,"01:48:58",1,{"$f":"IFERROR(HOUR(Halfmarathon[St Albans time])*3600+MINUTE(Halfmarathon[St Albans time])*60+SECOND(Halfmarathon[St Albans time]),99999)","v":6221},{"$f":"IFERROR(VLOOKUP(Halfmarathon[[#This Row],[Mem]],STAPoints[[MEM]:[Points]],4,FALSE),0)","v":40},"01:43:41",359,"01:59:03",{"$f":"IFERROR(HOUR(Halfmarathon[MK Half time])*3600+MINUTE(Halfmarathon[MK Half time])*60+SECOND(Halfmarathon[MK Half time]),99999)","v":7143},null," ",{"$f":"IFERROR(HOUR(Halfmarathon[St Neots Half Time])*3600+MINUTE(Halfmarathon[St Neots Half Time])*60+SECOND(Halfmarathon[St Neots Half Time]),99999)","v":99999}]
[null,"Sarah Chilvers",{"$f":"VLOOKUP(B38,members,2,FALSE)","v":257},{"$f":"COUNT(Halfmarathon[[#This Row],[watfordplace]],Halfmarathon[[#This Row],[Silverstone Place]],Halfmarathon[[#This Row],[Berko Place]],Halfmarathon[[#This Row],[STA Place]],Halfmarathon[[#This Row],[St Neots Half  Place]])","v":2},"F",{"$f":"IFERROR(IF(Halfmarathon[[#This Row],[Gender]]=\"M\",50-(RANK(Halfmarathon[[#This Row],[GentsBestTime]],Halfmarathon[GentsBestTime],1))+1,50-(RANK(Halfmarathon[[#This Row],[Ladies Best Time]],Halfmarathon[Ladies Best Time],1))+1)+Halfmarathon[[#This Row],[St Albans Points]],Halfmarathon[[#This Row],[St Albans Points]])","v":92},{"$f":"IF(Halfmarathon[[#This Row],[Gender]]=\"M\",IF(SUM($I38,$N38,$R38,$AB38,Halfmarathon[[#This Row],[St Neots Seconds]])=499995,\"\",(MIN($I38,$N38,$R38,$AB38,Halfmarathon[[#This Row],[St Neots Seconds]]))/86400),\"\")","v":""},{"$f":"IF(Halfmarathon[[#This Row],[Gender]]=\"F\",IF(SUM($I38,$N38,$R38,$AB38,Halfmarathon[[#This Row],[St Neots Seconds]])=499995,\"\",(MIN($I38,$N38,$S38,$AB38,Halfmarathon[[#This Row],[St Neots Seconds]]))/86400),\"\")","v":"01:47:19"},{"$f":"IFERROR((HOUR(Halfmarathon[[#This Row],[Watchip]])*3600)+MINUTE(Halfmarathon[[#This Row],[Watchip]])*60+SECOND(Halfmarathon[[#This Row],[Watchip]]),99999)","v":99999},{"$f":"Hatime(Halfmarathon[[#This Row],[WatfordChip]])","v":""},null,null,null,{"$f":"IFERROR((HOUR(Halfmarathon[[#This Row],[Silverstonetime2]])*3600)+MINUTE(Halfmarathon[[#This Row],[Silverstonetime2]])*60+SECOND(Halfmarathon[[#This Row],[Silverstonetime2]]),99999)","v":99999},{"$f":"Hatime(Halfmarathon[[#This Row],[Silverstone Time]])","v":""},null,null,{"$f":"IFERROR(HOUR(Halfmarathon[[#This Row],[Berko time2]])*3600+MINUTE(Halfmarathon[[#This Row],[Berko time2]])*60+SECOND(Halfmarathon[[#This Row],[Berko time2]]),99999)","v":99999},{"$f":"Hatime(Halfmarathon[[#This Row],[Berko Time]])","v":""},null,null,1,{"$f":"IFERROR(HOUR(Halfmarathon[St Albans time])*3600+MINUTE(Halfmarathon[St Albans time])*60+SECOND(Halfmarathon[St Albans time]),99999)","v":9349},{"$f":"IFERROR(VLOOKUP(Halfmarathon[[#This Row],[Mem]],STAPoints[[MEM]:[Points]],4,FALSE),0)","v":46},"02:35:49",null," ",{"$f":"IFERROR(HOUR(Halfmarathon[MK Half time])*3600+MINUTE(Halfmarathon[MK Half time])*60+SECOND(Halfmarathon[MK Half time]),99999)","v":99999},482,"01:47:19",{"$f":"IFERROR(HOUR(Halfmarathon[St Neots Half Time])*3600+MINUTE(Halfmarathon[St Neots Half Time])*60+SECOND(Halfmarathon[St Neots Half Time]),99999)","v":6439}]
[null,"Robert Goldhawk",{"$f":"VLOOKUP(B39,members,2,FALSE)","v":258},{"$f":"COUNT(Halfmarathon[[#This Row],[watfordplace]],Halfmarathon[[#This Row],[Silverstone Place]],Halfmarathon[[#This Row],[Berko Place]],Halfmarathon[[#This Row],[STA Place]],Halfmarathon[[#This Row],[St Neots Half  Place]])","v":1},"M",{"$f":"IFERROR(IF(Halfmarathon[[#This Row],[Gender]]=\"M\",50-(RANK(Halfmarathon[[#This Row],[GentsBestTime]],Halfmarathon[GentsBestTime],1))+1,50-(RANK(Halfmarathon[[#This Row],[Ladies Best Time]],Halfmarathon[Ladies Best Time],1))+1)+Halfmarathon[[#This Row],[St Albans Points]],Halfmarathon[[#This Row],[St Albans Points]])","v":43},{"$f":"IF(Halfmarathon[[#This Row],[Gender]]=\"M\",IF(SUM($I39,$N39,$R39,$AB39,Halfmarathon[[#This Row],[St Neots Seconds]])=499995,\"\",(MIN($I39,$N39,$R39,$AB39,Halfmarathon[[#This Row],[St Neots Seconds]]))/86400),\"\")","v":""},{"$f":"IF(Halfmarathon[[#This Row],[Gender]]=\"F\",IF(SUM($I39,$N39,$R39,$AB39,Halfmarathon[[#This Row],[St Neots Seconds]])=499995,\"\",(MIN($I39,$N39,$S39,$AB39,Halfmarathon[[#This Row],[St Neots Seconds]]))/86400),\"\")","v":""},{"$f":"IFERROR((HOUR(Halfmarathon[[#This Row],[Watchip]])*3600)+MINUTE(Halfmarathon[[#This Row],[Watchip]])*60+SECOND(Halfmarathon[[#This Row],[Watchip]]),99999)","v":99999},{"$f":"Hatime(Halfmarathon[[#This Row],[WatfordChip]])","v":""},null,null,null,{"$f":"IFERROR((HOUR(Halfmarathon[[#This Row],[Silverstonetime2]])*3600)+MINUTE(Halfmarathon[[#This Row],[Silverstonetime2]])*60+SECOND(Halfmarathon[[#This Row],[Silverstonetime2]]),99999)","v":99999},{"$f":"Hatime(Halfmarathon[[#This Row],[Silverstone Time]])","v":""},null,null,{"$f":"IFERROR(HOUR(Halfmarathon[[#This Row],[Berko time2]])*3600+MINUTE(Halfmarathon[[#This Row],[Berko time2]])*60+SECOND(Halfmarathon[[#This Row],[Berko time2]]),99999)","v":99999},{"$f":"Hatime(Halfmarathon[[#This Row],[Berko Time]])","v":""},null,null,1,{"$f":"IFERROR(HOUR(Halfmarathon[St Albans time])*3600+MINUTE(Halfmarathon[St Albans time])*60+SECOND(Halfmarathon[St Albans time]),99999)","v":6128},{"$f":"IFERROR(VLOOKUP(Halfmarathon[[#This Row],[Mem]],STAPoints[[MEM]:[Points]],4,FALSE),0)","v":43},"01:42:08",null," ",{"$f":"IFERROR(HOUR(Halfmarathon[MK Half time])*3600+MINUTE(Halfmarathon[MK Half time])*60+SECOND(Halfmarathon[MK Half time]),99999)","v":99999},null," ",{"$f":"IFERROR(HOUR(Halfmarathon[St Neots Half Time])*3600+MINUTE(Halfmarathon[St Neots Half Time])*60+SECOND(Halfmarathon[St Neots Half Time]),99999)","v":99999}]
[null,"Jason W Smith",{"$f":"VLOOKUP(B40,members,2,FALSE)","v":263},{"$f":"COUNT(Halfmarathon[[#This Row],[watfordplace]],Halfmarathon[[#This Row],[Silverstone Place]],Halfmarathon[[#This Row],[Berko Place]],Halfmarathon[[#This Row],[STA Place]],Halfmarathon[[#This Row],[St Neots Half  Place]])","v":1},"M",{"$f":"IFERROR(IF(Halfmarathon[[#This Row],[Gender]]=\"M\",50-(RANK(Halfmarathon[[#This Row],[GentsBestTime]],Halfmarathon[GentsBestTime],1))+1,50-(RANK(Halfmarathon[[#This Row],[Ladies Best Time]],Halfmarathon[Ladies Best Time],1))+1)+Halfmarathon[[#This Row],[St Albans Points]],Halfmarathon[[#This Row],[St Albans Points]])","v":45},{"$f":"IF(Halfmarathon[[#This Row],[Gender]]=\"M\",IF(SUM($I40,$N40,$R40,$AB40,Halfmarathon[[#This Row],[St Neots Seconds]])=499995,\"\",(MIN($I40,$N40,$R40,$AB40,Halfmarathon[[#This Row],[St Neots Seconds]]))/86400),\"\")","v":""},{"$f":"IF(Halfmarathon[[#This Row],[Gender]]=\"F\",IF(SUM($I40,$N40,$R40,$AB40,Halfmarathon[[#This Row],[St Neots Seconds]])=499995,\"\",(MIN($I40,$N40,$S40,$AB40,Halfmarathon[[#This Row],[St Neots Seconds]]))/86400),\"\")","v":""},{"$f":"IFERROR((HOUR(Halfmarathon[[#This Row],[Watchip]])*3600)+MINUTE(Halfmarathon[[#This Row],[Watchip]])*60+SECOND(Halfmarathon[[#This Row],[Watchip]]),99999)","v":99999},{"$f":"Hatime(Halfmarathon[[#This Row],[WatfordChip]])","v":""},null,null,null,{"$f":"IFERROR((HOUR(Halfmarathon[[#This Row],[Silverstonetime2]])*3600)+MINUTE(Halfmarathon[[#This Row],[Silverstonetime2]])*60+SECOND(Halfmarathon[[#This Row],[Silverstonetime2]]),99999)","v":99999},{"$f":"Hatime(Halfmarathon[[#This Row],[Silverstone Time]])","v":""},null,null,{"$f":"IFERROR(HOUR(Halfmarathon[[#This Row],[Berko time2]])*3600+MINUTE(Halfmarathon[[#This Row],[Berko time2]])*60+SECOND(Halfmarathon[[#This Row],[Berko time2]]),99999)","v":99999},{"$f":"Hatime(Halfmarathon[[#This Row],[Berko Time]])","v":""},null,null,1,{"$f":"IFERROR(HOUR(Halfmarathon[St Albans time])*3600+MINUTE(Halfmarathon[St Albans time])*60+SECOND(Halfmarathon[St Albans time]),99999)","v":5970},{"$f":"IFERROR(VLOOKUP(Halfmarathon[[#This Row],[Mem]],STAPoints[[MEM]:[Points]],4,FALSE),0)","v":45},"01:39:30",null," ",{"$f":"IFERROR(HOUR(Halfmarathon[MK Half time])*3600+MINUTE(Halfmarathon[MK Half time])*60+SECOND(Halfmarathon[MK Half time]),99999)","v":99999},null," ",{"$f":"IFERROR(HOUR(Halfmarathon[St Neots Half Time])*3600+MINUTE(Halfmarathon[St Neots Half Time])*60+SECOND(Halfmarathon[St Neots Half Time]),99999)","v":99999}]
[null,"Patrick McGuinness",{"$f":"VLOOKUP(B41,members,2,FALSE)","v":269},{"$f":"COUNT(Halfmarathon[[#This Row],[watfordplace]],Halfmarathon[[#This Row],[Silverstone Place]],Halfmarathon[[#This Row],[Berko Place]],Halfmarathon[[#This Row],[STA Place]],Halfmarathon[[#This Row],[St Neots Half  Place]])","v":2},"M",{"$f":"IFERROR(IF(Halfmarathon[[#This Row],[Gender]]=\"M\",50-(RANK(Halfmarathon[[#This Row],[GentsBestTime]],Halfmarathon[GentsBestTime],1))+1,50-(RANK(Halfmarathon[[#This Row],[Ladies Best Time]],Halfmarathon[Ladies Best Time],1))+1)+Halfmarathon[[#This Row],[St Albans Points]],Halfmarathon[[#This Row],[St Albans Points]])","v":94},{"$f":"IF(Halfmarathon[[#This Row],[Gender]]=\"M\",IF(SUM($I41,$N41,$R41,$AB41,Halfmarathon[[#This Row],[St Neots Seconds]])=499995,\"\",(MIN($I41,$N41,$R41,$AB41,Halfmarathon[[#This Row],[St Neots Seconds]]))/86400),\"\")","v":"01:25:46"},{"$f":"IF(Halfmarathon[[#This Row],[Gender]]=\"F\",IF(SUM($I41,$N41,$R41,$AB41,Halfmarathon[[#This Row],[St Neots Seconds]])=499995,\"\",(MIN($I41,$N41,$S41,$AB41,Halfmarathon[[#This Row],[St Neots Seconds]]))/86400),\"\")","v":""},{"$f":"IFERROR((HOUR(Halfmarathon[[#This Row],[Watchip]])*3600)+MINUTE(Halfmarathon[[#This Row],[Watchip]])*60+SECOND(Halfmarathon[[#This Row],[Watchip]]),99999)","v":99999},{"$f":"Hatime(Halfmarathon[[#This Row],[WatfordChip]])","v":""},null,null,null,{"$f":"IFERROR((HOUR(Halfmarathon[[#This Row],[Silverstonetime2]])*3600)+MINUTE(Halfmarathon[[#This Row],[Silverstonetime2]])*60+SECOND(Halfmarathon[[#This Row],[Silverstonetime2]]),99999)","v":99999},{"$f":"Hatime(Halfmarathon[[#This Row],[Silverstone Time]])","v":""},null,null,{"$f":"IFERROR(HOUR(Halfmarathon[[#This Row],[Berko time2]])*3600+MINUTE(Halfmarathon[[#This Row],[Berko time2]])*60+SECOND(Halfmarathon[[#This Row],[Berko time2]]),99999)","v":99999},{"$f":"Hatime(Halfmarathon[[#This Row],[Berko Time]])","v":""},null,null,1,{"$f":"IFERROR(HOUR(Halfmarathon[St Albans time])*3600+MINUTE(Halfmarathon[St Albans time])*60+SECOND(Halfmarathon[St Albans time]),99999)","v":5463},{"$f":"IFERROR(VLOOKUP(Halfmarathon[[#This Row],[Mem]],STAPoints[[MEM]:[Points]],4,FALSE),0)","v":48},"01:31:03",78,"01:37:43",{"$f":"IFERROR(HOUR(Halfmarathon[MK Half time])*3600+MINUTE(Halfmarathon[MK Half time])*60+SECOND(Halfmarathon[MK Half time]),99999)","v":5863},84,"01:25:46",{"$f":"IFERROR(HOUR(Halfmarathon[St Neots Half Time])*3600+MINUTE(Halfmarathon[St Neots Half Time])*60+SECOND(Halfmarathon[St Neots Half Time]),99999)","v":5146}]
[null,"Jon STAGG",{"$f":"VLOOKUP(Halfmarathon[[#This Row],[Name]],members,2,FALSE)","v":273},{"$f":"COUNT(Halfmarathon[[#This Row],[watfordplace]],Halfmarathon[[#This Row],[Silverstone Place]],Halfmarathon[[#This Row],[Berko Place]],Halfmarathon[[#This Row],[STA Place]],Halfmarathon[[#This Row],[St Neots Half  Place]])","v":1},"M",{"$f":"IFERROR(IF(Halfmarathon[[#This Row],[Gender]]=\"M\",50-(RANK(Halfmarathon[[#This Row],[GentsBestTime]],Halfmarathon[GentsBestTime],1))+1,50-(RANK(Halfmarathon[[#This Row],[Ladies Best Time]],Halfmarathon[Ladies Best Time],1))+1)+Halfmarathon[[#This Row],[St Albans Points]],Halfmarathon[[#This Row],[St Albans Points]])","v":33},{"$f":"IF(Halfmarathon[[#This Row],[Gender]]=\"M\",IF(SUM($I42,$N42,$R42,$AB42,Halfmarathon[[#This Row],[St Neots Seconds]])=499995,\"\",(MIN($I42,$N42,$R42,$AB42,Halfmarathon[[#This Row],[St Neots Seconds]]))/86400),\"\")","v":"01:35:57"},{"$f":"IF(Halfmarathon[[#This Row],[Gender]]=\"F\",IF(SUM($I42,$N42,$R42,$AB42,Halfmarathon[[#This Row],[St Neots Seconds]])=499995,\"\",(MIN($I42,$N42,$S42,$AB42,Halfmarathon[[#This Row],[St Neots Seconds]]))/86400),\"\")","v":""},{"$f":"IFERROR((HOUR(Halfmarathon[[#This Row],[Watchip]])*3600)+MINUTE(Halfmarathon[[#This Row],[Watchip]])*60+SECOND(Halfmarathon[[#This Row],[Watchip]]),99999)","v":99999},{"$f":"Hatime(Halfmarathon[[#This Row],[WatfordChip]])","v":""},null,null,null,{"$f":"IFERROR((HOUR(Halfmarathon[[#This Row],[Silverstonetime2]])*3600)+MINUTE(Halfmarathon[[#This Row],[Silverstonetime2]])*60+SECOND(Halfmarathon[[#This Row],[Silverstonetime2]]),99999)","v":99999},{"$f":"Hatime(Halfmarathon[[#This Row],[Silverstone Time]])","v":""},null,null,{"$f":"IFERROR(HOUR(Halfmarathon[[#This Row],[Berko time2]])*3600+MINUTE(Halfmarathon[[#This Row],[Berko time2]])*60+SECOND(Halfmarathon[[#This Row],[Berko time2]]),99999)","v":99999},{"$f":"Hatime(Halfmarathon[[#This Row],[Berko Time]])","v":""},null,null,null,{"$f":"IFERROR(HOUR(Halfmarathon[St Albans time])*3600+MINUTE(Halfmarathon[St Albans time])*60+SECOND(Halfmarathon[St Albans time]),99999)","v":99999},{"$f":"IFERROR(VLOOKUP(Halfmarathon[[#This Row],[Mem]],STAPoints[[MEM]:[Points]],4,FALSE),0)","v":0}," ",null," ",{"$f":"IFERROR(HOUR(Halfmarathon[MK Half time])*3600+MINUTE(Halfmarathon[MK Half time])*60+SECOND(Halfmarathon[MK Half time]),99999)","v":99999},243,"01:35:57",{"$f":"IFERROR(HOUR(Halfmarathon[St Neots Half Time])*3600+MINUTE(Halfmarathon[St Neots Half Time])*60+SECOND(Halfmarathon[St Neots Half Time]),99999)","v":5757}]
[null,"Justin BUSBY",{"$f":"VLOOKUP(Halfmarathon[[#This Row],[Name]],members,2,FALSE)","v":292},{"$f":"COUNT(Halfmarathon[[#This Row],[watfordplace]],Halfmarathon[[#This Row],[Silverstone Place]],Halfmarathon[[#This Row],[Berko Place]],Halfmarathon[[#This Row],[STA Place]],Halfmarathon[[#This Row],[St Neots Half  Place]])","v":1},"M",{"$f":"IFERROR(IF(Halfmarathon[[#This Row],[Gender]]=\"M\",50-(RANK(Halfmarathon[[#This Row],[GentsBestTime]],Halfmarathon[GentsBestTime],1))+1,50-(RANK(Halfmarathon[[#This Row],[Ladies Best Time]],Halfmarathon[Ladies Best Time],1))+1)+Halfmarathon[[#This Row],[St Albans Points]],Halfmarathon[[#This Row],[St Albans Points]])","v":35},{"$f":"IF(Halfmarathon[[#This Row],[Gender]]=\"M\",IF(SUM($I43,$N43,$R43,$AB43,Halfmarathon[[#This Row],[St Neots Seconds]])=499995,\"\",(MIN($I43,$N43,$R43,$AB43,Halfmarathon[[#This Row],[St Neots Seconds]]))/86400),\"\")","v":"01:34:07"},{"$f":"IF(Halfmarathon[[#This Row],[Gender]]=\"F\",IF(SUM($I43,$N43,$R43,$AB43,Halfmarathon[[#This Row],[St Neots Seconds]])=499995,\"\",(MIN($I43,$N43,$S43,$AB43,Halfmarathon[[#This Row],[St Neots Seconds]]))/86400),\"\")","v":""},{"$f":"IFERROR((HOUR(Halfmarathon[[#This Row],[Watchip]])*3600)+MINUTE(Halfmarathon[[#This Row],[Watchip]])*60+SECOND(Halfmarathon[[#This Row],[Watchip]]),99999)","v":99999},{"$f":"Hatime(Halfmarathon[[#This Row],[WatfordChip]])","v":""},null,null,null,{"$f":"IFERROR((HOUR(Halfmarathon[[#This Row],[Silverstonetime2]])*3600)+MINUTE(Halfmarathon[[#This Row],[Silverstonetime2]])*60+SECOND(Halfmarathon[[#This Row],[Silverstonetime2]]),99999)","v":99999},{"$f":"Hatime(Halfmarathon[[#This Row],[Silverstone Time]])","v":""},null,null,{"$f":"IFERROR(HOUR(Halfmarathon[[#This Row],[Berko time2]])*3600+MINUTE(Halfmarathon[[#This Row],[Berko time2]])*60+SECOND(Halfmarathon[[#This Row],[Berko time2]]),99999)","v":99999},{"$f":"Hatime(Halfmarathon[[#This Row],[Berko Time]])","v":""},null,null,null,{"$f":"IFERROR(HOUR(Halfmarathon[St Albans time])*3600+MINUTE(Halfmarathon[St Albans time])*60+SECOND(Halfmarathon[St Albans time]),99999)","v":99999},{"$f":"IFERROR(VLOOKUP(Halfmarathon[[#This Row],[Mem]],STAPoints[[MEM]:[Points]],4,FALSE),0)","v":0}," ",null," ",{"$f":"IFERROR(HOUR(Halfmarathon[MK Half time])*3600+MINUTE(Halfmarathon[MK Half time])*60+SECOND(Halfmarathon[MK Half time]),99999)","v":99999},221,"01:34:07",{"$f":"IFERROR(HOUR(Halfmarathon[St Neots Half Time])*3600+MINUTE(Halfmarathon[St Neots Half Time])*60+SECOND(Halfmarathon[St Neots Half Time]),99999)","v":5647}]
[null,"Total",{"$f":"SUBTOTAL(103,Halfmarathon[Mem])","v":40},{"$f":"SUBTOTAL(104,Halfmarathon['# Eevnts])","v":4},{"$f":"SUBTOTAL(103,Halfmarathon[Gender])","v":40},null,null,null,null,null,null,null,null,null,null,null,null,null,null,null,null,null,null,null,null,null,null,null,{"$f":"SUBTOTAL(102,Halfmarathon[St Neots Half  Place])","v":20}]
[]
[]
[]
[]
[null,"St Albans "]
[]
[null,"Summary","MEM","Cat","Chip time","Points",null,null,null,null,null,null,null,null,null,null,null,null,null,null,null,null,null,null,null,null,null,null,null,null,null,null,null,"01:30:00"]
[null,"David Green",73,"M50","01:25:15",50,null,null,null,null,null,null,null,null,null,null,null,null,null,null,null,null,null,null,null,null,null,null,null,null,null,null,null,"01:24:37"]
[null,"Andy Jordan",239,"M50","01:27:39",49,null,null,null,null,null,null,null,null,null,null,null,null,null,null,null,null,null,null,null,null,null,null,null,null,null,null,null,"01:27:42"]
[null,"Patrick McGuinness",269,"MSEN","01:31:03",48,null,null,null,null,null,null,null,null,null,null,null,null,null,null,null,null,null,null,null,null,null,null,null,null,null,null,null,"01:21:13"]
[null,"Andrew Cripps",212,"M40","01:32:05",47,null,null,null,null,null,null,null,null,null,null,null,null,null,null,null,null,null,null,null,null,null,null,null,null,null,null,null,"01:42:57"]
[null,"James Bentall",141,"M40","01:36:32",46,null,null,null,null,null,null,null,null,null,null,null,null,null,null,null,null,null,null,null,null,null,null,null,null,null,null,null,"01:28:15"]
[null,"Jason Smith",263,"M","01:39:30",45,null,null,null,null,null,null,null,null,null,null,null,null,null,null,null,null,null,null,null,null,null,null,null,null,null,null,null,"02:02:10"]
[null,"Julian Jones",243,"M40","01:40:07",44,null,null,null,null,null,null,null,null,null,null,null,null,null,null,null,null,null,null,null,null,null,null,null,null,null,null,null,"01:44:18"]
[null,"Robert Goldhawk",258,"M40","01:42:08",43,null,null,null,null,null,null,null,null,null,null,null,null,null,null,null,null,null,null,null,null,null,null,null,null,null,null,null,"01:27:44"]
[null,"Paul Geary",187,"M40","01:43:07",42,null,null,null,null,null,null,null,null,null,null,null,null,null,null,null,null,null,null,null,null,null,null,null,null,null,null,null,"01:30:45"]
[null,"Chris Cottle",227,"MSEN","01:43:25",41,null,null,null,null,null,null,null,null,null,null,null,null,null,null,null,null,null,null,null,null,null,null,null,null,null,null,null,"01:55:33"]
[null,"John Mercer",252,"MSEN","01:43:41",40,null,null,null,null,null,null,null,null,null,null,null,null,null,null,null,null,null,null,null,null,null,null,null,null,null,null,null,"01:40:38"]
[null,"Louise Crosby",119,"F45","01:44:47",50,null,null,null,null,null,null,null,null,null,null,null,null,null,null,null,null,null,null,null,null,null,null,null,null,null,null,null,"01:35:57"]
[null,"Dawn Burr",140,"F35","01:45:32",49,null,null,null,null,null,null,null,null,null,null,null,null,null,null,null,null,null,null,null,null,null,null,null,null,null,null,null,"01:34:07"]
[null,"Emily Hooper",138,"F35","01:45:39",48,null,null,null,null,null,null,null,null,null,null,null,null,null,null,null,null,null,null,null,null,null,null,null,null,null,null,null,"01:40:16"]
[null,"Graham Harper",39,"M50","01:50:49",39,null,null,null,null,null,null,null,null,null,null,null,null,null,null,null,null,null,null,null,null,null,null,null,null,null,null,null,"01:25:46"]
[null,"Jamie Davies",240,"M","01:59:36",38,null,null,null,null,null,null,null,null,null,null,null,null,null,null,null,null,null,null,null,null,null,null,null,null,null,null,null,"01:33:37"]
[null,"Joanne Richards",149,"F35","02:00:31",47,null,null,null,null,null,null,null,null,null,null,null,null,null,null,null,null,null,null,null,null,null,null,null,null,null,null,null,"01:31:44"]
[null,"Sarah Chilvers",257,"F45","02:35:49",46,null,null,null,null,null,null,null,null,null,null,null,null,null,null,null,null,null,null,null,null,null,null,null,null,null,null,null,"01:47:19"]
[null,null,null,null,null,null,null,null,null,null,null,null,null,null,null,null,null,null,null,null,null,null,null,null,null,null,null,null,null,null,null,null,null,"01:29:23"]

{"sheet":"10 Miler Results","index":5,"n_rows":37,"n_cols":11,"rows_kept":37,"cut":false,"hidden":false,"merged":[]}
[null,"10 Mile races"]
[]
[]
[null,"Member","Name","Gender","Events","Points","Best time","WGC10 Place","WGC10 Time","Sandy Place","Sandy Time"]
[null,{"$f":"VLOOKUP(C5,members,2,FALSE)","v":12},"Georgie Hamilton","F",{"$f":"COUNT(Table18[[#This Row],[WGC10 Place]],Table18[[#This Row],[Sandy Place]])","v":1},38,"01:43:08",218,"01:43:08"]
[null,28,"Darren Mcgrath","M",{"$f":"COUNT(Table18[[#This Row],[WGC10 Place]],Table18[[#This Row],[Sandy Place]])","v":1},45,"01:08:53",19,"01:08:53"]
[null,32,"Michael Hessey","M",{"$f":"COUNT(Table18[[#This Row],[WGC10 Place]],Table18[[#This Row],[Sandy Place]])","v":1},39,"01:14:27",50,"01:14:27"]
[null,39,"Graham Harper","M",{"$f":"COUNT(Table18[[#This Row],[WGC10 Place]],Table18[[#This Row],[Sandy Place]])","v":1},37,"01:24:40",117,"01:24:40"]
[null,44,"Jillian Russell","F",{"$f":"COUNT(Table18[[#This Row],[WGC10 Place]],Table18[[#This Row],[Sandy Place]])","v":1},40,"01:38:40",203,"01:38:40"]
[null,51,"Annette Godfrey","F",{"$f":"COUNT(Table18[[#This Row],[WGC10 Place]],Table18[[#This Row],[Sandy Place]])","v":1},39,"01:38:40",202,"01:38:40"]
[null,54,"Hannah Turner","F",{"$f":"COUNT(Table18[[#This Row],[WGC10 Place]],Table18[[#This Row],[Sandy Place]])","v":1},50,"01:09:29",22,"01:09:29"]
[null,57,"Lee Scott","M",{"$f":"COUNT(Table18[[#This Row],[WGC10 Place]],Table18[[#This Row],[Sandy Place]])","v":1},48,"01:07:33",13,"01:07:33"]
[null,60,"Ian Smart","M",{"$f":"COUNT(Table18[[#This Row],[WGC10 Place]],Table18[[#This Row],[Sandy Place]])","v":1},40,"01:14:02",44,"01:14:02"]
[null,72,"Ron Chakraverty","M",{"$f":"COUNT(Table18[[#This Row],[WGC10 Place]],Table18[[#This Row],[Sandy Place]])","v":1},42,"01:13:24",40,"01:13:24"]
[null,74,"Camilla Davidson","F",{"$f":"COUNT(Table18[[#This Row],[WGC10 Place]],Table18[[#This Row],[Sandy Place]])","v":1},49,"01:10:15",27,"01:10:15"]
[null,77,"Sarah Dumbrill","F",{"$f":"COUNT(Table18[[#This Row],[WGC10 Place]],Table18[[#This Row],[Sandy Place]])","v":1},46,"01:21:44",95,"01:21:44"]
[null,97,"Jennifer Finlay","F",{"$f":"COUNT(Table18[[#This Row],[WGC10 Place]],Table18[[#This Row],[Sandy Place]])","v":1},48,"01:15:52",58,"01:15:52"]
[null,100,"Phil Jacobs","M",{"$f":"COUNT(Table18[[#This Row],[WGC10 Place]],Table18[[#This Row],[Sandy Place]])","v":1},50,"01:06:00",null,null,61,"01:06:00"]
[null,{"$f":"VLOOKUP(C19,members,2,FALSE)","v":107},"Andy Wilkins","M",{"$f":"COUNT(Table18[[#This Row],[WGC10 Place]],Table18[[#This Row],[Sandy Place]])","v":1},46,"01:08:23",17,"01:08:23"]
[null,119,"Louise Crosby","F",{"$f":"COUNT(Table18[[#This Row],[WGC10 Place]],Table18[[#This Row],[Sandy Place]])","v":1},45,"01:24:07",113,"01:24:07"]
[null,120,"Brian Yates","M",{"$f":"COUNT(Table18[[#This Row],[WGC10 Place]],Table18[[#This Row],[Sandy Place]])","v":1},33,"01:43:21",220,"01:43:21"]
[null,122,"Richard Johnstone","M",{"$f":"COUNT(Table18[[#This Row],[WGC10 Place]],Table18[[#This Row],[Sandy Place]])","v":1},41,"01:13:36",41,"01:13:36"]
[null,138,"Emily Hooper","F",{"$f":"COUNT(Table18[[#This Row],[WGC10 Place]],Table18[[#This Row],[Sandy Place]])","v":1},44,"01:25:18",124,"01:25:18"]
[null,149,"Joanne Richards","F",{"$f":"COUNT(Table18[[#This Row],[WGC10 Place]],Table18[[#This Row],[Sandy Place]])","v":2},42,"01:31:38",165,"01:31:38",372,"01:32:29"]
[null,185,"John Rowlands","M",{"$f":"COUNT(Table18[[#This Row],[WGC10 Place]],Table18[[#This Row],[Sandy Place]])","v":1},36,"01:26:34",130,"01:26:34"]
[null,212,"Andrew Cripps","M",{"$f":"COUNT(Table18[[#This Row],[WGC10 Place]],Table18[[#This Row],[Sandy Place]])","v":1},44,"01:10:34",29,"01:10:34"]
[null,228,"Vicki Moran","F",{"$f":"COUNT(Table18[[#This Row],[WGC10 Place]],Table18[[#This Row],[Sandy Place]])","v":1},37,"01:43:10",219,"01:43:10"]
[null,230,"Dee Bretnall","F",{"$f":"COUNT(Table18[[#This Row],[WGC10 Place]],Table18[[#This Row],[Sandy Place]])","v":1},43,"01:26:12",null,null,311,"01:26:12"]
[null,{"$f":"VLOOKUP(C29,members,2,FALSE)","v":231},"Edward Rhodes","M",{"$f":"COUNT(Table18[[#This Row],[WGC10 Place]],Table18[[#This Row],[Sandy Place]])","v":1},43,"01:11:52",34,"01:11:52"]
[null,238,"Chitra Dunn","M",{"$f":"COUNT(Table18[[#This Row],[WGC10 Place]],Table18[[#This Row],[Sandy Place]])","v":1},35,"01:27:23",140,"01:27:23"]
[null,239,"Andy Jordan","M",{"$f":"COUNT(Table18[[#This Row],[WGC10 Place]],Table18[[#This Row],[Sandy Place]])","v":1},49,"01:06:48",11,"01:06:48"]
[null,240,"Jamie Davies","M",{"$f":"COUNT(Table18[[#This Row],[WGC10 Place]],Table18[[#This Row],[Sandy Place]])","v":1},34,"01:34:41",187,"01:34:41"]
[null,243,"Julian Jones","M",{"$f":"COUNT(Table18[[#This Row],[WGC10 Place]],Table18[[#This Row],[Sandy Place]])","v":1},38,"01:15:57",59,"01:15:57"]
[null,257,"Sarah Chilvers","F",{"$f":"COUNT(Table18[[#This Row],[WGC10 Place]],Table18[[#This Row],[Sandy Place]])","v":1},41,"01:31:48",168,"01:31:48"]
[null,269,"Patrick Mcguinness","M",{"$f":"COUNT(Table18[[#This Row],[WGC10 Place]],Table18[[#This Row],[Sandy Place]])","v":1},47,"01:07:51",14,"01:07:51"]
[null,282,"Helen Macfarlane","F",{"$f":"COUNT(Table18[[#This Row],[WGC10 Place]],Table18[[#This Row],[Sandy Place]])","v":1},47,"01:21:25",92,"01:21:25"]
[null,"Total",{"$f":"SUBTOTAL(103,Table18[Name])","v":32},null,{"$f":"SUBTOTAL(104,Table18[Events])","v":2},null,null,null,{"$f":"SUBTOTAL(103,Table18[WGC10 Time])","v":30},null,{"$f":"SUBTOTAL(103,Table18[Sandy Time])","v":3}]

{"sheet":"10K races","index":6,"n_rows":76,"n_cols":11,"rows_kept":76,"cut":false,"hidden":false,"merged":[]}
[null,"10k Races"]
[]
[null,"Name","Member #","Total Points","Events","Gender","Wheato Chip Time","Wheato WAVA","Wheato Points","Herts 10K time","Herts 10K Points"]
[null,"Colin Wareham",1,{"$f":"tenK[[#This Row],[Wheato Points]]+tenK[[#This Row],[Herts 10K Points]]","v":35},{"$f":"COUNT(I4,K4)","v":1},"M","00:49:04",60.01,35,{"$f":"IF(VLOOKUP(tenK[[#This Row],[Member '#]],hertsk10results,3,FALSE)=0,\"\",VLOOKUP(tenK[[#This Row],[Member '#]],hertsk10results,3,FALSE))","v":""}]
[null,"Georgie Hamilton",12,{"$f":"tenK[[#This Row],[Wheato Points]]+tenK[[#This Row],[Herts 10K Points]]","v":79},2,"F","00:56:10",73.72,41,{"$f":"IF(VLOOKUP(tenK[[#This Row],[Member '#]],hertsk10results,3,FALSE)=0,\"\",VLOOKUP(tenK[[#This Row],[Member '#]],hertsk10results,3,FALSE))","v":"00:57:34"},38]
[null,"Laura Nathan",13,{"$f":"tenK[[#This Row],[Wheato Points]]+tenK[[#This Row],[Herts 10K Points]]","v":43},1,"F","00:54:30",55.22,43,{"$f":"IF(VLOOKUP(tenK[[#This Row],[Member '#]],hertsk10results,3,FALSE)=0,\"\",VLOOKUP(tenK[[#This Row],[Member '#]],hertsk10results,3,FALSE))","v":""}]
[null,"Graham Harper",39,{"$f":"tenK[[#This Row],[Wheato Points]]+tenK[[#This Row],[Herts 10K Points]]","v":33},1,"M","00:50:37",62.13,33,{"$f":"IF(VLOOKUP(tenK[[#This Row],[Member '#]],hertsk10results,3,FALSE)=0,\"\",VLOOKUP(tenK[[#This Row],[Member '#]],hertsk10results,3,FALSE))","v":""}]
[null,"Jillian Russell",44,{"$f":"tenK[[#This Row],[Wheato Points]]+tenK[[#This Row],[Herts 10K Points]]","v":42},1,"F",null,null,null,{"$f":"IF(VLOOKUP(tenK[[#This Row],[Member '#]],hertsk10results,3,FALSE)=0,\"\",VLOOKUP(tenK[[#This Row],[Member '#]],hertsk10results,3,FALSE))","v":"00:56:15"},42]
[null,"Annette Godfrey",51,{"$f":"tenK[[#This Row],[Wheato Points]]+tenK[[#This Row],[Herts 10K Points]]","v":43},1,"F",null,null,null,{"$f":"IF(VLOOKUP(tenK[[#This Row],[Member '#]],hertsk10results,3,FALSE)=0,\"\",VLOOKUP(tenK[[#This Row],[Member '#]],hertsk10results,3,FALSE))","v":"00:56:11"},43]
[null,"Simon Speirs",53,{"$f":"tenK[[#This Row],[Wheato Points]]+tenK[[#This Row],[Herts 10K Points]]","v":50},1,"M","00:37:45",75.95,50,{"$f":"IF(VLOOKUP(tenK[[#This Row],[Member '#]],hertsk10results,3,FALSE)=0,\"\",VLOOKUP(tenK[[#This Row],[Member '#]],hertsk10results,3,FALSE))","v":""}]
[null,"Hannah Turner",54,{"$f":"tenK[[#This Row],[Wheato Points]]+tenK[[#This Row],[Herts 10K Points]]","v":0},1,"F","00:00:00",0,0,{"$f":"IF(VLOOKUP(tenK[[#This Row],[Member '#]],hertsk10results,3,FALSE)=0,\"\",VLOOKUP(tenK[[#This Row],[Member '#]],hertsk10results,3,FALSE))","v":""}]
[null,"Lee Scott",57,{"$f":"tenK[[#This Row],[Wheato Points]]+tenK[[#This Row],[Herts 10K Points]]","v":95},2,"M","00:39:07",73.819999999999993,48,{"$f":"IF(VLOOKUP(tenK[[#This Row],[Member '#]],hertsk10results,3,FALSE)=0,\"\",VLOOKUP(tenK[[#This Row],[Member '#]],hertsk10results,3,FALSE))","v":"00:39:31"},47]
[null,"Ian Smart",60,{"$f":"tenK[[#This Row],[Wheato Points]]+tenK[[#This Row],[Herts 10K Points]]","v":32},1,"M",null,null,null,{"$f":"IF(VLOOKUP(tenK[[#This Row],[Member '#]],hertsk10results,3,FALSE)=0,\"\",VLOOKUP(tenK[[#This Row],[Member '#]],hertsk10results,3,FALSE))","v":"00:43:55"},32]
[null,"Ronjon Chakraverty",72,{"$f":"tenK[[#This Row],[Wheato Points]]+tenK[[#This Row],[Herts 10K Points]]","v":34},1,"M",null,null,null,{"$f":"IF(VLOOKUP(tenK[[#This Row],[Member '#]],hertsk10results,3,FALSE)=0,\"\",VLOOKUP(tenK[[#This Row],[Member '#]],hertsk10results,3,FALSE))","v":"00:43:00"},34]
[null,"David Green",73,{"$f":"tenK[[#This Row],[Wheato Points]]+tenK[[#This Row],[Herts 10K Points]]","v":99},2,"M","00:38:27",79.37,49,{"$f":"IF(VLOOKUP(tenK[[#This Row],[Member '#]],hertsk10results,3,FALSE)=0,\"\",VLOOKUP(tenK[[#This Row],[Member '#]],hertsk10results,3,FALSE))","v":"00:38:39"},50]
[null,"Camilla Davidson",74,{"$f":"tenK[[#This Row],[Wheato Points]]+tenK[[#This Row],[Herts 10K Points]]","v":50},1,"F","00:43:47",68.17,50,{"$f":"IF(VLOOKUP(tenK[[#This Row],[Member '#]],hertsk10results,3,FALSE)=0,\"\",VLOOKUP(tenK[[#This Row],[Member '#]],hertsk10results,3,FALSE))","v":""}]
[null,"Sarah Dumbrill",77,{"$f":"tenK[[#This Row],[Wheato Points]]+tenK[[#This Row],[Herts 10K Points]]","v":95},2,"F","00:48:20",61.6,47,{"$f":"IF(VLOOKUP(tenK[[#This Row],[Member '#]],hertsk10results,3,FALSE)=0,\"\",VLOOKUP(tenK[[#This Row],[Member '#]],hertsk10results,3,FALSE))","v":"00:45:49"},48]
[null,"Norman Whitwood",93,{"$f":"tenK[[#This Row],[Wheato Points]]+tenK[[#This Row],[Herts 10K Points]]","v":17},1,"M",null,null,null,{"$f":"IF(VLOOKUP(tenK[[#This Row],[Member '#]],hertsk10results,3,FALSE)=0,\"\",VLOOKUP(tenK[[#This Row],[Member '#]],hertsk10results,3,FALSE))","v":"01:07:04"},17]
[null,"Nigel Marsden",96,{"$f":"tenK[[#This Row],[Wheato Points]]+tenK[[#This Row],[Herts 10K Points]]","v":31},1,"M","00:51:45",53.83,31,{"$f":"IF(VLOOKUP(tenK[[#This Row],[Member '#]],hertsk10results,3,FALSE)=0,\"\",VLOOKUP(tenK[[#This Row],[Member '#]],hertsk10results,3,FALSE))","v":""}]
[null,"Jennifer Finlay",97,{"$f":"tenK[[#This Row],[Wheato Points]]+tenK[[#This Row],[Herts 10K Points]]","v":49},1,"F",null,null,null,{"$f":"IF(VLOOKUP(tenK[[#This Row],[Member '#]],hertsk10results,3,FALSE)=0,\"\",VLOOKUP(tenK[[#This Row],[Member '#]],hertsk10results,3,FALSE))","v":"00:45:15"},49]
[null,"Phil Jacobs",100,{"$f":"tenK[[#This Row],[Wheato Points]]+tenK[[#This Row],[Herts 10K Points]]","v":43},1,"M","00:42:05",67.510000000000005,43,{"$f":"IF(VLOOKUP(tenK[[#This Row],[Member '#]],hertsk10results,3,FALSE)=0,\"\",VLOOKUP(tenK[[#This Row],[Member '#]],hertsk10results,3,FALSE))","v":""}]
[null,"Andy Wilkins",107,{"$f":"tenK[[#This Row],[Wheato Points]]+tenK[[#This Row],[Herts 10K Points]]","v":84},2,"M","00:41:39",67.72,44,{"$f":"IF(VLOOKUP(tenK[[#This Row],[Member '#]],hertsk10results,3,FALSE)=0,\"\",VLOOKUP(tenK[[#This Row],[Member '#]],hertsk10results,3,FALSE))","v":"00:41:43"},40]
[null,"Elliott Lamb",110,{"$f":"tenK[[#This Row],[Wheato Points]]+tenK[[#This Row],[Herts 10K Points]]","v":79},2,"M","00:42:17",71.45,41,{"$f":"IF(VLOOKUP(tenK[[#This Row],[Member '#]],hertsk10results,3,FALSE)=0,\"\",VLOOKUP(tenK[[#This Row],[Member '#]],hertsk10results,3,FALSE))","v":"00:41:45"},38]
[null,"Stephanie Heard",113,{"$f":"tenK[[#This Row],[Wheato Points]]+tenK[[#This Row],[Herts 10K Points]]","v":40},1,"F","00:57:25",51.23,40,{"$f":"IF(VLOOKUP(tenK[[#This Row],[Member '#]],hertsk10results,3,FALSE)=0,\"\",VLOOKUP(tenK[[#This Row],[Member '#]],hertsk10results,3,FALSE))","v":""}]
[null,"Craig Harper",114,{"$f":"tenK[[#This Row],[Wheato Points]]+tenK[[#This Row],[Herts 10K Points]]","v":42},1,"M",null,null,null,{"$f":"IF(VLOOKUP(tenK[[#This Row],[Member '#]],hertsk10results,3,FALSE)=0,\"\",VLOOKUP(tenK[[#This Row],[Member '#]],hertsk10results,3,FALSE))","v":"00:41:11"},42]
[null,"Louise Crosby",119,{"$f":"tenK[[#This Row],[Wheato Points]]+tenK[[#This Row],[Herts 10K Points]]","v":46},1,"F","00:48:23",72.06,46,{"$f":"IF(VLOOKUP(tenK[[#This Row],[Member '#]],hertsk10results,3,FALSE)=0,\"\",VLOOKUP(tenK[[#This Row],[Member '#]],hertsk10results,3,FALSE))","v":""}]
[null,"Richard Johnstone",122,{"$f":"tenK[[#This Row],[Wheato Points]]+tenK[[#This Row],[Herts 10K Points]]","v":35},1,"M",null,null,null,{"$f":"IF(VLOOKUP(tenK[[#This Row],[Member '#]],hertsk10results,3,FALSE)=0,\"\",VLOOKUP(tenK[[#This Row],[Member '#]],hertsk10results,3,FALSE))","v":"00:42:15"},35]
[null,"Tina Pidgeon",123,{"$f":"tenK[[#This Row],[Wheato Points]]+tenK[[#This Row],[Herts 10K Points]]","v":35},1,"F","01:06:10",44.25,35,{"$f":"IF(VLOOKUP(tenK[[#This Row],[Member '#]],hertsk10results,3,FALSE)=0,\"\",VLOOKUP(tenK[[#This Row],[Member '#]],hertsk10results,3,FALSE))","v":""}]
[null,"Colette Pidgeon",124,{"$f":"tenK[[#This Row],[Wheato Points]]+tenK[[#This Row],[Herts 10K Points]]","v":37},1,"F","01:00:17",49.75,37,{"$f":"IF(VLOOKUP(tenK[[#This Row],[Member '#]],hertsk10results,3,FALSE)=0,\"\",VLOOKUP(tenK[[#This Row],[Member '#]],hertsk10results,3,FALSE))","v":""}]
[null,"Emily Hooper",138,{"$f":"tenK[[#This Row],[Wheato Points]]+tenK[[#This Row],[Herts 10K Points]]","v":95},2,"F","00:47:48",62.49,48,{"$f":"IF(VLOOKUP(tenK[[#This Row],[Member '#]],hertsk10results,3,FALSE)=0,\"\",VLOOKUP(tenK[[#This Row],[Member '#]],hertsk10results,3,FALSE))","v":"00:46:18"},47]
[null,"Dawn Burr",140,{"$f":"tenK[[#This Row],[Wheato Points]]+tenK[[#This Row],[Herts 10K Points]]","v":46},1,"F",null,null,null,{"$f":"IF(VLOOKUP(tenK[[#This Row],[Member '#]],hertsk10results,3,FALSE)=0,\"\",VLOOKUP(tenK[[#This Row],[Member '#]],hertsk10results,3,FALSE))","v":"00:46:57"},46]
[null,"James Bentall",141,{"$f":"tenK[[#This Row],[Wheato Points]]+tenK[[#This Row],[Herts 10K Points]]","v":66},2,"M","00:45:02",63.53,38,{"$f":"IF(VLOOKUP(tenK[[#This Row],[Member '#]],hertsk10results,3,FALSE)=0,\"\",VLOOKUP(tenK[[#This Row],[Member '#]],hertsk10results,3,FALSE))","v":"00:45:07"},28]
[null,"Johanna Wood",143,{"$f":"tenK[[#This Row],[Wheato Points]]+tenK[[#This Row],[Herts 10K Points]]","v":41},1,"F",null,null,null,{"$f":"IF(VLOOKUP(tenK[[#This Row],[Member '#]],hertsk10results,3,FALSE)=0,\"\",VLOOKUP(tenK[[#This Row],[Member '#]],hertsk10results,3,FALSE))","v":"00:56:27"},41]
[null,"Joanne Richards",149,{"$f":"tenK[[#This Row],[Wheato Points]]+tenK[[#This Row],[Herts 10K Points]]","v":87},2,"F","00:55:04",57.39,42,{"$f":"IF(VLOOKUP(tenK[[#This Row],[Member '#]],hertsk10results,3,FALSE)=0,\"\",VLOOKUP(tenK[[#This Row],[Member '#]],hertsk10results,3,FALSE))","v":"00:51:45"},45]
[null,"Susan Smith",176,{"$f":"tenK[[#This Row],[Wheato Points]]+tenK[[#This Row],[Herts 10K Points]]","v":39},1,"F","00:58:00",58.87,39,{"$f":"IF(VLOOKUP(tenK[[#This Row],[Member '#]],hertsk10results,3,FALSE)=0,\"\",VLOOKUP(tenK[[#This Row],[Member '#]],hertsk10results,3,FALSE))","v":""}]
[null,"John Rowlands",185,{"$f":"tenK[[#This Row],[Wheato Points]]+tenK[[#This Row],[Herts 10K Points]]","v":30},{"$f":"COUNT(I36,K36)","v":1},"M","00:53:40",60.41,30,{"$f":"IF(VLOOKUP(tenK[[#This Row],[Member '#]],hertsk10results,3,FALSE)=0,\"\",VLOOKUP(tenK[[#This Row],[Member '#]],hertsk10results,3,FALSE))","v":""}]
[null,"Paul Geary",187,{"$f":"tenK[[#This Row],[Wheato Points]]+tenK[[#This Row],[Herts 10K Points]]","v":63},2,"M","00:48:33",58.58,36,{"$f":"IF(VLOOKUP(tenK[[#This Row],[Member '#]],hertsk10results,3,FALSE)=0,\"\",VLOOKUP(tenK[[#This Row],[Member '#]],hertsk10results,3,FALSE))","v":"00:45:55"},27]
[null,"Paul Brewster",194,{"$f":"tenK[[#This Row],[Wheato Points]]+tenK[[#This Row],[Herts 10K Points]]","v":55},2,"M","00:49:44",62.26,34,{"$f":"IF(VLOOKUP(tenK[[#This Row],[Member '#]],hertsk10results,3,FALSE)=0,\"\",VLOOKUP(tenK[[#This Row],[Member '#]],hertsk10results,3,FALSE))","v":"00:50:21"},21]
[null,"Sarah Thomas",201,{"$f":"tenK[[#This Row],[Wheato Points]]+tenK[[#This Row],[Herts 10K Points]]","v":36},1,"F","01:06:14",44.27,36,{"$f":"IF(VLOOKUP(tenK[[#This Row],[Member '#]],hertsk10results,3,FALSE)=0,\"\",VLOOKUP(tenK[[#This Row],[Member '#]],hertsk10results,3,FALSE))","v":""}]
[null,"Helen Pearson",205,{"$f":"tenK[[#This Row],[Wheato Points]]+tenK[[#This Row],[Herts 10K Points]]","v":38},1,"F","00:58:23",54.61,38,{"$f":"IF(VLOOKUP(tenK[[#This Row],[Member '#]],hertsk10results,3,FALSE)=0,\"\",VLOOKUP(tenK[[#This Row],[Member '#]],hertsk10results,3,FALSE))","v":""}]
[null,"Simon Townsend",208,{"$f":"tenK[[#This Row],[Wheato Points]]+tenK[[#This Row],[Herts 10K Points]]","v":37},1,"M","00:47:18",61.39,37,{"$f":"IF(VLOOKUP(tenK[[#This Row],[Member '#]],hertsk10results,3,FALSE)=0,\"\",VLOOKUP(tenK[[#This Row],[Member '#]],hertsk10results,3,FALSE))","v":""}]
[null,"Andrew Cripps",212,{"$f":"tenK[[#This Row],[Wheato Points]]+tenK[[#This Row],[Herts 10K Points]]","v":84},2,"M","00:41:12",69.95,45,{"$f":"IF(VLOOKUP(tenK[[#This Row],[Member '#]],hertsk10results,3,FALSE)=0,\"\",VLOOKUP(tenK[[#This Row],[Member '#]],hertsk10results,3,FALSE))","v":"00:41:45"},39]
[null,"David Moritz",214,{"$f":"tenK[[#This Row],[Wheato Points]]+tenK[[#This Row],[Herts 10K Points]]","v":43},1,"M",null,null,null,{"$f":"IF(VLOOKUP(tenK[[#This Row],[Member '#]],hertsk10results,3,FALSE)=0,\"\",VLOOKUP(tenK[[#This Row],[Member '#]],hertsk10results,3,FALSE))","v":"00:40:58"},43]
[null,"Paul Goodwin",222,{"$f":"tenK[[#This Row],[Wheato Points]]+tenK[[#This Row],[Herts 10K Points]]","v":46},1,"M",null,null,null,{"$f":"IF(VLOOKUP(tenK[[#This Row],[Member '#]],hertsk10results,3,FALSE)=0,\"\",VLOOKUP(tenK[[#This Row],[Member '#]],hertsk10results,3,FALSE))","v":"00:39:39"},46]
[null,"Steve Bowran",223,{"$f":"tenK[[#This Row],[Wheato Points]]+tenK[[#This Row],[Herts 10K Points]]","v":18},1,"M",null,null,null,{"$f":"IF(VLOOKUP(tenK[[#This Row],[Member '#]],hertsk10results,3,FALSE)=0,\"\",VLOOKUP(tenK[[#This Row],[Member '#]],hertsk10results,3,FALSE))","v":"01:01:21"},18]
[null,"Jennifer Cunniff",225,{"$f":"tenK[[#This Row],[Wheato Points]]+tenK[[#This Row],[Herts 10K Points]]","v":45},1,"F","00:51:43",57.44,45,{"$f":"IF(VLOOKUP(tenK[[#This Row],[Member '#]],hertsk10results,3,FALSE)=0,\"\",VLOOKUP(tenK[[#This Row],[Member '#]],hertsk10results,3,FALSE))","v":""}]
[null,"Vicki Moran",228,{"$f":"tenK[[#This Row],[Wheato Points]]+tenK[[#This Row],[Herts 10K Points]]","v":39},1,"F",null,null,null,{"$f":"IF(VLOOKUP(tenK[[#This Row],[Member '#]],hertsk10results,3,FALSE)=0,\"\",VLOOKUP(tenK[[#This Row],[Member '#]],hertsk10results,3,FALSE))","v":"00:57:30"},39]
[null,"Ed Rhodes",231,{"$f":"tenK[[#This Row],[Wheato Points]]+tenK[[#This Row],[Herts 10K Points]]","v":37},1,"M",null,null,null,{"$f":"IF(VLOOKUP(tenK[[#This Row],[Member '#]],hertsk10results,3,FALSE)=0,\"\",VLOOKUP(tenK[[#This Row],[Member '#]],hertsk10results,3,FALSE))","v":"00:41:52"},37]
[null,"Catriona Davis",234,{"$f":"tenK[[#This Row],[Wheato Points]]+tenK[[#This Row],[Herts 10K Points]]","v":50},1,"F",null,null,null,{"$f":"IF(VLOOKUP(tenK[[#This Row],[Member '#]],hertsk10results,3,FALSE)=0,\"\",VLOOKUP(tenK[[#This Row],[Member '#]],hertsk10results,3,FALSE))","v":"00:44:21"},50]
[null,"Adrian James",236,{"$f":"tenK[[#This Row],[Wheato Points]]+tenK[[#This Row],[Herts 10K Points]]","v":44},1,"M",null,null,null,{"$f":"IF(VLOOKUP(tenK[[#This Row],[Member '#]],hertsk10results,3,FALSE)=0,\"\",VLOOKUP(tenK[[#This Row],[Member '#]],hertsk10results,3,FALSE))","v":"00:40:22"},44]
[null,"Andrew Hazley-Payne",237,{"$f":"tenK[[#This Row],[Wheato Points]]+tenK[[#This Row],[Herts 10K Points]]","v":33},1,"M",null,null,null,{"$f":"IF(VLOOKUP(tenK[[#This Row],[Member '#]],hertsk10results,3,FALSE)=0,\"\",VLOOKUP(tenK[[#This Row],[Member '#]],hertsk10results,3,FALSE))","v":"00:43:43"},33]
[null,"Chitra Dunn",238,{"$f":"tenK[[#This Row],[Wheato Points]]+tenK[[#This Row],[Herts 10K Points]]","v":49},2,"M","00:54:36",56,29,{"$f":"IF(VLOOKUP(tenK[[#This Row],[Member '#]],hertsk10results,3,FALSE)=0,\"\",VLOOKUP(tenK[[#This Row],[Member '#]],hertsk10results,3,FALSE))","v":"00:51:18"},20]
[null,"Andy Jordan",239,{"$f":"tenK[[#This Row],[Wheato Points]]+tenK[[#This Row],[Herts 10K Points]]","v":94},2,"M","00:40:42",73.13,46,{"$f":"IF(VLOOKUP(tenK[[#This Row],[Member '#]],hertsk10results,3,FALSE)=0,\"\",VLOOKUP(tenK[[#This Row],[Member '#]],hertsk10results,3,FALSE))","v":"00:39:05"},48]
[null,"Jamie Davies",240,{"$f":"tenK[[#This Row],[Wheato Points]]+tenK[[#This Row],[Herts 10K Points]]","v":49},2,"M","00:57:39",46.53,27,{"$f":"IF(VLOOKUP(tenK[[#This Row],[Member '#]],hertsk10results,3,FALSE)=0,\"\",VLOOKUP(tenK[[#This Row],[Member '#]],hertsk10results,3,FALSE))","v":"00:49:53"},22]
[null,"Julian Jones",243,{"$f":"tenK[[#This Row],[Wheato Points]]+tenK[[#This Row],[Herts 10K Points]]","v":42},1,"M","00:42:08",66.06,42,{"$f":"IF(VLOOKUP(tenK[[#This Row],[Member '#]],hertsk10results,3,FALSE)=0,\"\",VLOOKUP(tenK[[#This Row],[Member '#]],hertsk10results,3,FALSE))","v":""}]
[null,"Fiona Price",248,{"$f":"tenK[[#This Row],[Wheato Points]]+tenK[[#This Row],[Herts 10K Points]]","v":88},2,"F","00:53:54",54.74,44,{"$f":"IF(VLOOKUP(tenK[[#This Row],[Member '#]],hertsk10results,3,FALSE)=0,\"\",VLOOKUP(tenK[[#This Row],[Member '#]],hertsk10results,3,FALSE))","v":"00:52:10"},44]
[null,"John Mercer",252,{"$f":"tenK[[#This Row],[Wheato Points]]+tenK[[#This Row],[Herts 10K Points]]","v":32},1,"M","00:50:49",60.57,32,{"$f":"IF(VLOOKUP(tenK[[#This Row],[Member '#]],hertsk10results,3,FALSE)=0,\"\",VLOOKUP(tenK[[#This Row],[Member '#]],hertsk10results,3,FALSE))","v":""}]
[null,"Alison Cole",256,{"$f":"tenK[[#This Row],[Wheato Points]]+tenK[[#This Row],[Herts 10K Points]]","v":49},1,"F","00:45:50",66.33,49,{"$f":"IF(VLOOKUP(tenK[[#This Row],[Member '#]],hertsk10results,3,FALSE)=0,\"\",VLOOKUP(tenK[[#This Row],[Member '#]],hertsk10results,3,FALSE))","v":""}]
[null,"Robert Goldhawk",258,{"$f":"tenK[[#This Row],[Wheato Points]]+tenK[[#This Row],[Herts 10K Points]]","v":23},1,"M",null,null,null,{"$f":"IF(VLOOKUP(tenK[[#This Row],[Member '#]],hertsk10results,3,FALSE)=0,\"\",VLOOKUP(tenK[[#This Row],[Member '#]],hertsk10results,3,FALSE))","v":"00:47:45"},23]
[null,"Ben Sweeting",260,{"$f":"tenK[[#This Row],[Wheato Points]]+tenK[[#This Row],[Herts 10K Points]]","v":29},1,"M",null,null,null,{"$f":"IF(VLOOKUP(tenK[[#This Row],[Member '#]],hertsk10results,3,FALSE)=0,\"\",VLOOKUP(tenK[[#This Row],[Member '#]],hertsk10results,3,FALSE))","v":"00:44:51"},29]
[null,"Gordon Alexander",262,{"$f":"tenK[[#This Row],[Wheato Points]]+tenK[[#This Row],[Herts 10K Points]]","v":41},1,"M",null,null,null,{"$f":"IF(VLOOKUP(tenK[[#This Row],[Member '#]],hertsk10results,3,FALSE)=0,\"\",VLOOKUP(tenK[[#This Row],[Member '#]],hertsk10results,3,FALSE))","v":"00:41:30"},41]
[null,"Jason W Smith",263,{"$f":"tenK[[#This Row],[Wheato Points]]+tenK[[#This Row],[Herts 10K Points]]","v":30},1,"M",null,null,null,{"$f":"IF(VLOOKUP(tenK[[#This Row],[Member '#]],hertsk10results,3,FALSE)=0,\"\",VLOOKUP(tenK[[#This Row],[Member '#]],hertsk10results,3,FALSE))","v":"00:44:45"},30]
[null,"Patrick McGuinness",269,{"$f":"tenK[[#This Row],[Wheato Points]]+tenK[[#This Row],[Herts 10K Points]]","v":40},1,"M","00:43:14",67.63,40,{"$f":"IF(VLOOKUP(tenK[[#This Row],[Member '#]],hertsk10results,3,FALSE)=0,\"\",VLOOKUP(tenK[[#This Row],[Member '#]],hertsk10results,3,FALSE))","v":""}]
[null,"Jon Stagg",273,{"$f":"tenK[[#This Row],[Wheato Points]]+tenK[[#This Row],[Herts 10K Points]]","v":31},1,"M",null,null,null,{"$f":"IF(VLOOKUP(tenK[[#This Row],[Member '#]],hertsk10results,3,FALSE)=0,\"\",VLOOKUP(tenK[[#This Row],[Member '#]],hertsk10results,3,FALSE))","v":"00:44:18"},31]
[null,"Victoria Johns",275,{"$f":"tenK[[#This Row],[Wheato Points]]+tenK[[#This Row],[Herts 10K Points]]","v":40},1,"F",null,null,null,{"$f":"IF(VLOOKUP(tenK[[#This Row],[Member '#]],hertsk10results,3,FALSE)=0,\"\",VLOOKUP(tenK[[#This Row],[Member '#]],hertsk10results,3,FALSE))","v":"00:56:27"},40]
[null,"Jonathan Budge",279,{"$f":"tenK[[#This Row],[Wheato Points]]+tenK[[#This Row],[Herts 10K Points]]","v":39},1,"M","00:44:52",59.96,39,{"$f":"IF(VLOOKUP(tenK[[#This Row],[Member '#]],hertsk10results,3,FALSE)=0,\"\",VLOOKUP(tenK[[#This Row],[Member '#]],hertsk10results,3,FALSE))","v":""}]
[null,"Thomas Hallam",280,{"$f":"tenK[[#This Row],[Wheato Points]]+tenK[[#This Row],[Herts 10K Points]]","v":47},1,"M","00:39:49",68.010000000000005,47,{"$f":"IF(VLOOKUP(tenK[[#This Row],[Member '#]],hertsk10results,3,FALSE)=0,\"\",VLOOKUP(tenK[[#This Row],[Member '#]],hertsk10results,3,FALSE))","v":""}]
[null,"Richard Moreton",283,{"$f":"tenK[[#This Row],[Wheato Points]]+tenK[[#This Row],[Herts 10K Points]]","v":25},{"$f":"COUNT(I68,K68)","v":1},"M",null,null,null,{"$f":"IF(VLOOKUP(tenK[[#This Row],[Member '#]],hertsk10results,3,FALSE)=0,\"\",VLOOKUP(tenK[[#This Row],[Member '#]],hertsk10results,3,FALSE))","v":"00:47:13"},25]
[null,"Philip Wigg",285,{"$f":"tenK[[#This Row],[Wheato Points]]+tenK[[#This Row],[Herts 10K Points]]","v":28},1,"M","00:56:06",47.17,28,{"$f":"IF(VLOOKUP(tenK[[#This Row],[Member '#]],hertsk10results,3,FALSE)=0,\"\",VLOOKUP(tenK[[#This Row],[Member '#]],hertsk10results,3,FALSE))","v":""}]
[null,"Paul Hill",287,{"$f":"tenK[[#This Row],[Wheato Points]]+tenK[[#This Row],[Herts 10K Points]]","v":24},1,"M",null,null,null,{"$f":"IF(VLOOKUP(tenK[[#This Row],[Member '#]],hertsk10results,3,FALSE)=0,\"\",VLOOKUP(tenK[[#This Row],[Member '#]],hertsk10results,3,FALSE))","v":"00:47:40"},24]
[null,"Gordon Ray",289,{"$f":"tenK[[#This Row],[Wheato Points]]+tenK[[#This Row],[Herts 10K Points]]","v":26},1,"M",null,null,null,{"$f":"IF(VLOOKUP(tenK[[#This Row],[Member '#]],hertsk10results,3,FALSE)=0,\"\",VLOOKUP(tenK[[#This Row],[Member '#]],hertsk10results,3,FALSE))","v":"00:46:04"},26]
[null,"Justin Busby",292,{"$f":"tenK[[#This Row],[Wheato Points]]+tenK[[#This Row],[Herts 10K Points]]","v":36},1,"M",null,null,null,{"$f":"IF(VLOOKUP(tenK[[#This Row],[Member '#]],hertsk10results,3,FALSE)=0,\"\",VLOOKUP(tenK[[#This Row],[Member '#]],hertsk10results,3,FALSE))","v":"00:41:59"},36]
[null,"Tom Flett",293,{"$f":"tenK[[#This Row],[Wheato Points]]+tenK[[#This Row],[Herts 10K Points]]","v":19},1,"M",null,null,null,{"$f":"IF(VLOOKUP(tenK[[#This Row],[Member '#]],hertsk10results,3,FALSE)=0,\"\",VLOOKUP(tenK[[#This Row],[Member '#]],hertsk10results,3,FALSE))","v":"00:54:51"},19]
[null,"James Chasen",294,{"$f":"tenK[[#This Row],[Wheato Points]]+tenK[[#This Row],[Herts 10K Points]]","v":49},1,"M",null,null,null,{"$f":"IF(VLOOKUP(tenK[[#This Row],[Member '#]],hertsk10results,3,FALSE)=0,\"\",VLOOKUP(tenK[[#This Row],[Member '#]],hertsk10results,3,FALSE))","v":"00:38:59"},49]
[null,"Iain Tucker",302,{"$f":"tenK[[#This Row],[Wheato Points]]+tenK[[#This Row],[Herts 10K Points]]","v":45},1,"M",null,null,null,{"$f":"IF(VLOOKUP(tenK[[#This Row],[Member '#]],hertsk10results,3,FALSE)=0,\"\",VLOOKUP(tenK[[#This Row],[Member '#]],hertsk10results,3,FALSE))","v":"00:40:02"},45]
[null,"Total",null,null,{"$f":"SUBTOTAL(104,tenK[Events])","v":2},{"$f":"SUBTOTAL(103,tenK[Gender])","v":72},{"$f":"SUBTOTAL(103,tenK[Wheato Chip Time])","v":41},null,null,{"$f":"SUBTOTAL(103,tenK[Herts 10K time])","v":72}]

{"sheet":"Marathons","index":7,"n_rows":34,"n_cols":8,"rows_kept":34,"cut":false,"hidden":false,"merged":[]}
["Marathons"]
[]
[null,null,"Member","Name","Race","Points","Events","Column1"]
[null,null,12,{"$f":"VLOOKUP(C4,Membynum,2,FALSE)","v":"Georgie Hamilton"},"VLM",30,1,{"$f":"Marathon[[#This Row],[Events]]*26.2","v":26.2}]
[null,null,13,"Laura Nathan","Brighton",30,1,{"$f":"Marathon[[#This Row],[Events]]*26.2","v":26.2}]
[null,null,28,"Darren McGrath","VLM",30,1,{"$f":"Marathon[[#This Row],[Events]]*26.2","v":26.2}]
[null,null,32,"Michael Hessey","Munich",30,1,{"$f":"Marathon[[#This Row],[Events]]*26.2","v":26.2}]
[null,null,39,"Graham Harper","Shakespeare & Munich",30,2,{"$f":"Marathon[[#This Row],[Events]]*26.2","v":52.4}]
[null,null,53,"Simon Speirs","Hoka Highland Fling",0,1,{"$f":"Marathon[[#This Row],[Events]]*26.2","v":26.2}]
[null,null,54,"Hannah Turner","VLM",30,1,{"$f":"Marathon[[#This Row],[Events]]*26.2","v":26.2}]
[null,null,57,"Lee Scott","VLM",30,1,{"$f":"Marathon[[#This Row],[Events]]*26.2","v":26.2}]
[null,null,73,"David Green","Boston",30,1,{"$f":"Marathon[[#This Row],[Events]]*26.2","v":26.2}]
[null,null,74,"Camilla Davidson","Munich",30,1,{"$f":"Marathon[[#This Row],[Events]]*26.2","v":26.2}]
[null,null,97,{"$f":"VLOOKUP(C14,Membynum,2,FALSE)","v":"Jennifer Finlay"},"Paris",30,1,{"$f":"Marathon[[#This Row],[Events]]*26.2","v":26.2}]
[null,null,100,"Phil Jacobs","MK",30,1,{"$f":"Marathon[[#This Row],[Events]]*26.2","v":26.2}]
[null,null,107,"Andy Wilkins","VLM",30,1,{"$f":"Marathon[[#This Row],[Events]]*26.2","v":26.2}]
[null,null,116,"Karen Wilkins","VLM",30,1,{"$f":"Marathon[[#This Row],[Events]]*26.2","v":26.2}]
[null,null,119,"Louise Crosby","Boston",30,1,{"$f":"Marathon[[#This Row],[Events]]*26.2","v":26.2}]
[null,null,120,"Brian Yates","Hamburg",30,1,{"$f":"Marathon[[#This Row],[Events]]*26.2","v":26.2}]
[null,null,140,"Dawn Burr","MK",30,1,{"$f":"Marathon[[#This Row],[Events]]*26.2","v":26.2}]
[null,null,152,"Richard Bruce","VLM",30,1,{"$f":"Marathon[[#This Row],[Events]]*26.2","v":26.2}]
[null,null,167,"Ian Long","Munich & USA",30,2,{"$f":"Marathon[[#This Row],[Events]]*26.2","v":52.4}]
[null,null,187,"Paul Geary","VLM & MK",30,2,{"$f":"Marathon[[#This Row],[Events]]*26.2","v":52.4}]
[null,null,203,"Jamie Nathan","Brighton",30,1,{"$f":"Marathon[[#This Row],[Events]]*26.2","v":26.2}]
[null,null,208,"Simon Townsend","Munich",30,1,{"$f":"Marathon[[#This Row],[Events]]*26.2","v":26.2}]
[null,null,212,"Andrew Cripps","MK",30,1,{"$f":"Marathon[[#This Row],[Events]]*26.2","v":26.2}]
[null,null,219,"Lisa Long","Munich",30,1,{"$f":"Marathon[[#This Row],[Events]]*26.2","v":26.2}]
[null,null,222,"Paul Goodwin","VLM",30,1,{"$f":"Marathon[[#This Row],[Events]]*26.2","v":26.2}]
[null,null,223,"Steve Bowran","Paris",30,1,{"$f":"Marathon[[#This Row],[Events]]*26.2","v":26.2}]
[null,null,231,"Edward Rhodes","Stockholm",30,1,{"$f":"Marathon[[#This Row],[Events]]*26.2","v":26.2}]
[null,null,239,"Andy Jordan","VLM",30,1,{"$f":"Marathon[[#This Row],[Events]]*26.2","v":26.2}]
[null,null,257,"Sarah Chilvers","Dorset Coast to Coast",30,1,{"$f":"Marathon[[#This Row],[Events]]*26.2","v":26.2}]
[null,null,269,"Patrick McGuinness","Munich",30,1,{"$f":"Marathon[[#This Row],[Events]]*26.2","v":26.2}]
[null,null,"Total",{"$f":"SUBTOTAL(103,Marathon[Name])","v":30},null,null,null,{"$f":"SUBTOTAL(109,Marathon[Column1])","v":864.60000000000025}]

{"sheet":"Ultra Races","index":8,"n_rows":7,"n_cols":5,"rows_kept":7,"cut":false,"hidden":false,"merged":[]}
["Ultra Races"]
[]
[]
[]
[null,"Member","Name","Race","Points"]
[null,53,{"$f":"VLOOKUP(B6,Membynum,2,FALSE)","v":"Simon Speirs"},"Hoka Highland Fling",0]
[null,257,{"$f":"VLOOKUP(B7,Membynum,2,FALSE)","v":"Sarah Chilvers"},"Dorset Coast to Coast",30]

{"sheet":"Thunder Run","index":9,"n_rows":10,"n_cols":5,"rows_kept":10,"cut":false,"hidden":false,"merged":[]}
["Thunder Run"]
[]
[null,"Member","Name","Total Points","27th – 28th Jul Thunder Run"]
[null,{"$f":"VLOOKUP(C4,members,2,FALSE)","v":53},"Simon Speirs",30,30]
[null,54,"Hannah Turner",30,30]
[null,119,"Louise Crosby",30,30]
[null,138,"Emily Hooper",30,30]
[null,149,"Joanne Richards",30,30]
[null,208,"Simon Townsend",30,30]
[null,232,"Philippa O'Donovan",30,30]

{"sheet":"Herts 10K Runners","index":10,"n_rows":140,"n_cols":6,"rows_kept":140,"cut":false,"hidden":true,"merged":[]}
[null,"Name","Mem","H10k","Chip time","Comments"]
[null,"David Green",73,"Y","00:38:39"]
[null,"Alex Butterworth",259]
[null,"Alexandra O'DONOVAN",250]
[null,"Alison Cole",256]
[null,"Amy Curtis",171]
[null,"James Chasen",294,"Y","00:38:59"]
[null,"Andy Jordan",239,"Y","00:39:05"]
[null,"Andy Hill",163]
[null,"Lee Scott",57,"Y","00:39:31"]
[null,"Paul Goodwin",222,"Y","00:39:39"]
[null,"Iain Tucker",302,"Y","00:40:02"]
[null,"Adrian James",236,"Y","00:40:22"]
[null,"Ben Turner",189]
[null,"Brian Yates",120]
[null,"Camilla Davidson",74]
[null,"Carl Batchelder",253]
[null,"David Moritz",214,"Y","00:40:58"]
[null,"Charlotte Walsh",297]
[null,"Craig Harper",114,"Y","00:41:11"]
[null,"Chris Cottle",227]
[null,"Chris Mayne",112]
[null,"Christine Esson",270]
[null,"Clive Borthwick",79]
[null,"Colette Gissane",295]
[null,"Colette Pidgeon",124]
[null,"Colin Wareham",1,"S"]
[null,"Gordon Alexander",262,"Y","00:41:30"]
[null,"Dan Day",166]
[null,"Dan Winfield",298]
[null,"Darren McGrath",28," "]
[null,"Andy Wilkins",107,"Y","00:41:43"]
[null,"Andrew Cripps",212,"Y","00:41:45"]
[null,"David Salmon",290]
[null,"Elliott Lamb",110,"Y","00:41:45"]
[null,"Debbi James",304]
[null,"Dee Bretnall",230]
[null,"Dennis Van Goldberdinge",134]
[null,"Derek Lambert",264]
[null,"Ed Rhodes",231,"Y","00:41:52"]
[null,"Ellen Colebrook",266]
[null,"Justin Busby",292,"Y","00:41:59"]
[null,"Richard Johnstone",122,"Y","00:42:15"]
[null,"Ronjon Chakraverty",72,"Y","00:43:00"]
[null,"Georgia Dench",254]
[null,"Andrew Hazley-Payne",237,"Y","00:43:43"]
[null,"Ian Smart",60,"Y","00:43:55"]
[null,"Jon Stagg",273,"Y","00:44:18"]
[null,"Graham Harper",39]
[null,"Hannah Turner",54]
[null,"Helen MacFarlane",282,"S"]
[null,"Helen Pearson",205]
[null,"Iain O'Kane",291]
[null,"Catriona Davis",234,"Y","00:44:21"]
[null,"Ian Long",167]
[null,"Jason W Smith",263,"Y","00:44:45"]
[null,"Iona Aitken",284]
[null,"Ben Sweeting",260,"Y","00:44:51"]
[null,"James Bentall",141,"Y","00:45:07"]
[null,"Jennifer Finlay",97,"Y","00:45:15"]
[null,"Jamie Fisher",99]
[null,"Jamie Nathan",203]
[null,"Sarah Dumbrill",77,"Y","00:45:49"]
[null,"Jennifer Cunniff",225,"S"]
[null,"Paul Geary",187,"Y","00:45:55"]
[null,"Jenny Birch",94,"S"]
[null,"Gordon Ray",289,"Y","00:46:04"]
[null,"Jim Robinson",286]
[null,"Joanne Curtis",267]
[null,"Emily Hooper",138,"Y","00:46:18"]
[null,"Dawn Burr",140,"Y","00:46:57"]
[null,"John Mercer",252]
[null,"John Rowlands",185]
[null,"Jon Carr",246]
[null,"Richard Moreton",283,"Y","00:47:13"]
[null,"Jonathan Budge",279]
[null,"Joolz Scott",178,"S"]
[null,"Julian Jones",243]
[null,"Julie-Anne Moors",305]
[null,"Juliet Jacobs",213]
[null,"Paul Hill",287,"Y","00:47:40"]
[null,"Karen Wilkins",116,"S"]
[null,"Kate Kitchener",306]
[null,"Kate Speirs",139]
[null,"Katie Fox",281]
[null,"Laura Nathan",13]
[null,"Robert Goldhawk",258,"Y","00:47:45"]
[null,"Lisa Long",219]
[null,"Lloyd Watson",175]
[null,"Lorna Townsend",242]
[null,"Louise Crosby",119]
[null,"Maria Niembro",265]
[null,"Martin Leach",301]
[null,"Michael Hessey",32]
[null,"Nigel Marsden",96]
[null,"Jamie Davies",240,"Y","00:49:53"]
[null,"Olivia Hessey",278]
[null,"Oswald Kawache",296]
[null,"Patrick McGuinness",269]
[null,"Paul Brewster",194,"Y","00:50:21","John Rowlands"]
[null,"Chitra Dunn",238,"Y","00:51:18"]
[null,"Joanne Richards",149,"Y","00:51:45"]
[null,"Paul Hermsen",216]
[null,"Fiona Price",248,"Y","00:52:10","under David Price"]
[null,"Paul Savage",192]
[null,"Phil Jacobs",100]
[null,"Philip Wigg",285]
[null,"Philippa O'Donovan",232]
[null,"Pierre-Louis Gatti",233]
[null,"Ravi Chandarana",300]
[null,"Richard Bruce",152]
[null,"Tom Flett",293,"Y","00:54:51"]
[null,"Annette Godfrey",51,"Y","00:56:11"]
[null,"Richard Saunders",255]
[null,"Jillian Russell",44,"y","00:56:15"]
[null,"Johanna Wood",143,"Y","00:56:27"]
[null,"Ross Gissane",303]
[null,"Sarah Chilvers",257]
[null,"Victoria Johns",275,"Y","00:56:27"]
[null,"Sarah England",150]
[null,"Sarah Thomas",201]
[null,"Simon Kitchener",9]
[null,"Simon Speirs",53,"S"]
[null,"Simon Townsend",208]
[null,"Steff Bailey",204]
[null,"Stephanie Heard",113]
[null,"Vicki Moran",228,"Y","00:57:30"]
[null,"Susan Smith",176]
[null,"Tammy Clarkson",261]
[null,"Theo Green",288]
[null,"Thomas Hallam",280]
[null,"Tina Pidgeon",123]
[null,"Georgie Hamilton",12,"Y","00:57:34"]
[null,"Steve Bowran",223,"Y","01:01:21"]
[null,"Victoria Blythe",271]
[null,"Norman Whitwood",93,"Y","01:07:04"]
[null,"Total",{"$f":"SUBTOTAL(103,Herts10K[Mem])","v":47},{"$f":"COUNTIF(Herts10K[H10k],\"Y\")","v":47},{"$f":"SUBTOTAL(101,Herts10K[Chip time])","v":"00:46:52.723"},{"$f":"SUBTOTAL(103,Herts10K[Comments])","v":2}]
[]
[]
[null,null,null,{"$f":"Herts10K[[#Totals],[H10k]]/Herts10K[[#Totals],[Mem]]","v":1}]

{"sheet":"Controls Page","index":11,"n_rows":190,"n_cols":13,"rows_kept":190,"cut":false,"hidden":false,"merged":[[0,3,0,6]]}
[null,">0",null,"Event Tabs - Runners"]
[null,"Event","League Table","Half Marathon","XC","Parkrun","Club 5K","10 Miles","10K",null,null,"Event","Number of events"]
[null,"Number of Runners",{"$f":"COUNTA(League[Name])","v":150},{"$f":"Halfmarathon[[#Totals],[Gender]]","v":40},{"$f":"XC[[#Totals],[Gender]]","v":62},{"$f":"Parkrun[[#Totals],[Points]]","v":50},{"$f":"Club5k[[#Totals],[Name]]","v":88},{"$f":"Table18[[#Totals],[Name]]","v":32},{"$f":"tenK[[#Totals],[Gender]]","v":72},null,null,"Number of Runners",{"$f":"COUNTA(League[Name])","v":150}]
[null,"Half Marathon",{"$f":"(League[[#Totals],[HalfMarathon]])","v":40},{"$f":"C4-D3","v":0},null,null,null,null,null,null,null,"Half Marathon",{"$f":"Halfmarathon[[#Totals],['# Eevnts]]","v":4}]
[null,"XC",{"$f":"League[[#Totals],[XC]]","v":62},null,{"$f":"C5-E3","v":0},null,null,null,null,null,null,"XC",{"$f":"XC[[#Totals],['# Events]]","v":6}]
[null,"Parkrun",{"$f":"League[[#Totals],[Parkrun]]","v":50},null,null,{"$f":"C6-F3","v":0},null,null,null,null,null,"Club 5K",{"$f":"Club5k[[#Totals],[Events]]","v":11}]
[null,"Club 5K",{"$f":"League[[#Totals],[Club5K]]","v":88},null,null,null,{"$f":"C7-G3","v":0},null,null,null,null,"10K Races",2]
[null,"10K Races",{"$f":"League[[#Totals],[10K]]","v":72},null,null,null,null,null,{"$f":"I3-Table10[[#This Row],[League Table]]","v":0},null,null,"10 Miler",{"$f":"Table18[[#Totals],[Events]]","v":2}]
[null,"10 Miler",{"$f":"League[[#Totals],[10 Miles]]","v":32},null,null,null,null,{"$f":"H3-Table10[[#This Row],[League Table]]","v":0},null,null,null,"Other Results"]
[null,"Other Results",null,null,null,null,null,null,null,null,null,"Other events"]
[null,"Other events"]
[]
[]
[null,"Number of Men",{"$f":"COUNTIF(League[Gender],\"M\")","v":86},null,null,null,null,null,null,null,null,"http://www.harpendenarrows.co.uk/web/index.php/race-list"]
[null,"Number of Ladies",{"$f":"COUNTIF(League[Gender],\"F\")","v":64}]
[null,"Number of Runners",{"$f":"SUM(C14:C15)","v":150}]
[null,"Number of runners with points",{"$f":"League[[#Totals],[Total Points]]","v":124}]
[null,"Pointless runners ?",{"$f":"C16-C17","v":26}]
[]
[null,"Opt outs","Name"]
[null,36,{"$f":"VLOOKUP(B21,Allmembers[],2,FALSE)","v":"Alistair Holland"}]
[]
[]
[null,"Num2","Fullname","Number","N1","N2","Sex","Cat",null,"Age","M","F"]
[null,{"$f":"Allmembers[[#This Row],[Number]]","v":1},{"$f":"TRIM(Allmembers[[#This Row],[N1]])&\" \"&TRIM(Allmembers[[#This Row],[N2]])","v":"Colin Wareham"},1,"Colin","Wareham","Male","MV40",null,18,"M","F"]
[null,{"$f":"Allmembers[[#This Row],[Number]]","v":9},{"$f":"TRIM(Allmembers[[#This Row],[N1]])&\" \"&TRIM(Allmembers[[#This Row],[N2]])","v":"Simon Kitchener"},9,"Simon","Kitchener","Male","MV60",null,19,"M","F"]
[null,{"$f":"Allmembers[[#This Row],[Number]]","v":12},{"$f":"TRIM(Allmembers[[#This Row],[N1]])&\" \"&TRIM(Allmembers[[#This Row],[N2]])","v":"Georgie Hamilton"},12,"Georgie","Hamilton","Female","FV65",null,20,"M","F"]
[null,{"$f":"Allmembers[[#This Row],[Number]]","v":13},{"$f":"TRIM(Allmembers[[#This Row],[N1]])&\" \"&TRIM(Allmembers[[#This Row],[N2]])","v":"Laura Nathan"},13,"Laura","Nathan","Female","FV35",null,21,"M","F"]
[null,{"$f":"Allmembers[[#This Row],[Number]]","v":28},{"$f":"TRIM(Allmembers[[#This Row],[N1]])&\" \"&TRIM(Allmembers[[#This Row],[N2]])","v":"Darren McGrath"},28,"Darren","McGrath","Male","MV40",null,22,"M","F"]
[null,{"$f":"Allmembers[[#This Row],[Number]]","v":32},{"$f":"TRIM(Allmembers[[#This Row],[N1]])&\" \"&TRIM(Allmembers[[#This Row],[N2]])","v":"Michael Hessey"},32,"Michael","Hessey","Male","MV40",null,23,"M","F"]
[null,{"$f":"Allmembers[[#This Row],[Number]]","v":36},{"$f":"TRIM(Allmembers[[#This Row],[N1]])&\" \"&TRIM(Allmembers[[#This Row],[N2]])","v":"Alistair Holland"},36,"Alistair","Holland","Male","MV40",null,24,"M","F"]
[null,{"$f":"Allmembers[[#This Row],[Number]]","v":39},{"$f":"TRIM(Allmembers[[#This Row],[N1]])&\" \"&TRIM(Allmembers[[#This Row],[N2]])","v":"Graham Harper"},39,"Graham","Harper","Male","MV50",null,25,"M","FS"]
[null,{"$f":"Allmembers[[#This Row],[Number]]","v":44},{"$f":"TRIM(Allmembers[[#This Row],[N1]])&\" \"&TRIM(Allmembers[[#This Row],[N2]])","v":"Jillian Russell"},44,"Jillian","Russell","Female","FV45",null,26,"M","FS"]
[null,{"$f":"Allmembers[[#This Row],[Number]]","v":51},{"$f":"TRIM(Allmembers[[#This Row],[N1]])&\" \"&TRIM(Allmembers[[#This Row],[N2]])","v":"Annette Godfrey"},51,"Annette","Godfrey","Female","FV45",null,27,"M","FS"]
[null,{"$f":"Allmembers[[#This Row],[Number]]","v":53},{"$f":"TRIM(Allmembers[[#This Row],[N1]])&\" \"&TRIM(Allmembers[[#This Row],[N2]])","v":"Simon Speirs"},53,"Simon","Speirs","Male","MV40",null,28,"M","FS"]
[null,{"$f":"Allmembers[[#This Row],[Number]]","v":54},{"$f":"TRIM(Allmembers[[#This Row],[N1]])&\" \"&TRIM(Allmembers[[#This Row],[N2]])","v":"Hannah Turner"},54,"Hannah","Turner","Female","FV35",null,29,"M","FS"]
[null,{"$f":"Allmembers[[#This Row],[Number]]","v":57},{"$f":"TRIM(Allmembers[[#This Row],[N1]])&\" \"&TRIM(Allmembers[[#This Row],[N2]])","v":"Lee Scott"},57,"Lee","Scott","Male","MV40",null,30,"MS","FS"]
[null,{"$f":"Allmembers[[#This Row],[Number]]","v":60},{"$f":"TRIM(Allmembers[[#This Row],[N1]])&\" \"&TRIM(Allmembers[[#This Row],[N2]])","v":"Ian Smart"},60,"Ian","Smart","Male","MV50",null,31,"MS","FS"]
[null,{"$f":"Allmembers[[#This Row],[Number]]","v":72},{"$f":"TRIM(Allmembers[[#This Row],[N1]])&\" \"&TRIM(Allmembers[[#This Row],[N2]])","v":"Ron Chakraverty"},72,"Ron","Chakraverty","Male","MV40",null,32,"MS","FS"]
[null,{"$f":"Allmembers[[#This Row],[Number]]","v":73},{"$f":"TRIM(Allmembers[[#This Row],[N1]])&\" \"&TRIM(Allmembers[[#This Row],[N2]])","v":"David Green"},73,"David","Green","Male","MV50",null,33,"MS","FS"]
[null,{"$f":"Allmembers[[#This Row],[Number]]","v":74},{"$f":"TRIM(Allmembers[[#This Row],[N1]])&\" \"&TRIM(Allmembers[[#This Row],[N2]])","v":"Camilla Davidson"},74,"Camilla","Davidson","Female","FS",null,34,"MS","FS"]
[null,{"$f":"Allmembers[[#This Row],[Number]]","v":77},{"$f":"TRIM(Allmembers[[#This Row],[N1]])&\" \"&TRIM(Allmembers[[#This Row],[N2]])","v":"Sarah Dumbrill"},77,"Sarah","Dumbrill","Female","FV35",null,35,"MS","FV35"]
[null,{"$f":"Allmembers[[#This Row],[Number]]","v":79},{"$f":"TRIM(Allmembers[[#This Row],[N1]])&\" \"&TRIM(Allmembers[[#This Row],[N2]])","v":"Clive Borthwick"},79,"Clive","Borthwick","Male","MV60",null,36,"MS","FV35"]
[null,{"$f":"Allmembers[[#This Row],[Number]]","v":93},{"$f":"TRIM(Allmembers[[#This Row],[N1]])&\" \"&TRIM(Allmembers[[#This Row],[N2]])","v":"Norman Whitwood"},93,"Norman","Whitwood","Male","MV60",null,37,"MS","FV35"]
[null,{"$f":"Allmembers[[#This Row],[Number]]","v":94},{"$f":"TRIM(Allmembers[[#This Row],[N1]])&\" \"&TRIM(Allmembers[[#This Row],[N2]])","v":"Jenny Birch"},94,"Jenny","Birch","Female","FV35",null,38,"MS","FV35"]
[null,{"$f":"Allmembers[[#This Row],[Number]]","v":96},{"$f":"TRIM(Allmembers[[#This Row],[N1]])&\" \"&TRIM(Allmembers[[#This Row],[N2]])","v":"Nigel Marsden"},96,"Nigel","Marsden","Male","MV40",null,39,"MS","FV35"]
[null,{"$f":"Allmembers[[#This Row],[Number]]","v":97},{"$f":"TRIM(Allmembers[[#This Row],[N1]])&\" \"&TRIM(Allmembers[[#This Row],[N2]])","v":"Jennifer Finlay"},97,"Jennifer","Finlay","Female","FV35",null,40,"MV40","FV35"]
[null,{"$f":"Allmembers[[#This Row],[Number]]","v":99},{"$f":"TRIM(Allmembers[[#This Row],[N1]])&\" \"&TRIM(Allmembers[[#This Row],[N2]])","v":"Jamie Fisher"},99,"Jamie","Fisher","Male","MV40",null,41,"MV40","FV35"]
[null,{"$f":"Allmembers[[#This Row],[Number]]","v":100},{"$f":"TRIM(Allmembers[[#This Row],[N1]])&\" \"&TRIM(Allmembers[[#This Row],[N2]])","v":"Phil Jacobs"},100,"Phil","Jacobs","Male","MV40",null,42,"MV40","FV35"]
[null,{"$f":"Allmembers[[#This Row],[Number]]","v":103},{"$f":"TRIM(Allmembers[[#This Row],[N1]])&\" \"&TRIM(Allmembers[[#This Row],[N2]])","v":"Tim Mauchline"},103,"Tim","Mauchline","Male","MS",null,43,"MV40","FV35"]
[null,{"$f":"Allmembers[[#This Row],[Number]]","v":107},{"$f":"TRIM(Allmembers[[#This Row],[N1]])&\" \"&TRIM(Allmembers[[#This Row],[N2]])","v":"Andy Wilkins"},107,"Andy","Wilkins","Male","MV40",null,44,"MV40","FV35"]
[null,{"$f":"Allmembers[[#This Row],[Number]]","v":110},{"$f":"TRIM(Allmembers[[#This Row],[N1]])&\" \"&TRIM(Allmembers[[#This Row],[N2]])","v":"Elliott Lamb"},110,"Elliott","Lamb","Male","MV50",null,45,"MV40","FV45"]
[null,{"$f":"Allmembers[[#This Row],[Number]]","v":112},{"$f":"TRIM(Allmembers[[#This Row],[N1]])&\" \"&TRIM(Allmembers[[#This Row],[N2]])","v":"Chris Mayne"},112,"Chris","Mayne","Male","MV80",null,46,"MV40","FV45"]
[null,{"$f":"Allmembers[[#This Row],[Number]]","v":113},{"$f":"TRIM(Allmembers[[#This Row],[N1]])&\" \"&TRIM(Allmembers[[#This Row],[N2]])","v":"Stephanie Heard"},113,"Stephanie","Heard","Female","FS",null,47,"MV40","FV45"]
[null,{"$f":"Allmembers[[#This Row],[Number]]","v":114},{"$f":"TRIM(Allmembers[[#This Row],[N1]])&\" \"&TRIM(Allmembers[[#This Row],[N2]])","v":"Craig Harper"},114,"Craig","Harper","Male","MS",null,48,"MV40","FV45"]
[null,{"$f":"Allmembers[[#This Row],[Number]]","v":116},{"$f":"TRIM(Allmembers[[#This Row],[N1]])&\" \"&TRIM(Allmembers[[#This Row],[N2]])","v":"Karen Wilkins"},116,"Karen","Wilkins","Female","FV35",null,49,"MV40","FV45"]
[null,{"$f":"Allmembers[[#This Row],[Number]]","v":119},{"$f":"TRIM(Allmembers[[#This Row],[N1]])&\" \"&TRIM(Allmembers[[#This Row],[N2]])","v":"Louise Crosby"},119,"Louise","Crosby","Female","FV45",null,50,"MV50","FV45"]
[null,{"$f":"Allmembers[[#This Row],[Number]]","v":120},{"$f":"TRIM(Allmembers[[#This Row],[N1]])&\" \"&TRIM(Allmembers[[#This Row],[N2]])","v":"Brian Yates"},120,"Brian","Yates","Male","MV60",null,51,"MV50","FV45"]
[null,{"$f":"Allmembers[[#This Row],[Number]]","v":122},{"$f":"TRIM(Allmembers[[#This Row],[N1]])&\" \"&TRIM(Allmembers[[#This Row],[N2]])","v":"Richard Johnstone"},122,"Richard","Johnstone","Male","MV40",null,52,"MV50","FV45"]
[null,{"$f":"Allmembers[[#This Row],[Number]]","v":123},{"$f":"TRIM(Allmembers[[#This Row],[N1]])&\" \"&TRIM(Allmembers[[#This Row],[N2]])","v":"Tina Pidgeon"},123,"Tina","Pidgeon","Female","FV35",null,53,"MV50","FV45"]
[null,{"$f":"Allmembers[[#This Row],[Number]]","v":124},{"$f":"TRIM(Allmembers[[#This Row],[N1]])&\" \"&TRIM(Allmembers[[#This Row],[N2]])","v":"Colette Pidgeon"},124,"Colette","Pidgeon","Female","FV35",null,54,"MV50","FV45"]
[null,{"$f":"Allmembers[[#This Row],[Number]]","v":134},{"$f":"TRIM(Allmembers[[#This Row],[N1]])&\" \"&TRIM(Allmembers[[#This Row],[N2]])","v":"Dennis Van Goldberdinge"},134,"Dennis","Van Goldberdinge","Male","MV40",null,55,"MV50","FV55"]
[null,{"$f":"Allmembers[[#This Row],[Number]]","v":138},{"$f":"TRIM(Allmembers[[#This Row],[N1]])&\" \"&TRIM(Allmembers[[#This Row],[N2]])","v":"Emily Hooper"},138,"Emily","Hooper","Female","FV35",null,56,"MV50","FV55"]
[null,{"$f":"Allmembers[[#This Row],[Number]]","v":139},{"$f":"TRIM(Allmembers[[#This Row],[N1]])&\" \"&TRIM(Allmembers[[#This Row],[N2]])","v":"Kate Speirs"},139,"Kate","Speirs","Female","FV35",null,57,"MV50","FV55"]
[null,{"$f":"Allmembers[[#This Row],[Number]]","v":140},{"$f":"TRIM(Allmembers[[#This Row],[N1]])&\" \"&TRIM(Allmembers[[#This Row],[N2]])","v":"Dawn Burr"},140,"Dawn","Burr","Female","FV35",null,58,"MV50","FV55"]
[null,{"$f":"Allmembers[[#This Row],[Number]]","v":141},{"$f":"TRIM(Allmembers[[#This Row],[N1]])&\" \"&TRIM(Allmembers[[#This Row],[N2]])","v":"James Bentall"},141,"James","Bentall","Male","MV40",null,59,"MV50","FV55"]
[null,{"$f":"Allmembers[[#This Row],[Number]]","v":142},{"$f":"TRIM(Allmembers[[#This Row],[N1]])&\" \"&TRIM(Allmembers[[#This Row],[N2]])","v":"Jane Fish"},142,"Jane","Fish","Female","FV45",null,60,"MV60","FV55"]
[null,{"$f":"Allmembers[[#This Row],[Number]]","v":143},{"$f":"TRIM(Allmembers[[#This Row],[N1]])&\" \"&TRIM(Allmembers[[#This Row],[N2]])","v":"Johanna Wood"},143,"Johanna","Wood","Female","FV45",null,61,"MV60","FV55"]
[null,{"$f":"Allmembers[[#This Row],[Number]]","v":149},{"$f":"TRIM(Allmembers[[#This Row],[N1]])&\" \"&TRIM(Allmembers[[#This Row],[N2]])","v":"Joanne Richards"},149,"Joanne","Richards","Female","FV35",null,62,"MV60","FV55"]
[null,{"$f":"Allmembers[[#This Row],[Number]]","v":150},{"$f":"TRIM(Allmembers[[#This Row],[N1]])&\" \"&TRIM(Allmembers[[#This Row],[N2]])","v":"Sarah England"},150,"Sarah","England","Female","FS",null,63,"MV60","FV55"]
[null,{"$f":"Allmembers[[#This Row],[Number]]","v":152},{"$f":"TRIM(Allmembers[[#This Row],[N1]])&\" \"&TRIM(Allmembers[[#This Row],[N2]])","v":"Richard Bruce"},152,"Richard","Bruce","Male","MV40",null,64,"MV60","FV55"]
[null,{"$f":"Allmembers[[#This Row],[Number]]","v":163},{"$f":"TRIM(Allmembers[[#This Row],[N1]])&\" \"&TRIM(Allmembers[[#This Row],[N2]])","v":"Andy Hill"},163,"Andy","Hill","Male","MV40",null,65,"MV60","FV65"]
[null,{"$f":"Allmembers[[#This Row],[Number]]","v":165},{"$f":"TRIM(Allmembers[[#This Row],[N1]])&\" \"&TRIM(Allmembers[[#This Row],[N2]])","v":"Steven Riley"},165,"Steven","Riley","Male","MV40",null,66,"MV60","FV65"]
[null,{"$f":"Allmembers[[#This Row],[Number]]","v":166},{"$f":"TRIM(Allmembers[[#This Row],[N1]])&\" \"&TRIM(Allmembers[[#This Row],[N2]])","v":"Dan Day"},166,"Dan","Day","Male","MS",null,67,"MV60","FV65"]
[null,{"$f":"Allmembers[[#This Row],[Number]]","v":167},{"$f":"TRIM(Allmembers[[#This Row],[N1]])&\" \"&TRIM(Allmembers[[#This Row],[N2]])","v":"Ian Long"},167,"Ian","Long","Male","MV40",null,68,"MV60","FV65"]
[null,{"$f":"Allmembers[[#This Row],[Number]]","v":171},{"$f":"TRIM(Allmembers[[#This Row],[N1]])&\" \"&TRIM(Allmembers[[#This Row],[N2]])","v":"Amy Curtis"},171,"Amy","Curtis","Female","FS",null,69,"MV60","FV65"]
[null,{"$f":"Allmembers[[#This Row],[Number]]","v":175},{"$f":"TRIM(Allmembers[[#This Row],[N1]])&\" \"&TRIM(Allmembers[[#This Row],[N2]])","v":"Lloyd Watson"},175,"Lloyd","Watson","Male","MV50",null,70,"MV70","FV65"]
[null,{"$f":"Allmembers[[#This Row],[Number]]","v":176},{"$f":"TRIM(Allmembers[[#This Row],[N1]])&\" \"&TRIM(Allmembers[[#This Row],[N2]])","v":"Susan Smith"},176,"Susan","Smith","Female","FV45",null,71,"MV70","FV65"]
[null,{"$f":"Allmembers[[#This Row],[Number]]","v":178},{"$f":"TRIM(Allmembers[[#This Row],[N1]])&\" \"&TRIM(Allmembers[[#This Row],[N2]])","v":"Joolz Scott"},178,"Joolz","Scott","Female","FV45",null,72,"MV70","FV65"]
[null,{"$f":"Allmembers[[#This Row],[Number]]","v":185},{"$f":"TRIM(Allmembers[[#This Row],[N1]])&\" \"&TRIM(Allmembers[[#This Row],[N2]])","v":"John Rowlands"},185,"John","Rowlands","Male","MV60",null,73,"MV70","FV65"]
[null,{"$f":"Allmembers[[#This Row],[Number]]","v":187},{"$f":"TRIM(Allmembers[[#This Row],[N1]])&\" \"&TRIM(Allmembers[[#This Row],[N2]])","v":"Paul Geary"},187,"Paul","Geary","Male","MV40",null,74,"MV70","FV65"]
[null,{"$f":"Allmembers[[#This Row],[Number]]","v":189},{"$f":"TRIM(Allmembers[[#This Row],[N1]])&\" \"&TRIM(Allmembers[[#This Row],[N2]])","v":"Ben Turner"},189,"Ben","Turner","Male","MV40",null,75,"MV70","FV75"]
[null,{"$f":"Allmembers[[#This Row],[Number]]","v":192},{"$f":"TRIM(Allmembers[[#This Row],[N1]])&\" \"&TRIM(Allmembers[[#This Row],[N2]])","v":"Paul Savage"},192,"Paul","Savage","Male","MV40",null,76,"MV70","FV75"]
[null,{"$f":"Allmembers[[#This Row],[Number]]","v":194},{"$f":"TRIM(Allmembers[[#This Row],[N1]])&\" \"&TRIM(Allmembers[[#This Row],[N2]])","v":"Paul Brewster"},194,"Paul","Brewster","Male","MV50",null,77,"MV70","FV75"]
[null,{"$f":"Allmembers[[#This Row],[Number]]","v":196},{"$f":"TRIM(Allmembers[[#This Row],[N1]])&\" \"&TRIM(Allmembers[[#This Row],[N2]])","v":"Sharon Stanley"},196,"Sharon","Stanley","Female","FV55",null,78,"MV70","FV75"]
[null,{"$f":"Allmembers[[#This Row],[Number]]","v":201},{"$f":"TRIM(Allmembers[[#This Row],[N1]])&\" \"&TRIM(Allmembers[[#This Row],[N2]])","v":"Sarah Thomas"},201,"Sarah","Thomas","Female","F",null,79,"MV70","FV75"]
[null,{"$f":"Allmembers[[#This Row],[Number]]","v":203},{"$f":"TRIM(Allmembers[[#This Row],[N1]])&\" \"&TRIM(Allmembers[[#This Row],[N2]])","v":"Jamie Nathan"},203,"Jamie","Nathan","Male","MS",null,80,"MV80","FV75"]
[null,{"$f":"Allmembers[[#This Row],[Number]]","v":204},{"$f":"TRIM(Allmembers[[#This Row],[N1]])&\" \"&TRIM(Allmembers[[#This Row],[N2]])","v":"Stephanie Bailey"},204,"Stephanie","Bailey","Female","FS",null,81,"MV80","FV75"]
[null,{"$f":"Allmembers[[#This Row],[Number]]","v":205},{"$f":"TRIM(Allmembers[[#This Row],[N1]])&\" \"&TRIM(Allmembers[[#This Row],[N2]])","v":"Helen Pearson"},205,"Helen","Pearson","Female","FV45",null,82,"MV80","FV75"]
[null,{"$f":"Allmembers[[#This Row],[Number]]","v":208},{"$f":"TRIM(Allmembers[[#This Row],[N1]])&\" \"&TRIM(Allmembers[[#This Row],[N2]])","v":"Simon Townsend"},208,"Simon","Townsend","Male","MV40",null,83,"MV80","FV75"]
[null,{"$f":"Allmembers[[#This Row],[Number]]","v":211},{"$f":"TRIM(Allmembers[[#This Row],[N1]])&\" \"&TRIM(Allmembers[[#This Row],[N2]])","v":"James Charlton"},211,"James","Charlton","Male","MV40",null,84,"MV80","FV75"]
[null,{"$f":"Allmembers[[#This Row],[Number]]","v":212},{"$f":"TRIM(Allmembers[[#This Row],[N1]])&\" \"&TRIM(Allmembers[[#This Row],[N2]])","v":"Andrew Cripps"},212,"Andrew","Cripps","Male","MV40",null,85,"MV80"]
[null,{"$f":"Allmembers[[#This Row],[Number]]","v":213},{"$f":"TRIM(Allmembers[[#This Row],[N1]])&\" \"&TRIM(Allmembers[[#This Row],[N2]])","v":"Juliet Jacobs"},213,"Juliet","Jacobs","Female","FV35",null,86,"MV80"]
[null,{"$f":"Allmembers[[#This Row],[Number]]","v":214},{"$f":"TRIM(Allmembers[[#This Row],[N1]])&\" \"&TRIM(Allmembers[[#This Row],[N2]])","v":"David Moritz"},214,"David","Moritz","Male","MS",null,87,"MV80"]
[null,{"$f":"Allmembers[[#This Row],[Number]]","v":216},{"$f":"TRIM(Allmembers[[#This Row],[N1]])&\" \"&TRIM(Allmembers[[#This Row],[N2]])","v":"Paul Hermsen"},216,"Paul","Hermsen","Male","MS",null,88,"MV80"]
[null,{"$f":"Allmembers[[#This Row],[Number]]","v":219},{"$f":"TRIM(Allmembers[[#This Row],[N1]])&\" \"&TRIM(Allmembers[[#This Row],[N2]])","v":"Lisa Long"},219,"Lisa","Long","Female","FV35",null,89,"MV80"]
[null,{"$f":"Allmembers[[#This Row],[Number]]","v":220},{"$f":"TRIM(Allmembers[[#This Row],[N1]])&\" \"&TRIM(Allmembers[[#This Row],[N2]])","v":"Henry Brewster"},220,"Henry","Brewster","Male","M",null,90]
[null,{"$f":"Allmembers[[#This Row],[Number]]","v":222},{"$f":"TRIM(Allmembers[[#This Row],[N1]])&\" \"&TRIM(Allmembers[[#This Row],[N2]])","v":"Paul Goodwin"},222,"Paul","Goodwin","Male","MS",null,91]
[null,{"$f":"Allmembers[[#This Row],[Number]]","v":223},{"$f":"TRIM(Allmembers[[#This Row],[N1]])&\" \"&TRIM(Allmembers[[#This Row],[N2]])","v":"Steve Bowran"},223,"Steve","Bowran","Male","MV40",null,92]
[null,{"$f":"Allmembers[[#This Row],[Number]]","v":225},{"$f":"TRIM(Allmembers[[#This Row],[N1]])&\" \"&TRIM(Allmembers[[#This Row],[N2]])","v":"Jennifer Cunniff"},225,"Jennifer","Cunniff","Female","FS",null,93]
[null,{"$f":"Allmembers[[#This Row],[Number]]","v":227},{"$f":"TRIM(Allmembers[[#This Row],[N1]])&\" \"&TRIM(Allmembers[[#This Row],[N2]])","v":"Chris Cottle"},227,"Chris","Cottle","Male","MS",null,94]
[null,{"$f":"Allmembers[[#This Row],[Number]]","v":228},{"$f":"TRIM(Allmembers[[#This Row],[N1]])&\" \"&TRIM(Allmembers[[#This Row],[N2]])","v":"Vicki Moran"},228,"Vicki","Moran","Female","FS",null,95]
[null,{"$f":"Allmembers[[#This Row],[Number]]","v":230},{"$f":"TRIM(Allmembers[[#This Row],[N1]])&\" \"&TRIM(Allmembers[[#This Row],[N2]])","v":"Dee Bretnall"},230,"Dee","Bretnall","Female","FV35",null,96]
[null,{"$f":"Allmembers[[#This Row],[Number]]","v":231},{"$f":"TRIM(Allmembers[[#This Row],[N1]])&\" \"&TRIM(Allmembers[[#This Row],[N2]])","v":"Edward Rhodes"},231,"Edward","Rhodes","Male","MV40",null,97]
[null,{"$f":"Allmembers[[#This Row],[Number]]","v":232},{"$f":"TRIM(Allmembers[[#This Row],[N1]])&\" \"&TRIM(Allmembers[[#This Row],[N2]])","v":"Philippa O'Donovan"},232,"Philippa","O'Donovan","Female","FS",null,98]
[null,{"$f":"Allmembers[[#This Row],[Number]]","v":233},{"$f":"TRIM(Allmembers[[#This Row],[N1]])&\" \"&TRIM(Allmembers[[#This Row],[N2]])","v":"Pierre-Louis Gatti"},233,"Pierre-Louis","Gatti","Male","MS",null,99]
[null,{"$f":"Allmembers[[#This Row],[Number]]","v":234},{"$f":"TRIM(Allmembers[[#This Row],[N1]])&\" \"&TRIM(Allmembers[[#This Row],[N2]])","v":"Catriona Davis"},234,"Catriona","Davis","Female","FV35",null,100]
[null,{"$f":"Allmembers[[#This Row],[Number]]","v":236},{"$f":"TRIM(Allmembers[[#This Row],[N1]])&\" \"&TRIM(Allmembers[[#This Row],[N2]])","v":"Adrian James"},236,"Adrian","James","Male","MV40"]
[null,{"$f":"Allmembers[[#This Row],[Number]]","v":237},{"$f":"TRIM(Allmembers[[#This Row],[N1]])&\" \"&TRIM(Allmembers[[#This Row],[N2]])","v":"Andrew Hazley-Payne"},237,"Andrew","Hazley-Payne","Male","MV40"]
[null,{"$f":"Allmembers[[#This Row],[Number]]","v":238},{"$f":"TRIM(Allmembers[[#This Row],[N1]])&\" \"&TRIM(Allmembers[[#This Row],[N2]])","v":"Chitra Dunn"},238,"Chitra","Dunn","Male","MV50"]
[null,{"$f":"Allmembers[[#This Row],[Number]]","v":239},{"$f":"TRIM(Allmembers[[#This Row],[N1]])&\" \"&TRIM(Allmembers[[#This Row],[N2]])","v":"Andy Jordan"},239,"Andy","Jordan","Male","MV50"]
[null,{"$f":"Allmembers[[#This Row],[Number]]","v":240},{"$f":"TRIM(Allmembers[[#This Row],[N1]])&\" \"&TRIM(Allmembers[[#This Row],[N2]])","v":"Jamie Davies"},240,"Jamie","Davies","Male","MS"]
[null,{"$f":"Allmembers[[#This Row],[Number]]","v":241},{"$f":"TRIM(Allmembers[[#This Row],[N1]])&\" \"&TRIM(Allmembers[[#This Row],[N2]])","v":"Declan Sweeney"},241,"Declan","Sweeney","Male","MS"]
[null,{"$f":"Allmembers[[#This Row],[Number]]","v":242},{"$f":"TRIM(Allmembers[[#This Row],[N1]])&\" \"&TRIM(Allmembers[[#This Row],[N2]])","v":"Lorna Townsend"},242,"Lorna","Townsend","Female","F"]
[null,{"$f":"Allmembers[[#This Row],[Number]]","v":243},{"$f":"TRIM(Allmembers[[#This Row],[N1]])&\" \"&TRIM(Allmembers[[#This Row],[N2]])","v":"Julian Jones"},243,"Julian","Jones","Male","MV40"]
[null,{"$f":"Allmembers[[#This Row],[Number]]","v":245},{"$f":"TRIM(Allmembers[[#This Row],[N1]])&\" \"&TRIM(Allmembers[[#This Row],[N2]])","v":"Maddie Starks"},245,"Maddie","Starks","Female","F"]
[null,{"$f":"Allmembers[[#This Row],[Number]]","v":246},{"$f":"TRIM(Allmembers[[#This Row],[N1]])&\" \"&TRIM(Allmembers[[#This Row],[N2]])","v":"Jon Carr"},246,"Jon","Carr","Male","MV50"]
[null,{"$f":"Allmembers[[#This Row],[Number]]","v":248},{"$f":"TRIM(Allmembers[[#This Row],[N1]])&\" \"&TRIM(Allmembers[[#This Row],[N2]])","v":"Fiona Price"},248,"Fiona","Price","Female","FV35"]
[null,{"$f":"Allmembers[[#This Row],[Number]]","v":249},{"$f":"TRIM(Allmembers[[#This Row],[N1]])&\" \"&TRIM(Allmembers[[#This Row],[N2]])","v":"Theresa Kammel"},249,"Theresa","Kammel","Female","F"]
[null,{"$f":"Allmembers[[#This Row],[Number]]","v":250},{"$f":"TRIM(Allmembers[[#This Row],[N1]])&\" \"&TRIM(Allmembers[[#This Row],[N2]])","v":"Alexandra O'Donovan"},250,"Alexandra","O'Donovan","Female","FS"]
[null,{"$f":"Allmembers[[#This Row],[Number]]","v":251},{"$f":"TRIM(Allmembers[[#This Row],[N1]])&\" \"&TRIM(Allmembers[[#This Row],[N2]])","v":"Tom Adams"},251,"Tom","Adams","Male","MS"]
[null,{"$f":"Allmembers[[#This Row],[Number]]","v":252},{"$f":"TRIM(Allmembers[[#This Row],[N1]])&\" \"&TRIM(Allmembers[[#This Row],[N2]])","v":"John Mercer"},252,"John","Mercer","Male","MV50"]
[null,{"$f":"Allmembers[[#This Row],[Number]]","v":253},{"$f":"TRIM(Allmembers[[#This Row],[N1]])&\" \"&TRIM(Allmembers[[#This Row],[N2]])","v":"Carl Batchelder"},253,"Carl","Batchelder","Male","M"]
[null,{"$f":"Allmembers[[#This Row],[Number]]","v":254},{"$f":"TRIM(Allmembers[[#This Row],[N1]])&\" \"&TRIM(Allmembers[[#This Row],[N2]])","v":"Georgia Dench"},254,"Georgia","Dench","Female","FV35"]
[null,{"$f":"Allmembers[[#This Row],[Number]]","v":255},{"$f":"TRIM(Allmembers[[#This Row],[N1]])&\" \"&TRIM(Allmembers[[#This Row],[N2]])","v":"Richard Saunders"},255,"Richard","Saunders","Male","MV40"]
[null,{"$f":"Allmembers[[#This Row],[Number]]","v":256},{"$f":"TRIM(Allmembers[[#This Row],[N1]])&\" \"&TRIM(Allmembers[[#This Row],[N2]])","v":"Alison Cole"},256,"Alison","Cole","Female","FV35"]
[null,{"$f":"Allmembers[[#This Row],[Number]]","v":257},{"$f":"TRIM(Allmembers[[#This Row],[N1]])&\" \"&TRIM(Allmembers[[#This Row],[N2]])","v":"Sarah Chilvers"},257,"Sarah","Chilvers","Female","FV55"]
[null,{"$f":"Allmembers[[#This Row],[Number]]","v":258},{"$f":"TRIM(Allmembers[[#This Row],[N1]])&\" \"&TRIM(Allmembers[[#This Row],[N2]])","v":"Robert Goldhawk"},258,"Robert","Goldhawk","Male","MV40"]
[null,{"$f":"Allmembers[[#This Row],[Number]]","v":259},{"$f":"TRIM(Allmembers[[#This Row],[N1]])&\" \"&TRIM(Allmembers[[#This Row],[N2]])","v":"Alex Butterworth"},259,"Alex","Butterworth","Male","MV40"]
[null,{"$f":"Allmembers[[#This Row],[Number]]","v":260},{"$f":"TRIM(Allmembers[[#This Row],[N1]])&\" \"&TRIM(Allmembers[[#This Row],[N2]])","v":"Ben Sweeting"},260,"Ben","Sweeting","Male","MS"]
[null,{"$f":"Allmembers[[#This Row],[Number]]","v":261},{"$f":"TRIM(Allmembers[[#This Row],[N1]])&\" \"&TRIM(Allmembers[[#This Row],[N2]])","v":"Tammy Clarkson"},261,"Tammy","Clarkson","Female","FV35"]
[null,{"$f":"Allmembers[[#This Row],[Number]]","v":262},{"$f":"TRIM(Allmembers[[#This Row],[N1]])&\" \"&TRIM(Allmembers[[#This Row],[N2]])","v":"Gordon Alexander"},262,"Gordon","Alexander","Male","MV40"]
[null,{"$f":"Allmembers[[#This Row],[Number]]","v":263},{"$f":"TRIM(Allmembers[[#This Row],[N1]])&\" \"&TRIM(Allmembers[[#This Row],[N2]])","v":"Jason W Smith"},263,"Jason W","Smith","Male","MV40"]
[null,{"$f":"Allmembers[[#This Row],[Number]]","v":264},{"$f":"TRIM(Allmembers[[#This Row],[N1]])&\" \"&TRIM(Allmembers[[#This Row],[N2]])","v":"Derek Lambert"},264,"Derek","Lambert","Male","MV50"]
[null,{"$f":"Allmembers[[#This Row],[Number]]","v":265},{"$f":"TRIM(Allmembers[[#This Row],[N1]])&\" \"&TRIM(Allmembers[[#This Row],[N2]])","v":"Maria Niembro"},265,"Maria","Niembro","Female","FS"]
[null,{"$f":"Allmembers[[#This Row],[Number]]","v":266},{"$f":"TRIM(Allmembers[[#This Row],[N1]])&\" \"&TRIM(Allmembers[[#This Row],[N2]])","v":"Ellen Colebrook"},266,"Ellen","Colebrook","Female","FS"]
[null,{"$f":"Allmembers[[#This Row],[Number]]","v":267},{"$f":"TRIM(Allmembers[[#This Row],[N1]])&\" \"&TRIM(Allmembers[[#This Row],[N2]])","v":"Joanne Curtis"},267,"Joanne","Curtis","Female","FV35"]
[null,{"$f":"Allmembers[[#This Row],[Number]]","v":268},{"$f":"TRIM(Allmembers[[#This Row],[N1]])&\" \"&TRIM(Allmembers[[#This Row],[N2]])","v":"Kay Greenway"},268,"Kay","Greenway","Female","FV45"]
[null,{"$f":"Allmembers[[#This Row],[Number]]","v":269},{"$f":"TRIM(Allmembers[[#This Row],[N1]])&\" \"&TRIM(Allmembers[[#This Row],[N2]])","v":"Patrick McGuinness"},269,"Patrick","McGuinness","Male","MV40"]
[null,{"$f":"Allmembers[[#This Row],[Number]]","v":270},{"$f":"TRIM(Allmembers[[#This Row],[N1]])&\" \"&TRIM(Allmembers[[#This Row],[N2]])","v":"Christine Esson"},270,"Christine","Esson","Female","FV45"]
[null,{"$f":"Allmembers[[#This Row],[Number]]","v":271},{"$f":"TRIM(Allmembers[[#This Row],[N1]])&\" \"&TRIM(Allmembers[[#This Row],[N2]])","v":"Victoria Blythe"},271,"Victoria","Blythe","Female","FS"]
[null,{"$f":"Allmembers[[#This Row],[Number]]","v":272},{"$f":"TRIM(Allmembers[[#This Row],[N1]])&\" \"&TRIM(Allmembers[[#This Row],[N2]])","v":"Lily Chong"},272,"Lily","Chong","Female","FS"]
[null,{"$f":"Allmembers[[#This Row],[Number]]","v":273},{"$f":"TRIM(Allmembers[[#This Row],[N1]])&\" \"&TRIM(Allmembers[[#This Row],[N2]])","v":"Jon Stagg"},273,"Jon","Stagg","Male","MS"]
[null,{"$f":"Allmembers[[#This Row],[Number]]","v":274},{"$f":"TRIM(Allmembers[[#This Row],[N1]])&\" \"&TRIM(Allmembers[[#This Row],[N2]])","v":"Clare Cutler"},274,"Clare","Cutler","Female","FV35"]
[null,{"$f":"Allmembers[[#This Row],[Number]]","v":275},{"$f":"TRIM(Allmembers[[#This Row],[N1]])&\" \"&TRIM(Allmembers[[#This Row],[N2]])","v":"Victoria Johns"},275,"Victoria","Johns","Female","FS"]
[null,{"$f":"Allmembers[[#This Row],[Number]]","v":276},{"$f":"TRIM(Allmembers[[#This Row],[N1]])&\" \"&TRIM(Allmembers[[#This Row],[N2]])","v":"Darren Screen"},276,"Darren","Screen","Male","MV40"]
[null,{"$f":"Allmembers[[#This Row],[Number]]","v":277},{"$f":"TRIM(Allmembers[[#This Row],[N1]])&\" \"&TRIM(Allmembers[[#This Row],[N2]])","v":"Jonathan Rennison"},277,"Jonathan","Rennison","Male","MV40"]
[null,{"$f":"Allmembers[[#This Row],[Number]]","v":278},{"$f":"TRIM(Allmembers[[#This Row],[N1]])&\" \"&TRIM(Allmembers[[#This Row],[N2]])","v":"Olivia Hessey"},278,"Olivia","Hessey","Female","F"]
[null,{"$f":"Allmembers[[#This Row],[Number]]","v":279},{"$f":"TRIM(Allmembers[[#This Row],[N1]])&\" \"&TRIM(Allmembers[[#This Row],[N2]])","v":"Jonathan Budge"},279,"Jonathan","Budge","Male","MS"]
[null,{"$f":"Allmembers[[#This Row],[Number]]","v":280},{"$f":"TRIM(Allmembers[[#This Row],[N1]])&\" \"&TRIM(Allmembers[[#This Row],[N2]])","v":"Thomas Hallam"},280,"Thomas","Hallam","Male","MS"]
[null,{"$f":"Allmembers[[#This Row],[Number]]","v":281},{"$f":"TRIM(Allmembers[[#This Row],[N1]])&\" \"&TRIM(Allmembers[[#This Row],[N2]])","v":"Katie Fox"},281,"Katie","Fox","Female","FS"]
[null,{"$f":"Allmembers[[#This Row],[Number]]","v":282},{"$f":"TRIM(Allmembers[[#This Row],[N1]])&\" \"&TRIM(Allmembers[[#This Row],[N2]])","v":"Helen MacFarlane"},282,"Helen","MacFarlane","Female","FV35"]
[null,{"$f":"Allmembers[[#This Row],[Number]]","v":283},{"$f":"TRIM(Allmembers[[#This Row],[N1]])&\" \"&TRIM(Allmembers[[#This Row],[N2]])","v":"Richard Moreton"},283,"Richard","Moreton","Male","MV40"]
[null,{"$f":"Allmembers[[#This Row],[Number]]","v":284},{"$f":"TRIM(Allmembers[[#This Row],[N1]])&\" \"&TRIM(Allmembers[[#This Row],[N2]])","v":"Iona Aitken"},284,"Iona","Aitken","Female","FV35"]
[null,{"$f":"Allmembers[[#This Row],[Number]]","v":285},{"$f":"TRIM(Allmembers[[#This Row],[N1]])&\" \"&TRIM(Allmembers[[#This Row],[N2]])","v":"Philip Wigg"},285,"Philip","Wigg","Male","MS"]
[null,{"$f":"Allmembers[[#This Row],[Number]]","v":286},{"$f":"TRIM(Allmembers[[#This Row],[N1]])&\" \"&TRIM(Allmembers[[#This Row],[N2]])","v":"Jim Robinson"},286,"Jim","Robinson","Male","MV40"]
[null,{"$f":"Allmembers[[#This Row],[Number]]","v":287},{"$f":"TRIM(Allmembers[[#This Row],[N1]])&\" \"&TRIM(Allmembers[[#This Row],[N2]])","v":"Paul Hill"},287,"Paul","Hill","Male","MV40"]
[null,{"$f":"Allmembers[[#This Row],[Number]]","v":288},{"$f":"TRIM(Allmembers[[#This Row],[N1]])&\" \"&TRIM(Allmembers[[#This Row],[N2]])","v":"Theo Green"},288,"Theo","Green","Male","M"]
[null,{"$f":"Allmembers[[#This Row],[Number]]","v":289},{"$f":"TRIM(Allmembers[[#This Row],[N1]])&\" \"&TRIM(Allmembers[[#This Row],[N2]])","v":"Gordon Ray"},289,"Gordon","Ray","Male","MS"]
[null,{"$f":"Allmembers[[#This Row],[Number]]","v":290},{"$f":"TRIM(Allmembers[[#This Row],[N1]])&\" \"&TRIM(Allmembers[[#This Row],[N2]])","v":"David Salmon"},290,"David","Salmon","Male","MV50"]
[null,{"$f":"Allmembers[[#This Row],[Number]]","v":291},{"$f":"TRIM(Allmembers[[#This Row],[N1]])&\" \"&TRIM(Allmembers[[#This Row],[N2]])","v":"Iain O'Kane"},291,"Iain","O'Kane","Male","MS"]
[null,{"$f":"Allmembers[[#This Row],[Number]]","v":292},{"$f":"TRIM(Allmembers[[#This Row],[N1]])&\" \"&TRIM(Allmembers[[#This Row],[N2]])","v":"Justin Busby"},292,"Justin","Busby","Male","MS"]
[null,{"$f":"Allmembers[[#This Row],[Number]]","v":293},{"$f":"TRIM(Allmembers[[#This Row],[N1]])&\" \"&TRIM(Allmembers[[#This Row],[N2]])","v":"Tom Flett"},293,"Tom","Flett","Male","MV70"]
[null,{"$f":"Allmembers[[#This Row],[Number]]","v":294},{"$f":"TRIM(Allmembers[[#This Row],[N1]])&\" \"&TRIM(Allmembers[[#This Row],[N2]])","v":"James Chasen"},294,"James","Chasen","Male","MS"]
[null,{"$f":"Allmembers[[#This Row],[Number]]","v":295},{"$f":"TRIM(Allmembers[[#This Row],[N1]])&\" \"&TRIM(Allmembers[[#This Row],[N2]])","v":"Colette Gissane"},295,"Colette","Gissane","Female","FS"]
[null,{"$f":"Allmembers[[#This Row],[Number]]","v":296},{"$f":"TRIM(Allmembers[[#This Row],[N1]])&\" \"&TRIM(Allmembers[[#This Row],[N2]])","v":"Oswald Kawache"},296,"Oswald","Kawache","Male","M"]
[null,{"$f":"Allmembers[[#This Row],[Number]]","v":297},{"$f":"TRIM(Allmembers[[#This Row],[N1]])&\" \"&TRIM(Allmembers[[#This Row],[N2]])","v":"Charlotte Walsh"},297,"Charlotte","Walsh","Female","FS"]
[null,{"$f":"Allmembers[[#This Row],[Number]]","v":298},{"$f":"TRIM(Allmembers[[#This Row],[N1]])&\" \"&TRIM(Allmembers[[#This Row],[N2]])","v":"Dan Winfield"},298,"Dan","Winfield","Male","MV40"]
[null,{"$f":"Allmembers[[#This Row],[Number]]","v":300},{"$f":"TRIM(Allmembers[[#This Row],[N1]])&\" \"&TRIM(Allmembers[[#This Row],[N2]])","v":"Ravi Chandarana"},300,"Ravi","Chandarana","Male","M"]
[null,{"$f":"Allmembers[[#This Row],[Number]]","v":301},{"$f":"TRIM(Allmembers[[#This Row],[N1]])&\" \"&TRIM(Allmembers[[#This Row],[N2]])","v":"Martin Leach"},301,"Martin","Leach","Male","MV40"]
[null,{"$f":"Allmembers[[#This Row],[Number]]","v":302},{"$f":"TRIM(Allmembers[[#This Row],[N1]])&\" \"&TRIM(Allmembers[[#This Row],[N2]])","v":"Iain Tucker"},302,"Iain","Tucker","Male","MS"]
[null,{"$f":"Allmembers[[#This Row],[Number]]","v":303},{"$f":"TRIM(Allmembers[[#This Row],[N1]])&\" \"&TRIM(Allmembers[[#This Row],[N2]])","v":"Ross Gissane"},303,"Ross","Gissane","Male","MS"]
[null,{"$f":"Allmembers[[#This Row],[Number]]","v":304},{"$f":"TRIM(Allmembers[[#This Row],[N1]])&\" \"&TRIM(Allmembers[[#This Row],[N2]])","v":"Debbi James"},304,"Debbi","James","Female","FS"]
[null,{"$f":"Allmembers[[#This Row],[Number]]","v":305},{"$f":"TRIM(Allmembers[[#This Row],[N1]])&\" \"&TRIM(Allmembers[[#This Row],[N2]])","v":"Julie-Anne Moors"},305,"Julie-Anne","Moors","Female","FV45"]
[null,{"$f":"Allmembers[[#This Row],[Number]]","v":306},{"$f":"TRIM(Allmembers[[#This Row],[N1]])&\" \"&TRIM(Allmembers[[#This Row],[N2]])","v":"Kate Kitchener"},306,"Kate","Kitchener","Female","FV55"]
[null,{"$f":"Allmembers[[#This Row],[Number]]","v":307},{"$f":"TRIM(Allmembers[[#This Row],[N1]])&\" \"&TRIM(Allmembers[[#This Row],[N2]])","v":"Janice Nisbit"},307,"Janice","Nisbit","Female","FV55"]
[null,{"$f":"Allmembers[[#This Row],[Number]]","v":308},{"$f":"TRIM(Allmembers[[#This Row],[N1]])&\" \"&TRIM(Allmembers[[#This Row],[N2]])","v":"Sally Griffith"},308,"Sally","Griffith","Female","FV35"]
[null,{"$f":"Allmembers[[#This Row],[Number]]","v":309},{"$f":"TRIM(Allmembers[[#This Row],[N1]])&\" \"&TRIM(Allmembers[[#This Row],[N2]])","v":"Robin Harris"},309,"Robin","Harris","Male","MV40"]
[null,{"$f":"Allmembers[[#This Row],[Number]]","v":310},{"$f":"TRIM(Allmembers[[#This Row],[N1]])&\" \"&TRIM(Allmembers[[#This Row],[N2]])","v":"Ken Murray"},310,"Ken","Murray","Male","MV40"]
[null,{"$f":"Allmembers[[#This Row],[Number]]","v":311},{"$f":"TRIM(Allmembers[[#This Row],[N1]])&\" \"&TRIM(Allmembers[[#This Row],[N2]])","v":"Ammon Piepgrass"},311,"Ammon","Piepgrass","Male","MS"]
[null,{"$f":"Allmembers[[#This Row],[Number]]","v":312},{"$f":"TRIM(Allmembers[[#This Row],[N1]])&\" \"&TRIM(Allmembers[[#This Row],[N2]])","v":"Tracey Devine"},312,"Tracey","Devine","Female","FV35"]
[null,{"$f":"Allmembers[[#This Row],[Number]]","v":313},{"$f":"TRIM(Allmembers[[#This Row],[N1]])&\" \"&TRIM(Allmembers[[#This Row],[N2]])","v":"Jordan Thomas"},313,"Jordan","Thomas","Male","M"]
[null,{"$f":"Allmembers[[#This Row],[Number]]","v":314},{"$f":"TRIM(Allmembers[[#This Row],[N1]])&\" \"&TRIM(Allmembers[[#This Row],[N2]])","v":"Katherine Cerris-Harris"},314,"Katherine","Cerris-Harris","Female","FV35"]
[null,{"$f":"Allmembers[[#This Row],[Number]]","v":315},{"$f":"TRIM(Allmembers[[#This Row],[N1]])&\" \"&TRIM(Allmembers[[#This Row],[N2]])","v":"Warrick Raath"},315,"Warrick","Raath","Male","MS"]
[null,{"$f":"Allmembers[[#This Row],[Number]]","v":316},{"$f":"TRIM(Allmembers[[#This Row],[N1]])&\" \"&TRIM(Allmembers[[#This Row],[N2]])","v":"Riana Walsh"},316,"Riana","Walsh","Female","FV35"]
[null,{"$f":"Allmembers[[#This Row],[Number]]","v":317},{"$f":"TRIM(Allmembers[[#This Row],[N1]])&\" \"&TRIM(Allmembers[[#This Row],[N2]])","v":"Tanya Bruce"},317,"Tanya","Bruce","Female","FV35"]
[null,{"$f":"Allmembers[[#This Row],[Number]]","v":318},{"$f":"TRIM(Allmembers[[#This Row],[N1]])&\" \"&TRIM(Allmembers[[#This Row],[N2]])","v":"Annabel Taylor"},318,"Annabel","Taylor","Female","FV35"]
[null,{"$f":"Allmembers[[#This Row],[Number]]","v":319},{"$f":"TRIM(Allmembers[[#This Row],[N1]])&\" \"&TRIM(Allmembers[[#This Row],[N2]])","v":"Laura Hicks"},319,"Laura","Hicks","Female","F"]
[null,{"$f":"Allmembers[[#This Row],[Number]]","v":320},{"$f":"TRIM(Allmembers[[#This Row],[N1]])&\" \"&TRIM(Allmembers[[#This Row],[N2]])","v":"Beverley Gosling"},320,"Beverley","Gosling","Female","FV45"]
[null,null,"Total",{"$f":"SUBTOTAL(103,Allmembers[Number])","v":165}]

{"sheet":"Upcoming events","index":12,"n_rows":3,"n_cols":7,"rows_kept":3,"cut":false,"hidden":false,"merged":[]}
["League qualifying events - dates for your diary"]
[]
[null,"Date","Name","Type","Distance","League ","Location"]

{"sheet":"5 Mile Results","index":13,"n_rows":4,"n_cols":4,"rows_kept":4,"cut":false,"hidden":false,"merged":[]}
[]
[]
[]
["Name","Age","Total Points","17th Nov Watford Autumn challenge  "]

{"sheet":"Sheet1","index":14,"n_rows":34,"n_cols":21,"rows_kept":34,"cut":false,"hidden":false,"merged":[]}
[]
[null,"ps","n1","n2","Club","Cat","T1","Gender","Fname","Mem","Position","M time","F Time","Mt Secs","ft secs",null,"Position","M time","F Time","Mt Secs","ft secs"]
[null,300,"Georgie","Hamilton","Harpenden Arrows","W65","43:34",{"$f":"VLOOKUP(Sheet1!$J3,Allmembers[],6,0)","v":"Female"},{"$f":"TRIM(C3&\" \"&D3)","v":"Georgie Hamilton"},{"$f":"VLOOKUP(Sheet1!$I3,members,2,0)","v":12},{"$f":"Sheet1!$B3","v":300},{"$f":"IF(Sheet1!$H3=\"Male\",Hatime(Sheet1!$G3),\"\")","v":""},{"$f":"IF(Sheet1!$H3=\"FeMale\",Hatime(Sheet1!$G3),\"\")","v":"00:43:34"},{"$f":"IF(Sheet1!$H3=\"Male\",HOUR(Sheet1!$L3)*3600+MINUTE(Sheet1!$L3)*60+SECOND(Sheet1!$L3),\"\")","v":""},{"$f":"IF(Sheet1!$H3=\"feMale\",HOUR(Sheet1!$M3)*3600+MINUTE(Sheet1!$M3)*60+SECOND(Sheet1!$M3),\"\")","v":2614},null,300,"","00:43:34","",2614]
[null,41,"Darren","McGrath","Harpenden Arrows","M40","31:59",{"$f":"VLOOKUP(Sheet1!$J4,Allmembers[],6,0)","v":"Male"},"Darren McGrath",{"$f":"VLOOKUP(Sheet1!$I4,members,2,0)","v":28},{"$f":"Sheet1!$B4","v":41},{"$f":"IF(Sheet1!$H4=\"Male\",Hatime(Sheet1!$G4),\"\")","v":"00:31:59"},{"$f":"IF(Sheet1!$H4=\"FeMale\",Hatime(Sheet1!$G4),\"\")","v":""},{"$f":"IF(Sheet1!$H4=\"Male\",HOUR(Sheet1!$L4)*3600+MINUTE(Sheet1!$L4)*60+SECOND(Sheet1!$L4),\"\")","v":1919},{"$f":"IF(Sheet1!$H4=\"feMale\",HOUR(Sheet1!$M4)*3600+MINUTE(Sheet1!$M4)*60+SECOND(Sheet1!$M4),\"\")","v":""},null,41,"00:31:59","",1919,""]
[null,204,"Graham","Harper","Harpenden Arrows","M50","39:45",{"$f":"VLOOKUP(Sheet1!$J5,Allmembers[],6,0)","v":"Male"},"Graham Harper",{"$f":"VLOOKUP(Sheet1!$I5,members,2,0)","v":39},{"$f":"Sheet1!$B5","v":204},{"$f":"IF(Sheet1!$H5=\"Male\",Hatime(Sheet1!$G5),\"\")","v":"00:39:45"},{"$f":"IF(Sheet1!$H5=\"FeMale\",Hatime(Sheet1!$G5),\"\")","v":""},{"$f":"IF(Sheet1!$H5=\"Male\",HOUR(Sheet1!$L5)*3600+MINUTE(Sheet1!$L5)*60+SECOND(Sheet1!$L5),\"\")","v":2385},{"$f":"IF(Sheet1!$H5=\"feMale\",HOUR(Sheet1!$M5)*3600+MINUTE(Sheet1!$M5)*60+SECOND(Sheet1!$M5),\"\")","v":""},null,204,"00:39:45","",2385,""]
[null,21,"Simon","Speirs","Harpenden Arrows","M40","30:35",{"$f":"VLOOKUP(Sheet1!$J6,Allmembers[],6,0)","v":"Male"},"Simon Speirs",{"$f":"VLOOKUP(Sheet1!$I6,members,2,0)","v":53},{"$f":"Sheet1!$B6","v":21},{"$f":"IF(Sheet1!$H6=\"Male\",Hatime(Sheet1!$G6),\"\")","v":"00:30:35"},{"$f":"IF(Sheet1!$H6=\"FeMale\",Hatime(Sheet1!$G6),\"\")","v":""},{"$f":"IF(Sheet1!$H6=\"Male\",HOUR(Sheet1!$L6)*3600+MINUTE(Sheet1!$L6)*60+SECOND(Sheet1!$L6),\"\")","v":1835},{"$f":"IF(Sheet1!$H6=\"feMale\",HOUR(Sheet1!$M6)*3600+MINUTE(Sheet1!$M6)*60+SECOND(Sheet1!$M6),\"\")","v":""},null,21,"00:30:35","",1835,""]
[null,62,"Hannah","Turner","Harpenden Arrows","W35","32:57",{"$f":"VLOOKUP(Sheet1!$J7,Allmembers[],6,0)","v":"Female"},"Hannah Turner",{"$f":"VLOOKUP(Sheet1!$I7,members,2,0)","v":54},{"$f":"Sheet1!$B7","v":62},{"$f":"IF(Sheet1!$H7=\"Male\",Hatime(Sheet1!$G7),\"\")","v":""},{"$f":"IF(Sheet1!$H7=\"FeMale\",Hatime(Sheet1!$G7),\"\")","v":"00:32:57"},{"$f":"IF(Sheet1!$H7=\"Male\",HOUR(Sheet1!$L7)*3600+MINUTE(Sheet1!$L7)*60+SECOND(Sheet1!$L7),\"\")","v":""},{"$f":"IF(Sheet1!$H7=\"feMale\",HOUR(Sheet1!$M7)*3600+MINUTE(Sheet1!$M7)*60+SECOND(Sheet1!$M7),\"\")","v":1977},null,62,"","00:32:57","",1977]
[null,31,"David","Green","Harpenden Arrows","M50","31:13",{"$f":"VLOOKUP(Sheet1!$J8,Allmembers[],6,0)","v":"Male"},"David Green",{"$f":"VLOOKUP(Sheet1!$I8,members,2,0)","v":73},{"$f":"Sheet1!$B8","v":31},{"$f":"IF(Sheet1!$H8=\"Male\",Hatime(Sheet1!$G8),\"\")","v":"00:31:13"},{"$f":"IF(Sheet1!$H8=\"FeMale\",Hatime(Sheet1!$G8),\"\")","v":""},{"$f":"IF(Sheet1!$H8=\"Male\",HOUR(Sheet1!$L8)*3600+MINUTE(Sheet1!$L8)*60+SECOND(Sheet1!$L8),\"\")","v":1873},{"$f":"IF(Sheet1!$H8=\"feMale\",HOUR(Sheet1!$M8)*3600+MINUTE(Sheet1!$M8)*60+SECOND(Sheet1!$M8),\"\")","v":""},null,31,"00:31:13","",1873,""]
[null,165,"Sarah","Dumbrill","Harpenden Arrows","W35","37:41",{"$f":"VLOOKUP(Sheet1!$J9,Allmembers[],6,0)","v":"Female"},"Sarah Dumbrill",{"$f":"VLOOKUP(Sheet1!$I9,members,2,0)","v":77},{"$f":"Sheet1!$B9","v":165},{"$f":"IF(Sheet1!$H9=\"Male\",Hatime(Sheet1!$G9),\"\")","v":""},{"$f":"IF(Sheet1!$H9=\"FeMale\",Hatime(Sheet1!$G9),\"\")","v":"00:37:41"},{"$f":"IF(Sheet1!$H9=\"Male\",HOUR(Sheet1!$L9)*3600+MINUTE(Sheet1!$L9)*60+SECOND(Sheet1!$L9),\"\")","v":""},{"$f":"IF(Sheet1!$H9=\"feMale\",HOUR(Sheet1!$M9)*3600+MINUTE(Sheet1!$M9)*60+SECOND(Sheet1!$M9),\"\")","v":2261},null,165,"","00:37:41","",2261]
[null,143,"Jennifer","Finlay","Harpenden Arrows","W35","36:54",{"$f":"VLOOKUP(Sheet1!$J10,Allmembers[],6,0)","v":"Female"},"Jennifer Finlay",{"$f":"VLOOKUP(Sheet1!$I10,members,2,0)","v":97},{"$f":"Sheet1!$B10","v":143},{"$f":"IF(Sheet1!$H10=\"Male\",Hatime(Sheet1!$G10),\"\")","v":""},{"$f":"IF(Sheet1!$H10=\"FeMale\",Hatime(Sheet1!$G10),\"\")","v":"00:36:54"},{"$f":"IF(Sheet1!$H10=\"Male\",HOUR(Sheet1!$L10)*3600+MINUTE(Sheet1!$L10)*60+SECOND(Sheet1!$L10),\"\")","v":""},{"$f":"IF(Sheet1!$H10=\"feMale\",HOUR(Sheet1!$M10)*3600+MINUTE(Sheet1!$M10)*60+SECOND(Sheet1!$M10),\"\")","v":2214},null,143,"","00:36:54","",2214]
[null,18,"Tim","Mauchline","Harpenden Arrows","SM","30:05",{"$f":"VLOOKUP(Sheet1!$J11,Allmembers[],6,0)","v":"Male"},"Tim Mauchline",{"$f":"VLOOKUP(Sheet1!$I11,members,2,0)","v":103},{"$f":"Sheet1!$B11","v":18},{"$f":"IF(Sheet1!$H11=\"Male\",Hatime(Sheet1!$G11),\"\")","v":"00:30:05"},{"$f":"IF(Sheet1!$H11=\"FeMale\",Hatime(Sheet1!$G11),\"\")","v":""},{"$f":"IF(Sheet1!$H11=\"Male\",HOUR(Sheet1!$L11)*3600+MINUTE(Sheet1!$L11)*60+SECOND(Sheet1!$L11),\"\")","v":1805},{"$f":"IF(Sheet1!$H11=\"feMale\",HOUR(Sheet1!$M11)*3600+MINUTE(Sheet1!$M11)*60+SECOND(Sheet1!$M11),\"\")","v":""},null,18,"00:30:05","",1805,""]
[null,75,"Elliott","Lamb","Harpenden Arrows","M50","33:42",{"$f":"VLOOKUP(Sheet1!$J12,Allmembers[],6,0)","v":"Male"},"Elliott Lamb",{"$f":"VLOOKUP(Sheet1!$I12,members,2,0)","v":110},{"$f":"Sheet1!$B12","v":75},{"$f":"IF(Sheet1!$H12=\"Male\",Hatime(Sheet1!$G12),\"\")","v":"00:33:42"},{"$f":"IF(Sheet1!$H12=\"FeMale\",Hatime(Sheet1!$G12),\"\")","v":""},{"$f":"IF(Sheet1!$H12=\"Male\",HOUR(Sheet1!$L12)*3600+MINUTE(Sheet1!$L12)*60+SECOND(Sheet1!$L12),\"\")","v":2022},{"$f":"IF(Sheet1!$H12=\"feMale\",HOUR(Sheet1!$M12)*3600+MINUTE(Sheet1!$M12)*60+SECOND(Sheet1!$M12),\"\")","v":""},null,75,"00:33:42","",2022,""]
[null,231,"Louise","Crosby","Harpenden Arrows","W45","41:05",{"$f":"VLOOKUP(Sheet1!$J13,Allmembers[],6,0)","v":"Female"},"Louise Crosby",{"$f":"VLOOKUP(Sheet1!$I13,members,2,0)","v":119},{"$f":"Sheet1!$B13","v":231},{"$f":"IF(Sheet1!$H13=\"Male\",Hatime(Sheet1!$G13),\"\")","v":""},{"$f":"IF(Sheet1!$H13=\"FeMale\",Hatime(Sheet1!$G13),\"\")","v":"00:41:05"},{"$f":"IF(Sheet1!$H13=\"Male\",HOUR(Sheet1!$L13)*3600+MINUTE(Sheet1!$L13)*60+SECOND(Sheet1!$L13),\"\")","v":""},{"$f":"IF(Sheet1!$H13=\"feMale\",HOUR(Sheet1!$M13)*3600+MINUTE(Sheet1!$M13)*60+SECOND(Sheet1!$M13),\"\")","v":2465},null,231,"","00:41:05","",2465]
[null,326,"Brian","Yates","Harpenden Arrows","M60","50:29",{"$f":"VLOOKUP(Sheet1!$J14,Allmembers[],6,0)","v":"Male"},"Brian Yates",{"$f":"VLOOKUP(Sheet1!$I14,members,2,0)","v":120},{"$f":"Sheet1!$B14","v":326},{"$f":"IF(Sheet1!$H14=\"Male\",Hatime(Sheet1!$G14),\"\")","v":"00:50:29"},{"$f":"IF(Sheet1!$H14=\"FeMale\",Hatime(Sheet1!$G14),\"\")","v":""},{"$f":"IF(Sheet1!$H14=\"Male\",HOUR(Sheet1!$L14)*3600+MINUTE(Sheet1!$L14)*60+SECOND(Sheet1!$L14),\"\")","v":3029},{"$f":"IF(Sheet1!$H14=\"feMale\",HOUR(Sheet1!$M14)*3600+MINUTE(Sheet1!$M14)*60+SECOND(Sheet1!$M14),\"\")","v":""},null,326,"00:50:29","",3029,""]
[null,77,"Richard ","Johnstone","Harpenden Arrows","M40","33:46",{"$f":"VLOOKUP(Sheet1!$J15,Allmembers[],6,0)","v":"Male"},"Richard Johnstone",{"$f":"VLOOKUP(Sheet1!$I15,members,2,0)","v":122},{"$f":"Sheet1!$B15","v":77},{"$f":"IF(Sheet1!$H15=\"Male\",Hatime(Sheet1!$G15),\"\")","v":"00:33:46"},{"$f":"IF(Sheet1!$H15=\"FeMale\",Hatime(Sheet1!$G15),\"\")","v":""},{"$f":"IF(Sheet1!$H15=\"Male\",HOUR(Sheet1!$L15)*3600+MINUTE(Sheet1!$L15)*60+SECOND(Sheet1!$L15),\"\")","v":2026},{"$f":"IF(Sheet1!$H15=\"feMale\",HOUR(Sheet1!$M15)*3600+MINUTE(Sheet1!$M15)*60+SECOND(Sheet1!$M15),\"\")","v":""},null,77,"00:33:46","",2026,""]
[null,190,"Emily","Hooper","Harpenden Arrows","W35","38:30",{"$f":"VLOOKUP(Sheet1!$J16,Allmembers[],6,0)","v":"Female"},"Emily Hooper",{"$f":"VLOOKUP(Sheet1!$I16,members,2,0)","v":138},{"$f":"Sheet1!$B16","v":190},{"$f":"IF(Sheet1!$H16=\"Male\",Hatime(Sheet1!$G16),\"\")","v":""},{"$f":"IF(Sheet1!$H16=\"FeMale\",Hatime(Sheet1!$G16),\"\")","v":"00:38:30"},{"$f":"IF(Sheet1!$H16=\"Male\",HOUR(Sheet1!$L16)*3600+MINUTE(Sheet1!$L16)*60+SECOND(Sheet1!$L16),\"\")","v":""},{"$f":"IF(Sheet1!$H16=\"feMale\",HOUR(Sheet1!$M16)*3600+MINUTE(Sheet1!$M16)*60+SECOND(Sheet1!$M16),\"\")","v":2310},null,190,"","00:38:30","",2310]
[null,185,"Dawn","Burr","Harpenden Arrows","W35","38:22",{"$f":"VLOOKUP(Sheet1!$J17,Allmembers[],6,0)","v":"Female"},"Dawn Burr",{"$f":"VLOOKUP(Sheet1!$I17,members,2,0)","v":140},{"$f":"Sheet1!$B17","v":185},{"$f":"IF(Sheet1!$H17=\"Male\",Hatime(Sheet1!$G17),\"\")","v":""},{"$f":"IF(Sheet1!$H17=\"FeMale\",Hatime(Sheet1!$G17),\"\")","v":"00:38:22"},{"$f":"IF(Sheet1!$H17=\"Male\",HOUR(Sheet1!$L17)*3600+MINUTE(Sheet1!$L17)*60+SECOND(Sheet1!$L17),\"\")","v":""},{"$f":"IF(Sheet1!$H17=\"feMale\",HOUR(Sheet1!$M17)*3600+MINUTE(Sheet1!$M17)*60+SECOND(Sheet1!$M17),\"\")","v":2302},null,185,"","00:38:22","",2302]
[null,118,"James","Bentall","Harpenden Arrows","M40","35:35",{"$f":"VLOOKUP(Sheet1!$J18,Allmembers[],6,0)","v":"Male"},"James Bentall",{"$f":"VLOOKUP(Sheet1!$I18,members,2,0)","v":141},{"$f":"Sheet1!$B18","v":118},{"$f":"IF(Sheet1!$H18=\"Male\",Hatime(Sheet1!$G18),\"\")","v":"00:35:35"},{"$f":"IF(Sheet1!$H18=\"FeMale\",Hatime(Sheet1!$G18),\"\")","v":""},{"$f":"IF(Sheet1!$H18=\"Male\",HOUR(Sheet1!$L18)*3600+MINUTE(Sheet1!$L18)*60+SECOND(Sheet1!$L18),\"\")","v":2135},{"$f":"IF(Sheet1!$H18=\"feMale\",HOUR(Sheet1!$M18)*3600+MINUTE(Sheet1!$M18)*60+SECOND(Sheet1!$M18),\"\")","v":""},null,118,"00:35:35","",2135,""]
[null,262,"Joanne","Richards","Harpenden Arrows","W35","43:11",{"$f":"VLOOKUP(Sheet1!$J19,Allmembers[],6,0)","v":"Female"},"Joanne Richards",{"$f":"VLOOKUP(Sheet1!$I19,members,2,0)","v":149},{"$f":"Sheet1!$B19","v":262},{"$f":"IF(Sheet1!$H19=\"Male\",Hatime(Sheet1!$G19),\"\")","v":""},{"$f":"IF(Sheet1!$H19=\"FeMale\",Hatime(Sheet1!$G19),\"\")","v":"00:43:11"},{"$f":"IF(Sheet1!$H19=\"Male\",HOUR(Sheet1!$L19)*3600+MINUTE(Sheet1!$L19)*60+SECOND(Sheet1!$L19),\"\")","v":""},{"$f":"IF(Sheet1!$H19=\"feMale\",HOUR(Sheet1!$M19)*3600+MINUTE(Sheet1!$M19)*60+SECOND(Sheet1!$M19),\"\")","v":2591},null,262,"","00:43:11","",2591]
[null,119,"Paul","Savage","Harpenden Arrows","M40","35:36",{"$f":"VLOOKUP(Sheet1!$J20,Allmembers[],6,0)","v":"Male"},"Paul Savage",{"$f":"VLOOKUP(Sheet1!$I20,members,2,0)","v":192},{"$f":"Sheet1!$B20","v":119},{"$f":"IF(Sheet1!$H20=\"Male\",Hatime(Sheet1!$G20),\"\")","v":"00:35:36"},{"$f":"IF(Sheet1!$H20=\"FeMale\",Hatime(Sheet1!$G20),\"\")","v":""},{"$f":"IF(Sheet1!$H20=\"Male\",HOUR(Sheet1!$L20)*3600+MINUTE(Sheet1!$L20)*60+SECOND(Sheet1!$L20),\"\")","v":2136},{"$f":"IF(Sheet1!$H20=\"feMale\",HOUR(Sheet1!$M20)*3600+MINUTE(Sheet1!$M20)*60+SECOND(Sheet1!$M20),\"\")","v":""},null,119,"00:35:36","",2136,""]
[null,64,"Andrew","Cripps","Harpenden Arrows","M40","33:02",{"$f":"VLOOKUP(Sheet1!$J21,Allmembers[],6,0)","v":"Male"},"Andrew Cripps",{"$f":"VLOOKUP(Sheet1!$I21,members,2,0)","v":212},{"$f":"Sheet1!$B21","v":64},{"$f":"IF(Sheet1!$H21=\"Male\",Hatime(Sheet1!$G21),\"\")","v":"00:33:02"},{"$f":"IF(Sheet1!$H21=\"FeMale\",Hatime(Sheet1!$G21),\"\")","v":""},{"$f":"IF(Sheet1!$H21=\"Male\",HOUR(Sheet1!$L21)*3600+MINUTE(Sheet1!$L21)*60+SECOND(Sheet1!$L21),\"\")","v":1982},{"$f":"IF(Sheet1!$H21=\"feMale\",HOUR(Sheet1!$M21)*3600+MINUTE(Sheet1!$M21)*60+SECOND(Sheet1!$M21),\"\")","v":""},null,64,"00:33:02","",1982,""]
[null,37,"Steve","Bowran","Harpenden Arrows","M40","31:40",{"$f":"VLOOKUP(Sheet1!$J22,Allmembers[],6,0)","v":"Male"},"Steve Bowran",{"$f":"VLOOKUP(Sheet1!$I22,members,2,0)","v":223},{"$f":"Sheet1!$B22","v":37},{"$f":"IF(Sheet1!$H22=\"Male\",Hatime(Sheet1!$G22),\"\")","v":"00:31:40"},{"$f":"IF(Sheet1!$H22=\"FeMale\",Hatime(Sheet1!$G22),\"\")","v":""},{"$f":"IF(Sheet1!$H22=\"Male\",HOUR(Sheet1!$L22)*3600+MINUTE(Sheet1!$L22)*60+SECOND(Sheet1!$L22),\"\")","v":1900},{"$f":"IF(Sheet1!$H22=\"feMale\",HOUR(Sheet1!$M22)*3600+MINUTE(Sheet1!$M22)*60+SECOND(Sheet1!$M22),\"\")","v":""},null,37,"00:31:40","",1900,""]
[null,266,"Philippa","O'Donovan","Harpenden Arrows","SW","43:22",{"$f":"VLOOKUP(Sheet1!$J23,Allmembers[],6,0)","v":"Female"},"Philippa O'Donovan",{"$f":"VLOOKUP(Sheet1!$I23,members,2,0)","v":232},{"$f":"Sheet1!$B23","v":266},{"$f":"IF(Sheet1!$H23=\"Male\",Hatime(Sheet1!$G23),\"\")","v":""},{"$f":"IF(Sheet1!$H23=\"FeMale\",Hatime(Sheet1!$G23),\"\")","v":"00:43:22"},{"$f":"IF(Sheet1!$H23=\"Male\",HOUR(Sheet1!$L23)*3600+MINUTE(Sheet1!$L23)*60+SECOND(Sheet1!$L23),\"\")","v":""},{"$f":"IF(Sheet1!$H23=\"feMale\",HOUR(Sheet1!$M23)*3600+MINUTE(Sheet1!$M23)*60+SECOND(Sheet1!$M23),\"\")","v":2602},null,266,"","00:43:22","",2602]
[null,40,"Adrian","James","Harpenden Arrows","M40","31:58",{"$f":"VLOOKUP(Sheet1!$J24,Allmembers[],6,0)","v":"Male"},"Adrian James",{"$f":"VLOOKUP(Sheet1!$I24,members,2,0)","v":236},{"$f":"Sheet1!$B24","v":40},{"$f":"IF(Sheet1!$H24=\"Male\",Hatime(Sheet1!$G24),\"\")","v":"00:31:58"},{"$f":"IF(Sheet1!$H24=\"FeMale\",Hatime(Sheet1!$G24),\"\")","v":""},{"$f":"IF(Sheet1!$H24=\"Male\",HOUR(Sheet1!$L24)*3600+MINUTE(Sheet1!$L24)*60+SECOND(Sheet1!$L24),\"\")","v":1918},{"$f":"IF(Sheet1!$H24=\"feMale\",HOUR(Sheet1!$M24)*3600+MINUTE(Sheet1!$M24)*60+SECOND(Sheet1!$M24),\"\")","v":""},null,40,"00:31:58","",1918,""]
[null,53,"Andy","Jordan","Harpenden Arrows","M50","32:17",{"$f":"VLOOKUP(Sheet1!$J25,Allmembers[],6,0)","v":"Male"},"Andy Jordan",{"$f":"VLOOKUP(Sheet1!$I25,members,2,0)","v":239},{"$f":"Sheet1!$B25","v":53},{"$f":"IF(Sheet1!$H25=\"Male\",Hatime(Sheet1!$G25),\"\")","v":"00:32:17"},{"$f":"IF(Sheet1!$H25=\"FeMale\",Hatime(Sheet1!$G25),\"\")","v":""},{"$f":"IF(Sheet1!$H25=\"Male\",HOUR(Sheet1!$L25)*3600+MINUTE(Sheet1!$L25)*60+SECOND(Sheet1!$L25),\"\")","v":1937},{"$f":"IF(Sheet1!$H25=\"feMale\",HOUR(Sheet1!$M25)*3600+MINUTE(Sheet1!$M25)*60+SECOND(Sheet1!$M25),\"\")","v":""},null,53,"00:32:17","",1937,""]
[null,264,"Jamie","Davies","Harpenden Arrows","SM","43:14",{"$f":"VLOOKUP(Sheet1!$J26,Allmembers[],6,0)","v":"Male"},"Jamie Davies",{"$f":"VLOOKUP(Sheet1!$I26,members,2,0)","v":240},{"$f":"Sheet1!$B26","v":264},{"$f":"IF(Sheet1!$H26=\"Male\",Hatime(Sheet1!$G26),\"\")","v":"00:43:14"},{"$f":"IF(Sheet1!$H26=\"FeMale\",Hatime(Sheet1!$G26),\"\")","v":""},{"$f":"IF(Sheet1!$H26=\"Male\",HOUR(Sheet1!$L26)*3600+MINUTE(Sheet1!$L26)*60+SECOND(Sheet1!$L26),\"\")","v":2594},{"$f":"IF(Sheet1!$H26=\"feMale\",HOUR(Sheet1!$M26)*3600+MINUTE(Sheet1!$M26)*60+SECOND(Sheet1!$M26),\"\")","v":""},null,264,"00:43:14","",2594,""]
[null,216,"Sarah","Chilvers","Harpenden Arrows","W55","40:10",{"$f":"VLOOKUP(Sheet1!$J27,Allmembers[],6,0)","v":"Female"},"Sarah Chilvers",{"$f":"VLOOKUP(Sheet1!$I27,members,2,0)","v":257},{"$f":"Sheet1!$B27","v":216},{"$f":"IF(Sheet1!$H27=\"Male\",Hatime(Sheet1!$G27),\"\")","v":""},{"$f":"IF(Sheet1!$H27=\"FeMale\",Hatime(Sheet1!$G27),\"\")","v":"00:40:10"},{"$f":"IF(Sheet1!$H27=\"Male\",HOUR(Sheet1!$L27)*3600+MINUTE(Sheet1!$L27)*60+SECOND(Sheet1!$L27),\"\")","v":""},{"$f":"IF(Sheet1!$H27=\"feMale\",HOUR(Sheet1!$M27)*3600+MINUTE(Sheet1!$M27)*60+SECOND(Sheet1!$M27),\"\")","v":2410},null,216,"","00:40:10","",2410]
[null,60,"Gordon","Alexander","Harpenden Arrows","M40","32:52",{"$f":"VLOOKUP(Sheet1!$J28,Allmembers[],6,0)","v":"Male"},"Gordon Alexander",{"$f":"VLOOKUP(Sheet1!$I28,members,2,0)","v":262},{"$f":"Sheet1!$B28","v":60},{"$f":"IF(Sheet1!$H28=\"Male\",Hatime(Sheet1!$G28),\"\")","v":"00:32:52"},{"$f":"IF(Sheet1!$H28=\"FeMale\",Hatime(Sheet1!$G28),\"\")","v":""},{"$f":"IF(Sheet1!$H28=\"Male\",HOUR(Sheet1!$L28)*3600+MINUTE(Sheet1!$L28)*60+SECOND(Sheet1!$L28),\"\")","v":1972},{"$f":"IF(Sheet1!$H28=\"feMale\",HOUR(Sheet1!$M28)*3600+MINUTE(Sheet1!$M28)*60+SECOND(Sheet1!$M28),\"\")","v":""},null,60,"00:32:52","",1972,""]
[null,113,"Richard ","Moreton","Harpenden Arrows","M40","35:23",{"$f":"VLOOKUP(Sheet1!$J29,Allmembers[],6,0)","v":"Male"},"Richard Moreton",{"$f":"VLOOKUP(Sheet1!$I29,members,2,0)","v":283},{"$f":"Sheet1!$B29","v":113},{"$f":"IF(Sheet1!$H29=\"Male\",Hatime(Sheet1!$G29),\"\")","v":"00:35:23"},{"$f":"IF(Sheet1!$H29=\"FeMale\",Hatime(Sheet1!$G29),\"\")","v":""},{"$f":"IF(Sheet1!$H29=\"Male\",HOUR(Sheet1!$L29)*3600+MINUTE(Sheet1!$L29)*60+SECOND(Sheet1!$L29),\"\")","v":2123},{"$f":"IF(Sheet1!$H29=\"feMale\",HOUR(Sheet1!$M29)*3600+MINUTE(Sheet1!$M29)*60+SECOND(Sheet1!$M29),\"\")","v":""},null,113,"00:35:23","",2123,""]
[null,277,"Janice","Nisbit","Harpenden Arrows","W55","44:14",{"$f":"VLOOKUP(Sheet1!$J30,Allmembers[],6,0)","v":"Female"},"Janice Nisbit",{"$f":"VLOOKUP(Sheet1!$I30,members,2,0)","v":307},{"$f":"Sheet1!$B30","v":277},{"$f":"IF(Sheet1!$H30=\"Male\",Hatime(Sheet1!$G30),\"\")","v":""},{"$f":"IF(Sheet1!$H30=\"FeMale\",Hatime(Sheet1!$G30),\"\")","v":"00:44:14"},{"$f":"IF(Sheet1!$H30=\"Male\",HOUR(Sheet1!$L30)*3600+MINUTE(Sheet1!$L30)*60+SECOND(Sheet1!$L30),\"\")","v":""},{"$f":"IF(Sheet1!$H30=\"feMale\",HOUR(Sheet1!$M30)*3600+MINUTE(Sheet1!$M30)*60+SECOND(Sheet1!$M30),\"\")","v":2654},null,277,"","00:44:14","",2654]
[null,34,"Ammon","Piepgrass","Harpenden Arrows","SM","31:33",{"$f":"VLOOKUP(Sheet1!$J31,Allmembers[],6,0)","v":"Male"},"Ammon Piepgrass",{"$f":"VLOOKUP(Sheet1!$I31,members,2,0)","v":311},{"$f":"Sheet1!$B31","v":34},{"$f":"IF(Sheet1!$H31=\"Male\",Hatime(Sheet1!$G31),\"\")","v":"00:31:33"},{"$f":"IF(Sheet1!$H31=\"FeMale\",Hatime(Sheet1!$G31),\"\")","v":""},{"$f":"IF(Sheet1!$H31=\"Male\",HOUR(Sheet1!$L31)*3600+MINUTE(Sheet1!$L31)*60+SECOND(Sheet1!$L31),\"\")","v":1893},{"$f":"IF(Sheet1!$H31=\"feMale\",HOUR(Sheet1!$M31)*3600+MINUTE(Sheet1!$M31)*60+SECOND(Sheet1!$M31),\"\")","v":""},null,34,"00:31:33","",1893,""]
[null,181,"Katherine","Cerris-Harris","Harpenden Arrows","W35","38:15",{"$f":"VLOOKUP(Sheet1!$J32,Allmembers[],6,0)","v":"Female"},"Katherine Cerris-Harris",{"$f":"VLOOKUP(Sheet1!$I32,members,2,0)","v":314},{"$f":"Sheet1!$B32","v":181},{"$f":"IF(Sheet1!$H32=\"Male\",Hatime(Sheet1!$G32),\"\")","v":""},{"$f":"IF(Sheet1!$H32=\"FeMale\",Hatime(Sheet1!$G32),\"\")","v":"00:38:15"},{"$f":"IF(Sheet1!$H32=\"Male\",HOUR(Sheet1!$L32)*3600+MINUTE(Sheet1!$L32)*60+SECOND(Sheet1!$L32),\"\")","v":""},{"$f":"IF(Sheet1!$H32=\"feMale\",HOUR(Sheet1!$M32)*3600+MINUTE(Sheet1!$M32)*60+SECOND(Sheet1!$M32),\"\")","v":2295},null,181,"","00:38:15","",2295]
[null,212,"Riana","Walsh","Harpenden Arrows","W35","40:01",{"$f":"VLOOKUP(Sheet1!$J33,Allmembers[],6,0)","v":"Female"},"Riana Walsh",{"$f":"VLOOKUP(Sheet1!$I33,members,2,0)","v":316},{"$f":"Sheet1!$B33","v":212},{"$f":"IF(Sheet1!$H33=\"Male\",Hatime(Sheet1!$G33),\"\")","v":""},{"$f":"IF(Sheet1!$H33=\"FeMale\",Hatime(Sheet1!$G33),\"\")","v":"00:40:01"},{"$f":"IF(Sheet1!$H33=\"Male\",HOUR(Sheet1!$L33)*3600+MINUTE(Sheet1!$L33)*60+SECOND(Sheet1!$L33),\"\")","v":""},{"$f":"IF(Sheet1!$H33=\"feMale\",HOUR(Sheet1!$M33)*3600+MINUTE(Sheet1!$M33)*60+SECOND(Sheet1!$M33),\"\")","v":2401},null,212,"","00:40:01","",2401]
[null,"Total",null,null,null,null,null,null,null,{"$f":"SUBTOTAL(103,Sheet1!$J$3:$J$33)","v":31},null,null,null,null,{"$f":"SUBTOTAL(103,Sheet1!$O$3:$O$33)","v":31}]